Hospital Service Area,Hospital County,Operating Certificate Number,Permanent Facility Id,Facility Name,Age Group,Zip Code - 3 digits,Gender,Race,Ethnicity,Length of Stay,Type of Admission,Patient Disposition,Discharge Year,CCS Diagnosis Code,CCS Diagnosis Description,CCS Procedure Code,CCS Procedure Description,APR DRG Code,APR DRG Description,APR MDC Code,APR MDC Description,APR Severity of Illness Code,APR Severity of Illness Description,APR Risk of Mortality,APR Medical Surgical Description,Payment Typology 1,Payment Typology 2,Payment Typology 3,Birth Weight,Abortion Edit Indicator,Emergency Department Indicator,Total Charges,Total Costs
Long Island,Suffolk,5123000,000885,Brookhaven Memorial Hospital Medical Center Inc,70 or Older,117,F,White,Not Span/Hispanic,4,Emergency,Skilled Nursing Home,2017,238,Complications of surgical procedures or medical care,000,NO PROC,349,"Malfunction, reaction, complic of orthopedic device or procedure",08,Diseases and Disorders of the Musculoskeletal System and Conn Tissue,2,Moderate,Major,Medical,Medicare,Medicare,Blue Cross/Blue Shield,,N,Y,36865.78,5647.96
Long Island,Suffolk,5123000,000885,Brookhaven Memorial Hospital Medical Center Inc,70 or Older,117,F,White,Not Span/Hispanic,8,Emergency,Skilled Nursing Home,2017,237,Complication of device; implant or graft,222,BLOOD TRANSFUSION,349,"Malfunction, reaction, complic of orthopedic device or procedure",08,Diseases and Disorders of the Musculoskeletal System and Conn Tissue,3,Major,Major,Medical,Medicare,Medicare,Blue Cross/Blue Shield,,N,Y,61244.73,11573.64
Long Island,Suffolk,5123000,000885,Brookhaven Memorial Hospital Medical Center Inc,30 to 49,117,M,White,Not Span/Hispanic,9,Emergency,Home w/ Home Health Services,2017,238,Complications of surgical procedures or medical care,058,HEMODIALYSIS,349,"Malfunction, reaction, complic of orthopedic device or procedure",08,Diseases and Disorders of the Musculoskeletal System and Conn Tissue,3,Major,Moderate,Medical,Blue Cross/Blue Shield,,,,N,Y,62620.26,13535.90
Long Island,Suffolk,5123000,000885,Brookhaven Memorial Hospital Medical Center Inc,50 to 69,119,F,White,Not Span/Hispanic,4,Emergency,Short-term Hospital,2017,237,Complication of device; implant or graft,054,OT VASC CATH; NOT HEART,349,"Malfunction, reaction, complic of orthopedic device or procedure",08,Diseases and Disorders of the Musculoskeletal System and Conn Tissue,3,Major,Moderate,Medical,Blue Cross/Blue Shield,,,,N,Y,31840.37,6524.42
Long Island,Suffolk,5123000,000885,Brookhaven Memorial Hospital Medical Center Inc,50 to 69,119,M,Other Race,Not Span/Hispanic,4,Emergency,Home w/ Home Health Services,2017,238,Complications of surgical procedures or medical care,000,NO PROC,349,"Malfunction, reaction, complic of orthopedic device or procedure",08,Diseases and Disorders of the Musculoskeletal System and Conn Tissue,3,Major,Major,Medical,Medicare,Medicare,Medicaid,,N,Y,31448.53,5747.19
Long Island,Suffolk,5123000,000885,Brookhaven Memorial Hospital Medical Center Inc,50 to 69,117,M,White,Not Span/Hispanic,6,Emergency,Skilled Nursing Home,2017,237,Complication of device; implant or graft,216,RESP INTUB/MECH VENTIL,349,"Malfunction, reaction, complic of orthopedic device or procedure",08,Diseases and Disorders of the Musculoskeletal System and Conn Tissue,3,Major,Major,Medical,Medicare,Medicare,Blue Cross/Blue Shield,,N,Y,46994.44,8497.36
Long Island,Suffolk,5123000,000885,Brookhaven Memorial Hospital Medical Center Inc,70 or Older,119,F,White,Not Span/Hispanic,4,Emergency,Skilled Nursing Home,2017,237,Complication of device; implant or graft,146,"TRTMNT,FRAC HIP/FEMUR",349,"Malfunction, reaction, complic of orthopedic device or procedure",08,Diseases and Disorders of the Musculoskeletal System and Conn Tissue,2,Moderate,Moderate,Medical,Medicare,Medicare,,,N,Y,47867.24,6415.10
Long Island,Suffolk,5123000,000885,Brookhaven Memorial Hospital Medical Center Inc,70 or Older,119,F,White,Not Span/Hispanic,2,Emergency,Short-term Hospital,2017,237,Complication of device; implant or graft,000,NO PROC,349,"Malfunction, reaction, complic of orthopedic device or procedure",08,Diseases and Disorders of the Musculoskeletal System and Conn Tissue,3,Major,Major,Medical,Medicare,Medicare,,,N,Y,23489.09,3454.68
Long Island,Suffolk,5123000,000885,Brookhaven Memorial Hospital Medical Center Inc,70 or Older,117,F,White,Not Span/Hispanic,4,Emergency,Skilled Nursing Home,2017,238,Complications of surgical procedures or medical care,000,NO PROC,349,"Malfunction, reaction, complic of orthopedic device or procedure",08,Diseases and Disorders of the Musculoskeletal System and Conn Tissue,2,Moderate,Major,Medical,Medicare,Medicare,Private Health Insurance,,N,Y,61000.90,7551.61
Long Island,Suffolk,5123000,000885,Brookhaven Memorial Hospital Medical Center Inc,70 or Older,117,F,White,Not Span/Hispanic,3,Emergency,Skilled Nursing Home,2017,238,Complications of surgical procedures or medical care,000,NO PROC,349,"Malfunction, reaction, complic of orthopedic device or procedure",08,Diseases and Disorders of the Musculoskeletal System and Conn Tissue,4,Extreme,Extreme,Medical,Medicare,Medicare,Blue Cross/Blue Shield,,N,Y,69673.57,6284.20
Long Island,Suffolk,5123000,000885,Brookhaven Memorial Hospital Medical Center Inc,30 to 49,119,F,White,Not Span/Hispanic,19,Emergency,Short-term Hospital,2017,237,Complication of device; implant or graft,231,OTHER THERAPEUTIC PRCS,349,"Malfunction, reaction, complic of orthopedic device or procedure",08,Diseases and Disorders of the Musculoskeletal System and Conn Tissue,4,Extreme,Major,Medical,Medicaid,,,,N,Y,118405.36,27106.44
Long Island,Suffolk,5123000,000885,Brookhaven Memorial Hospital Medical Center Inc,50 to 69,119,M,White,Not Span/Hispanic,15,Emergency,Skilled Nursing Home,2017,238,Complications of surgical procedures or medical care,190,ARTERIO FEMORAL/LOW ART,349,"Malfunction, reaction, complic of orthopedic device or procedure",08,Diseases and Disorders of the Musculoskeletal System and Conn Tissue,3,Major,Moderate,Medical,Medicare,Medicare,,,N,Y,104708.47,22023.48
Long Island,Suffolk,5123000,000885,Brookhaven Memorial Hospital Medical Center Inc,30 to 49,119,F,White,Not Span/Hispanic,4,Urgent,Home or Self Care,2017,237,Complication of device; implant or graft,000,NO PROC,349,"Malfunction, reaction, complic of orthopedic device or procedure",08,Diseases and Disorders of the Musculoskeletal System and Conn Tissue,2,Moderate,Minor,Medical,Medicaid,,,,N,N,23332.65,5217.01
