Hospital Service Area,Hospital County,Operating Certificate Number,Permanent Facility Id,Facility Name,Age Group,Zip Code - 3 digits,Gender,Race,Ethnicity,Length of Stay,Type of Admission,Patient Disposition,Discharge Year,CCS Diagnosis Code,CCS Diagnosis Description,CCS Procedure Code,CCS Procedure Description,APR DRG Code,APR DRG Description,APR MDC Code,APR MDC Description,APR Severity of Illness Code,APR Severity of Illness Description,APR Risk of Mortality,APR Medical Surgical Description,Payment Typology 1,Payment Typology 2,Payment Typology 3,Birth Weight,Abortion Edit Indicator,Emergency Department Indicator,Total Charges,Total Costs
New York City,Manhattan,7002053,001463,NYU Langone Hospitals,70 or Older,100,F,White,Not Span/Hispanic,1,Emergency,Home w/ Home Health Services,2020,INJ035,"COMPLICATION OF INTERNAL ORTHOPEDIC DEVICE OR IMPLANT, INITIAL ENCOUNTER",MST007,HIP ARTHROPLASTY,349,"MALFUNCTION, REACTION, COMPLIC OF ORTHOPEDIC DEVICE OR PROCEDURE",08,DISEASES AND DISORDERS OF THE MUSCULOSKELETAL SYSTEM AND CONNECTIVE TISSUE,1,Minor,Minor,Medical,Medicare,Medicare,,,,Y,31701.53,10018.57
New York City,Manhattan,7002053,001463,NYU Langone Hospitals,70 or Older,104,F,Black/African American,Not Span/Hispanic,1,Elective,Home or Self Care,2020,INJ035,"COMPLICATION OF INTERNAL ORTHOPEDIC DEVICE OR IMPLANT, INITIAL ENCOUNTER",,,349,"MALFUNCTION, REACTION, COMPLIC OF ORTHOPEDIC DEVICE OR PROCEDURE",08,DISEASES AND DISORDERS OF THE MUSCULOSKELETAL SYSTEM AND CONNECTIVE TISSUE,1,Minor,Minor,Medical,Medicaid,,,,,N,7403.28,3312.28
New York City,Manhattan,7002053,001463,NYU Langone Hospitals,70 or Older,100,F,White,Not Span/Hispanic,3,Emergency,Skilled Nursing Home,2020,INJ035,"COMPLICATION OF INTERNAL ORTHOPEDIC DEVICE OR IMPLANT, INITIAL ENCOUNTER",MST007,HIP ARTHROPLASTY,349,"MALFUNCTION, REACTION, COMPLIC OF ORTHOPEDIC DEVICE OR PROCEDURE",08,DISEASES AND DISORDERS OF THE MUSCULOSKELETAL SYSTEM AND CONNECTIVE TISSUE,1,Minor,Minor,Medical,Medicare,Medicare,,,,Y,50383.37,14948.29
New York City,Manhattan,7002053,001463,NYU Langone Hospitals,70 or Older,112,F,Black/African American,Not Span/Hispanic,5,Elective,Skilled Nursing Home,2020,INJ037,"COMPLICATION OF OTHER SURGICAL OR MEDICAL CARE, INJURY, INITIAL ENCOUNTER",MST020,SUBCUTANEOUS TISSUE AND FASCIA EXCISION,349,"MALFUNCTION, REACTION, COMPLIC OF ORTHOPEDIC DEVICE OR PROCEDURE",08,DISEASES AND DISORDERS OF THE MUSCULOSKELETAL SYSTEM AND CONNECTIVE TISSUE,2,Moderate,Minor,Medical,Medicare,Medicare,,,,N,88049.02,21708.04
New York City,Manhattan,7002053,001463,NYU Langone Hospitals,50 to 69,111,F,White,Not Span/Hispanic,6,Emergency,Skilled Nursing Home,2020,INJ005,"FRACTURE OF THE LOWER LIMB (EXCEPT HIP), INITIAL ENCOUNTER",,,349,"MALFUNCTION, REACTION, COMPLIC OF ORTHOPEDIC DEVICE OR PROCEDURE",08,DISEASES AND DISORDERS OF THE MUSCULOSKELETAL SYSTEM AND CONNECTIVE TISSUE,2,Moderate,Moderate,Medical,Medicare,,,,,Y,76889.44,23956.45
New York City,Manhattan,7002053,001463,NYU Langone Hospitals,70 or Older,100,F,Black/African American,Not Span/Hispanic,1,Emergency,Home w/ Home Health Services,2020,INJ035,"COMPLICATION OF INTERNAL ORTHOPEDIC DEVICE OR IMPLANT, INITIAL ENCOUNTER",MST015,CLOSED REDUCTION OF BONES AND JOINTS,349,"MALFUNCTION, REACTION, COMPLIC OF ORTHOPEDIC DEVICE OR PROCEDURE",08,DISEASES AND DISORDERS OF THE MUSCULOSKELETAL SYSTEM AND CONNECTIVE TISSUE,3,Major,Moderate,Medical,Medicare,,,,,Y,52781.86,17413.5
New York City,Manhattan,7002053,001463,NYU Langone Hospitals,50 to 69,112,M,Black/African American,Not Span/Hispanic,2,Emergency,Left Against Medical Advice,2020,INJ037,"COMPLICATION OF OTHER SURGICAL OR MEDICAL CARE, INJURY, INITIAL ENCOUNTER",,,349,"MALFUNCTION, REACTION, COMPLIC OF ORTHOPEDIC DEVICE OR PROCEDURE",08,DISEASES AND DISORDERS OF THE MUSCULOSKELETAL SYSTEM AND CONNECTIVE TISSUE,3,Major,Major,Medical,Medicaid,,,,,Y,64877.63,19366.51
New York City,Manhattan,7002053,001463,NYU Langone Hospitals,50 to 69,112,M,Black/African American,Not Span/Hispanic,1,Emergency,Left Against Medical Advice,2020,INJ037,"COMPLICATION OF OTHER SURGICAL OR MEDICAL CARE, INJURY, INITIAL ENCOUNTER",,,349,"MALFUNCTION, REACTION, COMPLIC OF ORTHOPEDIC DEVICE OR PROCEDURE",08,DISEASES AND DISORDERS OF THE MUSCULOSKELETAL SYSTEM AND CONNECTIVE TISSUE,3,Major,Major,Medical,Medicaid,,,,,Y,19729.7,5974.51
New York City,Manhattan,7002053,001463,NYU Langone Hospitals,30 to 49,112,M,Black/African American,Not Span/Hispanic,14,Emergency,Skilled Nursing Home,2020,INJ035,"COMPLICATION OF INTERNAL ORTHOPEDIC DEVICE OR IMPLANT, INITIAL ENCOUNTER",,,349,"MALFUNCTION, REACTION, COMPLIC OF ORTHOPEDIC DEVICE OR PROCEDURE",08,DISEASES AND DISORDERS OF THE MUSCULOSKELETAL SYSTEM AND CONNECTIVE TISSUE,3,Major,Extreme,Medical,Medicare,Medicaid,,,,Y,191519.68,69677.79
New York City,Manhattan,7002053,001463,NYU Langone Hospitals,70 or Older,112,F,White,Not Span/Hispanic,6,Emergency,Skilled Nursing Home,2020,INJ037,"COMPLICATION OF OTHER SURGICAL OR MEDICAL CARE, INJURY, INITIAL ENCOUNTER",CAR024,VENOUS AND ARTERIAL CATHETER PLACEMENT,349,"MALFUNCTION, REACTION, COMPLIC OF ORTHOPEDIC DEVICE OR PROCEDURE",08,DISEASES AND DISORDERS OF THE MUSCULOSKELETAL SYSTEM AND CONNECTIVE TISSUE,4,Extreme,Extreme,Medical,Medicare,,,,,Y,140879.22,39740.28
New York City,Manhattan,7002053,001463,NYU Langone Hospitals,50 to 69,100,F,White,Unknown,1,Emergency,Skilled Nursing Home,2020,INJ035,"COMPLICATION OF INTERNAL ORTHOPEDIC DEVICE OR IMPLANT, INITIAL ENCOUNTER",,,349,"MALFUNCTION, REACTION, COMPLIC OF ORTHOPEDIC DEVICE OR PROCEDURE",08,DISEASES AND DISORDERS OF THE MUSCULOSKELETAL SYSTEM AND CONNECTIVE TISSUE,1,Minor,Minor,Medical,Medicaid,,,,,Y,51090.34,15235.5
New York City,Manhattan,7002053,001463,NYU Langone Hospitals,50 to 69,113,M,White,Not Span/Hispanic,13,Emergency,Medicare Cert Long Term Care Hospital,2020,INJ035,"COMPLICATION OF INTERNAL ORTHOPEDIC DEVICE OR IMPLANT, INITIAL ENCOUNTER",OTR004,ISOLATION PROCEDURES,349,"MALFUNCTION, REACTION, COMPLIC OF ORTHOPEDIC DEVICE OR PROCEDURE",08,DISEASES AND DISORDERS OF THE MUSCULOSKELETAL SYSTEM AND CONNECTIVE TISSUE,3,Major,Moderate,Medical,Medicare,Medicare,,,,Y,216561.61,69098.1
New York City,Manhattan,7002053,001463,NYU Langone Hospitals,50 to 69,100,F,White,Not Span/Hispanic,7,Emergency,Skilled Nursing Home,2020,INJ035,"COMPLICATION OF INTERNAL ORTHOPEDIC DEVICE OR IMPLANT, INITIAL ENCOUNTER",,,349,"MALFUNCTION, REACTION, COMPLIC OF ORTHOPEDIC DEVICE OR PROCEDURE",08,DISEASES AND DISORDERS OF THE MUSCULOSKELETAL SYSTEM AND CONNECTIVE TISSUE,2,Moderate,Moderate,Medical,Medicaid,,,,,Y,133433.68,43641.97
New York City,Manhattan,7002053,001463,NYU Langone Hospitals,50 to 69,100,F,Black/African American,Not Span/Hispanic,2,Emergency,Home w/ Home Health Services,2020,INJ037,"COMPLICATION OF OTHER SURGICAL OR MEDICAL CARE, INJURY, INITIAL ENCOUNTER",,,349,"MALFUNCTION, REACTION, COMPLIC OF ORTHOPEDIC DEVICE OR PROCEDURE",08,DISEASES AND DISORDERS OF THE MUSCULOSKELETAL SYSTEM AND CONNECTIVE TISSUE,2,Moderate,Moderate,Medical,Medicare,,,,,Y,39314.56,11343.45
New York City,Manhattan,7002053,001463,NYU Langone Hospitals,70 or Older,OOS,F,White,Unknown,8,Emergency,Skilled Nursing Home,2020,INJ035,"COMPLICATION OF INTERNAL ORTHOPEDIC DEVICE OR IMPLANT, INITIAL ENCOUNTER",CNS002,LUMBAR PUNCTURE,349,"MALFUNCTION, REACTION, COMPLIC OF ORTHOPEDIC DEVICE OR PROCEDURE",08,DISEASES AND DISORDERS OF THE MUSCULOSKELETAL SYSTEM AND CONNECTIVE TISSUE,3,Major,Minor,Medical,Medicare,Private Health Insurance,,,,Y,190212.22,48368.72
New York City,Manhattan,7002053,001463,NYU Langone Hospitals,50 to 69,113,M,Black/African American,Not Span/Hispanic,2,Emergency,Home or Self Care,2020,INJ037,"COMPLICATION OF OTHER SURGICAL OR MEDICAL CARE, INJURY, INITIAL ENCOUNTER",,,349,"MALFUNCTION, REACTION, COMPLIC OF ORTHOPEDIC DEVICE OR PROCEDURE",08,DISEASES AND DISORDERS OF THE MUSCULOSKELETAL SYSTEM AND CONNECTIVE TISSUE,3,Major,Moderate,Medical,Medicare,Medicaid,,,,Y,43693.77,10889.77
New York City,Manhattan,7002053,001463,NYU Langone Hospitals,30 to 49,100,M,Black/African American,Not Span/Hispanic,3,Emergency,Left Against Medical Advice,2020,INJ037,"COMPLICATION OF OTHER SURGICAL OR MEDICAL CARE, INJURY, INITIAL ENCOUNTER",,,349,"MALFUNCTION, REACTION, COMPLIC OF ORTHOPEDIC DEVICE OR PROCEDURE",08,DISEASES AND DISORDERS OF THE MUSCULOSKELETAL SYSTEM AND CONNECTIVE TISSUE,2,Moderate,Moderate,Medical,Self-Pay,,,,,Y,70712.38,19539.11
New York City,Manhattan,7002053,001463,NYU Langone Hospitals,30 to 49,100,M,Black/African American,Not Span/Hispanic,4,Emergency,Left Against Medical Advice,2020,INJ037,"COMPLICATION OF OTHER SURGICAL OR MEDICAL CARE, INJURY, INITIAL ENCOUNTER",,,349,"MALFUNCTION, REACTION, COMPLIC OF ORTHOPEDIC DEVICE OR PROCEDURE",08,DISEASES AND DISORDERS OF THE MUSCULOSKELETAL SYSTEM AND CONNECTIVE TISSUE,3,Major,Moderate,Medical,Self-Pay,,,,,Y,61257.78,16534.85
New York City,Manhattan,7002053,001463,NYU Langone Hospitals,30 to 49,100,M,Multi-racial,Not Span/Hispanic,1,Emergency,Left Against Medical Advice,2020,INJ037,"COMPLICATION OF OTHER SURGICAL OR MEDICAL CARE, INJURY, INITIAL ENCOUNTER",,,349,"MALFUNCTION, REACTION, COMPLIC OF ORTHOPEDIC DEVICE OR PROCEDURE",08,DISEASES AND DISORDERS OF THE MUSCULOSKELETAL SYSTEM AND CONNECTIVE TISSUE,2,Moderate,Minor,Medical,Medicaid,,,,,Y,29427.88,9799.03
New York City,Manhattan,7002053,001463,NYU Langone Hospitals,30 to 49,100,M,Multi-racial,Not Span/Hispanic,4,Emergency,Left Against Medical Advice,2020,INJ037,"COMPLICATION OF OTHER SURGICAL OR MEDICAL CARE, INJURY, INITIAL ENCOUNTER",,,349,"MALFUNCTION, REACTION, COMPLIC OF ORTHOPEDIC DEVICE OR PROCEDURE",08,DISEASES AND DISORDERS OF THE MUSCULOSKELETAL SYSTEM AND CONNECTIVE TISSUE,3,Major,Minor,Medical,Medicaid,,,,,Y,64255.01,20016.18
New York City,Manhattan,7002053,001463,NYU Langone Hospitals,70 or Older,100,F,White,Not Span/Hispanic,1,Emergency,Skilled Nursing Home,2020,INJ035,"COMPLICATION OF INTERNAL ORTHOPEDIC DEVICE OR IMPLANT, INITIAL ENCOUNTER",MST007,HIP ARTHROPLASTY,349,"MALFUNCTION, REACTION, COMPLIC OF ORTHOPEDIC DEVICE OR PROCEDURE",08,DISEASES AND DISORDERS OF THE MUSCULOSKELETAL SYSTEM AND CONNECTIVE TISSUE,1,Minor,Minor,Medical,Medicare,Medicare,,,,Y,33511.07,9140.94
New York City,Manhattan,7002053,001463,NYU Langone Hospitals,30 to 49,100,M,Multi-racial,Not Span/Hispanic,1,Emergency,Left Against Medical Advice,2020,INJ037,"COMPLICATION OF OTHER SURGICAL OR MEDICAL CARE, INJURY, INITIAL ENCOUNTER",,,349,"MALFUNCTION, REACTION, COMPLIC OF ORTHOPEDIC DEVICE OR PROCEDURE",08,DISEASES AND DISORDERS OF THE MUSCULOSKELETAL SYSTEM AND CONNECTIVE TISSUE,2,Moderate,Moderate,Medical,Medicaid,,,,,Y,48956.67,8887.54
