Hospital Service Area,Hospital County,Operating Certificate Number,Permanent Facility Id,Facility Name,Age Group,Zip Code - 3 digits,Gender,Race,Ethnicity,Length of Stay,Type of Admission,Patient Disposition,Discharge Year,CCS Diagnosis Code,CCS Diagnosis Description,CCS Procedure Code,CCS Procedure Description,APR DRG Code,APR DRG Description,APR MDC Code,APR MDC Description,APR Severity of Illness Code,APR Severity of Illness Description,APR Risk of Mortality,APR Medical Surgical Description,Payment Typology 1,Payment Typology 2,Payment Typology 3,Birth Weight,Abortion Edit Indicator,Emergency Department Indicator,Total Charges,Total Costs
Hudson Valley,Dutchess,1302001,000181,Vassar Brothers Medical Center,70 or Older,126,F,Other Race,Not Span/Hispanic,3,Emergency,Skilled Nursing Home,2018,MUS026,MUSCLE DISORDERS,,,351,OTHER MUSCULOSKELETAL SYSTEM & CONNECTIVE TISSUE DIAGNOSES,08,DISEASES AND DISORDERS OF THE MUSCULOSKELETAL SYSTEM AND CONNECTIVE TISSUE,2,Moderate,Moderate,Medical,Medicare,Medicaid,,,,true,25078.73,6227.59
New York City,Queens,7003010,001637,New York - Presbyterian/Queens,50 to 69,114,M,White,Spanish/Hispanic,7,Emergency,Skilled Nursing Home,2018,MUS007,OTHER SPECIFIED JOINT DISORDERS,MST001,ARTHROCENTESIS,351,OTHER MUSCULOSKELETAL SYSTEM & CONNECTIVE TISSUE DIAGNOSES,08,DISEASES AND DISORDERS OF THE MUSCULOSKELETAL SYSTEM AND CONNECTIVE TISSUE,2,Moderate,Minor,Medical,Medicare,Medicaid,Self-Pay,,,true,62085.76,15961.9
New York City,Queens,7001024,001635,St Johns Episcopal Hospital So Shore,50 to 69,116,F,Other Race,Not Span/Hispanic,2,Emergency,Skilled Nursing Home,2018,INJ026,OTHER SPECIFIED INJURY,,,351,OTHER MUSCULOSKELETAL SYSTEM & CONNECTIVE TISSUE DIAGNOSES,08,DISEASES AND DISORDERS OF THE MUSCULOSKELETAL SYSTEM AND CONNECTIVE TISSUE,2,Moderate,Moderate,Medical,Medicare,Medicaid,,,,true,16239.58,4961.24
New York City,Queens,7003001,001628,Flushing Hospital Medical Center,70 or Older,113,M,White,Spanish/Hispanic,7,Emergency,Left Against Medical Advice,2018,MUS006,OSTEOARTHRITIS,MST001,ARTHROCENTESIS,351,OTHER MUSCULOSKELETAL SYSTEM & CONNECTIVE TISSUE DIAGNOSES,08,DISEASES AND DISORDERS OF THE MUSCULOSKELETAL SYSTEM AND CONNECTIVE TISSUE,2,Moderate,Minor,Medical,Medicaid,,,,,true,23198.91,14620.95
Finger Lakes,Wayne,5820000,001028,Newark-Wayne Community Hospital,50 to 69,145,M,White,Not Span/Hispanic,3,Emergency,Short-term Hospital,2018,NEO072,NEOPLASMS OF UNSPECIFIED NATURE OR UNCERTAIN BEHAVIOR,,,351,OTHER MUSCULOSKELETAL SYSTEM & CONNECTIVE TISSUE DIAGNOSES,08,DISEASES AND DISORDERS OF THE MUSCULOSKELETAL SYSTEM AND CONNECTIVE TISSUE,2,Moderate,Minor,Medical,Medicare,Medicaid,,,,true,16273.95,4005.42
New York City,Manhattan,7002054,001458,New York-Presbyterian Hospital - New York Weill Cornell Center,70 or Older,104,F,White,Not Span/Hispanic,6,Emergency,Skilled Nursing Home,2018,MUS034,CRYSTAL ARTHROPATHIES (EXCLUDING GOUT),,,351,OTHER MUSCULOSKELETAL SYSTEM & CONNECTIVE TISSUE DIAGNOSES,08,DISEASES AND DISORDERS OF THE MUSCULOSKELETAL SYSTEM AND CONNECTIVE TISSUE,3,Major,Major,Medical,Medicare,Medicaid,Self-Pay,,,true,64315.61,14906.76
Long Island,Suffolk,5155000,000938,Peconic Bay Medical Center,30 to 49,119,M,White,Spanish/Hispanic,3,Emergency,Home or Self Care,2018,MUS026,MUSCLE DISORDERS,,,351,OTHER MUSCULOSKELETAL SYSTEM & CONNECTIVE TISSUE DIAGNOSES,08,DISEASES AND DISORDERS OF THE MUSCULOSKELETAL SYSTEM AND CONNECTIVE TISSUE,3,Major,Moderate,Medical,Medicaid,,,,,true,35087.68,6880.51
Long Island,Nassau,2901000,000490,Glen Cove Hospital,70 or Older,115,F,Other Race,Spanish/Hispanic,2,Emergency,Home w/ Home Health Services,2018,MUS010,"MUSCULOSKELETAL PAIN, NOT LOW BACK PAIN",,,351,OTHER MUSCULOSKELETAL SYSTEM & CONNECTIVE TISSUE DIAGNOSES,08,DISEASES AND DISORDERS OF THE MUSCULOSKELETAL SYSTEM AND CONNECTIVE TISSUE,1,Minor,Moderate,Medical,Medicaid,Medicaid,,,,true,26833.55,4693.8
Western NY,Erie,1401013,000218,Sisters of Charity Hospital,18 to 29,,F,Other Race,Spanish/Hispanic,4,Emergency,Home or Self Care,2018,MUS026,MUSCLE DISORDERS,,,351,OTHER MUSCULOSKELETAL SYSTEM & CONNECTIVE TISSUE DIAGNOSES,08,DISEASES AND DISORDERS OF THE MUSCULOSKELETAL SYSTEM AND CONNECTIVE TISSUE,2,Moderate,Minor,Medical,Private Health Insurance,,,,,true,12777.59,5619.82
New York City,Bronx,7000008,001172,Lincoln Medical & Mental Health Center,70 or Older,104,M,Other Race,Not Span/Hispanic,1,Emergency,Home w/ Home Health Services,2018,MUS010,"MUSCULOSKELETAL PAIN, NOT LOW BACK PAIN",,,351,OTHER MUSCULOSKELETAL SYSTEM & CONNECTIVE TISSUE DIAGNOSES,08,DISEASES AND DISORDERS OF THE MUSCULOSKELETAL SYSTEM AND CONNECTIVE TISSUE,2,Moderate,Moderate,Medical,Medicare,Medicare,Medicaid,,,true,8463.38,4998.11
New York City,Queens,7003010,001637,New York - Presbyterian/Queens,70 or Older,113,M,White,Not Span/Hispanic,5,Emergency,Home or Self Care,2018,MUS026,MUSCLE DISORDERS,ADM017,ADMINISTRATION OF NUTRITIONAL AND ELECTROLYTIC SUBSTANCES,351,OTHER MUSCULOSKELETAL SYSTEM & CONNECTIVE TISSUE DIAGNOSES,08,DISEASES AND DISORDERS OF THE MUSCULOSKELETAL SYSTEM AND CONNECTIVE TISSUE,2,Moderate,Major,Medical,Medicare,Medicaid,Self-Pay,,,true,39925.6,10016.34
New York City,Queens,7003000,001626,Elmhurst Hospital Center,18 to 29,113,M,Other Race,Spanish/Hispanic,3,Emergency,Home or Self Care,2018,MUS026,MUSCLE DISORDERS,,,351,OTHER MUSCULOSKELETAL SYSTEM & CONNECTIVE TISSUE DIAGNOSES,08,DISEASES AND DISORDERS OF THE MUSCULOSKELETAL SYSTEM AND CONNECTIVE TISSUE,2,Moderate,Moderate,Medical,Medicaid,,,,,true,20961.25,12471.23
Southern Tier,Broome,0303001,000058,United Health Services Hospitals Inc. - Wilson Medical Center,70 or Older,138,M,White,Not Span/Hispanic,8,Emergency,Skilled Nursing Home,2018,INJ026,OTHER SPECIFIED INJURY,IMG005,MAGNETIC RESONANCE IMAGING (MRI),351,OTHER MUSCULOSKELETAL SYSTEM & CONNECTIVE TISSUE DIAGNOSES,08,DISEASES AND DISORDERS OF THE MUSCULOSKELETAL SYSTEM AND CONNECTIVE TISSUE,3,Major,Major,Medical,Medicare,Medicaid,Medicare,,,true,38828.9,14407.08
New York City,Queens,7003010,001637,New York - Presbyterian/Queens,70 or Older,113,F,Other Race,Not Span/Hispanic,3,Emergency,Home w/ Home Health Services,2018,MUS007,OTHER SPECIFIED JOINT DISORDERS,MST001,ARTHROCENTESIS,351,OTHER MUSCULOSKELETAL SYSTEM & CONNECTIVE TISSUE DIAGNOSES,08,DISEASES AND DISORDERS OF THE MUSCULOSKELETAL SYSTEM AND CONNECTIVE TISSUE,2,Moderate,Minor,Medical,Medicare,Medicare,Self-Pay,,,true,20789.91,5735.04
Hudson Valley,Westchester,5957001,001139,Westchester Medical Center,50 to 69,125,M,White,Not Span/Hispanic,12,Emergency,Home or Self Care,2018,MUS010,"MUSCULOSKELETAL PAIN, NOT LOW BACK PAIN",ADM014,REGIONAL ANESTHESIA,351,OTHER MUSCULOSKELETAL SYSTEM & CONNECTIVE TISSUE DIAGNOSES,08,DISEASES AND DISORDERS OF THE MUSCULOSKELETAL SYSTEM AND CONNECTIVE TISSUE,2,Moderate,Minor,Medical,Private Health Insurance,,,,,true,146108.54,27567.27
Long Island,Suffolk,5155000,000938,Peconic Bay Medical Center,50 to 69,119,M,White,Spanish/Hispanic,6,Emergency,Skilled Nursing Home,2018,MUS033,GOUT,MST001,ARTHROCENTESIS,351,OTHER MUSCULOSKELETAL SYSTEM & CONNECTIVE TISSUE DIAGNOSES,08,DISEASES AND DISORDERS OF THE MUSCULOSKELETAL SYSTEM AND CONNECTIVE TISSUE,2,Moderate,Moderate,Medical,Medicare,Private Health Insurance,,,,true,63934.43,12904.88
New York City,Manhattan,7002054,001464,New York-Presbyterian Hospital - Columbia Presbyterian Center,70 or Older,100,M,White,Spanish/Hispanic,3,Emergency,Home or Self Care,2018,MUS033,GOUT,,,351,OTHER MUSCULOSKELETAL SYSTEM & CONNECTIVE TISSUE DIAGNOSES,08,DISEASES AND DISORDERS OF THE MUSCULOSKELETAL SYSTEM AND CONNECTIVE TISSUE,2,Moderate,Moderate,Medical,Medicare,Medicare,Medicaid,,,false,35614.71,7601.3
Long Island,Nassau,2908000,000511,NYU Langone Hospital-Long Island,30 to 49,115,M,White,Not Span/Hispanic,3,Emergency,Home or Self Care,2018,INJ026,OTHER SPECIFIED INJURY,,,351,OTHER MUSCULOSKELETAL SYSTEM & CONNECTIVE TISSUE DIAGNOSES,08,DISEASES AND DISORDERS OF THE MUSCULOSKELETAL SYSTEM AND CONNECTIVE TISSUE,1,Minor,Minor,Medical,Private Health Insurance,,,,,true,40483.29,7470.84
New York City,Kings,7001035,001318,Wyckoff Heights Medical Center,70 or Older,112,F,Black/African American,Not Span/Hispanic,5,Emergency,Home or Self Care,2018,MUS033,GOUT,,,351,OTHER MUSCULOSKELETAL SYSTEM & CONNECTIVE TISSUE DIAGNOSES,08,DISEASES AND DISORDERS OF THE MUSCULOSKELETAL SYSTEM AND CONNECTIVE TISSUE,2,Moderate,Major,Medical,Medicare,Medicaid,,,,true,26073.86,11065.72
New York City,Bronx,7000001,001178,BronxCare Hospital Center,50 to 69,104,F,Black/African American,Not Span/Hispanic,7,Emergency,Home or Self Care,2018,MUS026,MUSCLE DISORDERS,,,351,OTHER MUSCULOSKELETAL SYSTEM & CONNECTIVE TISSUE DIAGNOSES,08,DISEASES AND DISORDERS OF THE MUSCULOSKELETAL SYSTEM AND CONNECTIVE TISSUE,2,Moderate,Minor,Medical,Private Health Insurance,Medicaid,Medicaid,,,true,24800.88,24576.1
New York City,Queens,7003010,001637,New York - Presbyterian/Queens,70 or Older,113,F,Other Race,Not Span/Hispanic,2,Emergency,Skilled Nursing Home,2018,INJ026,OTHER SPECIFIED INJURY,IMG008,ULTRASONOGRAPHY,351,OTHER MUSCULOSKELETAL SYSTEM & CONNECTIVE TISSUE DIAGNOSES,08,DISEASES AND DISORDERS OF THE MUSCULOSKELETAL SYSTEM AND CONNECTIVE TISSUE,2,Moderate,Major,Medical,Medicare,Medicare,Medicaid,,,true,20811.75,4860.49
Long Island,Suffolk,5154001,000925,Good Samaritan Hospital Medical Center,30 to 49,117,F,Black/African American,Not Span/Hispanic,5,Emergency,Home w/ Home Health Services,2018,MUS010,"MUSCULOSKELETAL PAIN, NOT LOW BACK PAIN",,,351,OTHER MUSCULOSKELETAL SYSTEM & CONNECTIVE TISSUE DIAGNOSES,08,DISEASES AND DISORDERS OF THE MUSCULOSKELETAL SYSTEM AND CONNECTIVE TISSUE,3,Major,Major,Medical,Medicaid,Medicaid,,,,true,43947,8418.03
Finger Lakes,Wayne,5820000,001028,Newark-Wayne Community Hospital,70 or Older,145,M,White,Not Span/Hispanic,5,Emergency,Home or Self Care,2018,MUS026,MUSCLE DISORDERS,,,351,OTHER MUSCULOSKELETAL SYSTEM & CONNECTIVE TISSUE DIAGNOSES,08,DISEASES AND DISORDERS OF THE MUSCULOSKELETAL SYSTEM AND CONNECTIVE TISSUE,2,Moderate,Moderate,Medical,Medicare,Private Health Insurance,,,,true,14668.59,3508.59
New York City,Manhattan,7002054,001458,New York-Presbyterian Hospital - New York Weill Cornell Center,50 to 69,113,M,White,Not Span/Hispanic,3,Emergency,Home or Self Care,2018,MUS026,MUSCLE DISORDERS,,,351,OTHER MUSCULOSKELETAL SYSTEM & CONNECTIVE TISSUE DIAGNOSES,08,DISEASES AND DISORDERS OF THE MUSCULOSKELETAL SYSTEM AND CONNECTIVE TISSUE,2,Moderate,Minor,Medical,Private Health Insurance,Self-Pay,,,,true,43852.97,9538.56
Long Island,Nassau,2951001,000541,North Shore University Hospital,70 or Older,113,F,White,Not Span/Hispanic,5,Emergency,Home w/ Home Health Services,2018,MUS010,"MUSCULOSKELETAL PAIN, NOT LOW BACK PAIN",,,351,OTHER MUSCULOSKELETAL SYSTEM & CONNECTIVE TISSUE DIAGNOSES,08,DISEASES AND DISORDERS OF THE MUSCULOSKELETAL SYSTEM AND CONNECTIVE TISSUE,3,Major,Major,Medical,Medicare,Medicare,Medicaid,,,true,56006.22,9367.17
Central NY,Onondaga,3301003,000630,St. Joseph's Hospital Health Center,70 or Older,130,M,Other Race,Not Span/Hispanic,11,Emergency,Skilled Nursing Home,2018,MUS010,"MUSCULOSKELETAL PAIN, NOT LOW BACK PAIN",MST001,ARTHROCENTESIS,351,OTHER MUSCULOSKELETAL SYSTEM & CONNECTIVE TISSUE DIAGNOSES,08,DISEASES AND DISORDERS OF THE MUSCULOSKELETAL SYSTEM AND CONNECTIVE TISSUE,1,Minor,Minor,Medical,Medicare,Blue Cross/Blue Shield,,,,true,30537.11,13109.21
Western NY,Erie,1401005,000210,Erie County Medical Center,70 or Older,142,M,White,Not Span/Hispanic,9,Emergency,Expired,2018,INJ026,OTHER SPECIFIED INJURY,,,351,OTHER MUSCULOSKELETAL SYSTEM & CONNECTIVE TISSUE DIAGNOSES,08,DISEASES AND DISORDERS OF THE MUSCULOSKELETAL SYSTEM AND CONNECTIVE TISSUE,4,Extreme,Extreme,Medical,Medicare,,,,,true,17073.05,12153.05
Capital/Adirond,Albany,0101004,000005,St. Peter's Hospital,50 to 69,121,M,White,Not Span/Hispanic,3,Emergency,Home or Self Care,2018,MUS007,OTHER SPECIFIED JOINT DISORDERS,MST001,ARTHROCENTESIS,351,OTHER MUSCULOSKELETAL SYSTEM & CONNECTIVE TISSUE DIAGNOSES,08,DISEASES AND DISORDERS OF THE MUSCULOSKELETAL SYSTEM AND CONNECTIVE TISSUE,3,Major,Major,Medical,Medicare,Private Health Insurance,,,,true,18975.65,5715.48
New York City,Bronx,7000006,001169,Montefiore Medical Center - Henry & Lucy Moses Div,18 to 29,104,F,Black/African American,Not Span/Hispanic,2,Emergency,Home or Self Care,2018,MUS026,MUSCLE DISORDERS,MAM007,ELECTROCARDIOGRAM (ECG),351,OTHER MUSCULOSKELETAL SYSTEM & CONNECTIVE TISSUE DIAGNOSES,08,DISEASES AND DISORDERS OF THE MUSCULOSKELETAL SYSTEM AND CONNECTIVE TISSUE,2,Moderate,Minor,Medical,Medicaid,,,,,true,20921.72,3892.26
Long Island,Nassau,2953000,000563,St. Francis Hospital & Heart Center,70 or Older,113,M,White,Not Span/Hispanic,1,Emergency,Home w/ Home Health Services,2018,MUS033,GOUT,ESA004,NON-INVASIVE VENTILATION,351,OTHER MUSCULOSKELETAL SYSTEM & CONNECTIVE TISSUE DIAGNOSES,08,DISEASES AND DISORDERS OF THE MUSCULOSKELETAL SYSTEM AND CONNECTIVE TISSUE,2,Moderate,Minor,Medical,Medicare,Private Health Insurance,,,,true,17572.02,3158.06
New York City,Bronx,7000002,001165,Jacobi Medical Center,30 to 49,104,F,Black/African American,Not Span/Hispanic,2,Emergency,Home or Self Care,2018,MUS007,OTHER SPECIFIED JOINT DISORDERS,,,351,OTHER MUSCULOSKELETAL SYSTEM & CONNECTIVE TISSUE DIAGNOSES,08,DISEASES AND DISORDERS OF THE MUSCULOSKELETAL SYSTEM AND CONNECTIVE TISSUE,2,Moderate,Minor,Medical,Medicaid,Medicaid,,,,true,17831.5,10550.01
New York City,Kings,7002002,001324,Mount Sinai Brooklyn,50 to 69,112,M,Black/African American,Not Span/Hispanic,3,Emergency,Home or Self Care,2018,INJ018,"CRUSHING INJURY, INITIAL ENCOUNTER",MST020,SUBCUTANEOUS TISSUE AND FASCIA EXCISION,351,OTHER MUSCULOSKELETAL SYSTEM & CONNECTIVE TISSUE DIAGNOSES,08,DISEASES AND DISORDERS OF THE MUSCULOSKELETAL SYSTEM AND CONNECTIVE TISSUE,2,Moderate,Moderate,Medical,Private Health Insurance,Self-Pay,,,,true,32457.36,6377.7
New York City,Kings,7001021,001306,New York - Presbyterian Brooklyn Methodist Hospital,50 to 69,112,M,Black/African American,Not Span/Hispanic,1,Emergency,Left Against Medical Advice,2018,INJ024,"SPRAINS AND STRAINS, INITIAL ENCOUNTER",,,351,OTHER MUSCULOSKELETAL SYSTEM & CONNECTIVE TISSUE DIAGNOSES,08,DISEASES AND DISORDERS OF THE MUSCULOSKELETAL SYSTEM AND CONNECTIVE TISSUE,3,Major,Major,Medical,Medicare,Self-Pay,,,,true,10058.89,2360.75
New York City,Kings,7001021,001306,New York - Presbyterian Brooklyn Methodist Hospital,50 to 69,100,M,Other Race,Spanish/Hispanic,5,Emergency,Home or Self Care,2018,MUS006,OSTEOARTHRITIS,MST002,BONE AND JOINT BIOPSY,351,OTHER MUSCULOSKELETAL SYSTEM & CONNECTIVE TISSUE DIAGNOSES,08,DISEASES AND DISORDERS OF THE MUSCULOSKELETAL SYSTEM AND CONNECTIVE TISSUE,3,Major,Moderate,Medical,Medicaid,Self-Pay,,,,true,36657.07,8923.23
Long Island,Nassau,2908000,000511,NYU Langone Hospital-Long Island,0 to 17,115,F,White,Not Span/Hispanic,1,Emergency,Home or Self Care,2018,MUS007,OTHER SPECIFIED JOINT DISORDERS,MST001,ARTHROCENTESIS,351,OTHER MUSCULOSKELETAL SYSTEM & CONNECTIVE TISSUE DIAGNOSES,08,DISEASES AND DISORDERS OF THE MUSCULOSKELETAL SYSTEM AND CONNECTIVE TISSUE,2,Moderate,Minor,Medical,Medicaid,Medicaid,,,,true,29294.91,4865.38
New York City,Richmond,7004010,001738,Richmond University Medical Center,18 to 29,103,M,Other Race,Not Span/Hispanic,2,Emergency,Home or Self Care,2018,MUS026,MUSCLE DISORDERS,,,351,OTHER MUSCULOSKELETAL SYSTEM & CONNECTIVE TISSUE DIAGNOSES,08,DISEASES AND DISORDERS OF THE MUSCULOSKELETAL SYSTEM AND CONNECTIVE TISSUE,2,Moderate,Minor,Medical,Private Health Insurance,Self-Pay,Self-Pay,,,true,12835.6,6773.56
Long Island,Nassau,2951001,000541,North Shore University Hospital,70 or Older,113,F,White,Not Span/Hispanic,2,Emergency,Home w/ Home Health Services,2018,INJ024,"SPRAINS AND STRAINS, INITIAL ENCOUNTER",,,351,OTHER MUSCULOSKELETAL SYSTEM & CONNECTIVE TISSUE DIAGNOSES,08,DISEASES AND DISORDERS OF THE MUSCULOSKELETAL SYSTEM AND CONNECTIVE TISSUE,2,Moderate,Moderate,Medical,Medicare,Private Health Insurance,,,,true,23345.49,3755.95
Long Island,Nassau,2952005,000552,Plainview Hospital,50 to 69,118,M,White,Not Span/Hispanic,3,Emergency,Home or Self Care,2018,MUS033,GOUT,,,351,OTHER MUSCULOSKELETAL SYSTEM & CONNECTIVE TISSUE DIAGNOSES,08,DISEASES AND DISORDERS OF THE MUSCULOSKELETAL SYSTEM AND CONNECTIVE TISSUE,2,Moderate,Moderate,Medical,Private Health Insurance,Medicare,Blue Cross/Blue Shield,,,true,21899.2,8879.88
New York City,Manhattan,7002012,001447,Hospital for Special Surgery,0 to 17,,F,White,Not Span/Hispanic,2,Elective,Home or Self Care,2018,NEO073,BENIGN NEOPLASMS,MST002,BONE AND JOINT BIOPSY,351,OTHER MUSCULOSKELETAL SYSTEM & CONNECTIVE TISSUE DIAGNOSES,08,DISEASES AND DISORDERS OF THE MUSCULOSKELETAL SYSTEM AND CONNECTIVE TISSUE,1,Minor,Minor,Medical,Blue Cross/Blue Shield,,,,,false,41484,17381.95
Finger Lakes,Monroe,2701003,000411,Rochester General Hospital,70 or Older,146,M,White,Not Span/Hispanic,2,Emergency,Home w/ Home Health Services,2018,MUS010,"MUSCULOSKELETAL PAIN, NOT LOW BACK PAIN",,,351,OTHER MUSCULOSKELETAL SYSTEM & CONNECTIVE TISSUE DIAGNOSES,08,DISEASES AND DISORDERS OF THE MUSCULOSKELETAL SYSTEM AND CONNECTIVE TISSUE,2,Moderate,Moderate,Medical,Medicare,,,,,true,8485.13,2312.29
New York City,Queens,7003004,001638,Long Island Jewish Forest Hills,70 or Older,113,F,Other Race,Not Span/Hispanic,3,Emergency,Home or Self Care,2018,MUS025,OTHER SPECIFIED CONNECTIVE TISSUE DISEASE,,,351,OTHER MUSCULOSKELETAL SYSTEM & CONNECTIVE TISSUE DIAGNOSES,08,DISEASES AND DISORDERS OF THE MUSCULOSKELETAL SYSTEM AND CONNECTIVE TISSUE,2,Moderate,Moderate,Medical,Medicare,Medicare,,,,true,45061.65,6367.88
Long Island,Nassau,2909000,000513,Mercy Hospital,50 to 69,115,F,Other Race,Not Span/Hispanic,5,Emergency,Short-term Hospital,2018,MUS010,"MUSCULOSKELETAL PAIN, NOT LOW BACK PAIN",,,351,OTHER MUSCULOSKELETAL SYSTEM & CONNECTIVE TISSUE DIAGNOSES,08,DISEASES AND DISORDERS OF THE MUSCULOSKELETAL SYSTEM AND CONNECTIVE TISSUE,2,Moderate,Minor,Medical,Medicare,Medicaid,,,,true,58368,9825.6
New York City,Kings,7001021,001306,New York - Presbyterian Brooklyn Methodist Hospital,70 or Older,112,M,White,Not Span/Hispanic,13,Emergency,Skilled Nursing Home,2018,MUS026,MUSCLE DISORDERS,IMG008,ULTRASONOGRAPHY,351,OTHER MUSCULOSKELETAL SYSTEM & CONNECTIVE TISSUE DIAGNOSES,08,DISEASES AND DISORDERS OF THE MUSCULOSKELETAL SYSTEM AND CONNECTIVE TISSUE,4,Extreme,Extreme,Medical,Medicare,Medicaid,Self-Pay,,,true,110827.08,27101.55
New York City,Kings,7001020,001305,Maimonides Medical Center,70 or Older,112,M,Other Race,Not Span/Hispanic,5,Emergency,Skilled Nursing Home,2018,MUS026,MUSCLE DISORDERS,URN006,BLADDER CATHETERIZATION AND DRAINAGE,351,OTHER MUSCULOSKELETAL SYSTEM & CONNECTIVE TISSUE DIAGNOSES,08,DISEASES AND DISORDERS OF THE MUSCULOSKELETAL SYSTEM AND CONNECTIVE TISSUE,3,Major,Major,Medical,Medicare,Medicare,Medicaid,,,true,31929.04,9374.04
Western NY,Erie,1401005,000210,Erie County Medical Center,30 to 49,147,M,White,Not Span/Hispanic,2,Emergency,Left Against Medical Advice,2018,MUS026,MUSCLE DISORDERS,,,351,OTHER MUSCULOSKELETAL SYSTEM & CONNECTIVE TISSUE DIAGNOSES,08,DISEASES AND DISORDERS OF THE MUSCULOSKELETAL SYSTEM AND CONNECTIVE TISSUE,3,Major,Moderate,Medical,Medicaid,Medicaid,,,,true,26002.22,7705.59
New York City,Kings,7001037,001320,University Hospital of Brooklyn,70 or Older,112,F,Black/African American,Not Span/Hispanic,1,Emergency,Home or Self Care,2018,MUS033,GOUT,ADM016,ADMINISTRATION OF ANTI-INFLAMMATORY AGENTS,351,OTHER MUSCULOSKELETAL SYSTEM & CONNECTIVE TISSUE DIAGNOSES,08,DISEASES AND DISORDERS OF THE MUSCULOSKELETAL SYSTEM AND CONNECTIVE TISSUE,1,Minor,Minor,Medical,Medicare,Medicare,Self-Pay,,,false,5418,3232.48
New York City,Queens,7003001,001628,Flushing Hospital Medical Center,0 to 17,113,F,White,Spanish/Hispanic,1,Emergency,Home or Self Care,2018,MUS007,OTHER SPECIFIED JOINT DISORDERS,MST001,ARTHROCENTESIS,351,OTHER MUSCULOSKELETAL SYSTEM & CONNECTIVE TISSUE DIAGNOSES,08,DISEASES AND DISORDERS OF THE MUSCULOSKELETAL SYSTEM AND CONNECTIVE TISSUE,1,Minor,Minor,Medical,Medicaid,,,,,true,5436.91,3090.48
New York City,Kings,7001020,001305,Maimonides Medical Center,70 or Older,112,M,White,Not Span/Hispanic,3,Emergency,Skilled Nursing Home,2018,MUS007,OTHER SPECIFIED JOINT DISORDERS,MST001,ARTHROCENTESIS,351,OTHER MUSCULOSKELETAL SYSTEM & CONNECTIVE TISSUE DIAGNOSES,08,DISEASES AND DISORDERS OF THE MUSCULOSKELETAL SYSTEM AND CONNECTIVE TISSUE,2,Moderate,Moderate,Medical,Medicare,Self-Pay,,,,true,22375.01,6472.29
Long Island,Suffolk,5157003,000943,St Catherine of Siena Hospital,70 or Older,117,F,White,Not Span/Hispanic,3,Emergency,Skilled Nursing Home,2018,SYM010,NERVOUS SYSTEM SIGNS AND SYMPTOMS,,,351,OTHER MUSCULOSKELETAL SYSTEM & CONNECTIVE TISSUE DIAGNOSES,08,DISEASES AND DISORDERS OF THE MUSCULOSKELETAL SYSTEM AND CONNECTIVE TISSUE,2,Moderate,Moderate,Medical,Medicare,Private Health Insurance,,,,true,25755.03,4751.19
New York City,Kings,7001021,001306,New York - Presbyterian Brooklyn Methodist Hospital,70 or Older,112,F,Black/African American,Not Span/Hispanic,8,Emergency,Skilled Nursing Home,2018,INJ026,OTHER SPECIFIED INJURY,,,351,OTHER MUSCULOSKELETAL SYSTEM & CONNECTIVE TISSUE DIAGNOSES,08,DISEASES AND DISORDERS OF THE MUSCULOSKELETAL SYSTEM AND CONNECTIVE TISSUE,3,Major,Major,Medical,Medicare,Medicare,Medicaid,,,true,64383.46,14639.64
Long Island,Suffolk,5151001,000245,Stony Brook University Hospital,70 or Older,117,F,White,Not Span/Hispanic,1,Emergency,Home or Self Care,2018,MUS010,"MUSCULOSKELETAL PAIN, NOT LOW BACK PAIN",,,351,OTHER MUSCULOSKELETAL SYSTEM & CONNECTIVE TISSUE DIAGNOSES,08,DISEASES AND DISORDERS OF THE MUSCULOSKELETAL SYSTEM AND CONNECTIVE TISSUE,2,Moderate,Moderate,Medical,Medicare,Blue Cross/Blue Shield,,,,false,13899.01,3767.53
New York City,Bronx,7000006,003058,Montefiore Med Center - Jack D Weiler Hosp of A Einstein College Div,70 or Older,104,F,Other Race,Spanish/Hispanic,6,Emergency,Inpatient Rehabilitation Facility,2018,INJ026,OTHER SPECIFIED INJURY,ADM015,ADMINISTRATION OF ANTIBIOTICS,351,OTHER MUSCULOSKELETAL SYSTEM & CONNECTIVE TISSUE DIAGNOSES,08,DISEASES AND DISORDERS OF THE MUSCULOSKELETAL SYSTEM AND CONNECTIVE TISSUE,1,Minor,Minor,Medical,Medicare,Private Health Insurance,,,,true,105123.21,18549.35
New York City,Bronx,7000006,003058,Montefiore Med Center - Jack D Weiler Hosp of A Einstein College Div,50 to 69,100,M,Black/African American,Not Span/Hispanic,4,Emergency,Home or Self Care,2018,MUS009,TENDON AND SYNOVIAL DISORDERS,ADM015,ADMINISTRATION OF ANTIBIOTICS,351,OTHER MUSCULOSKELETAL SYSTEM & CONNECTIVE TISSUE DIAGNOSES,08,DISEASES AND DISORDERS OF THE MUSCULOSKELETAL SYSTEM AND CONNECTIVE TISSUE,2,Moderate,Minor,Medical,Private Health Insurance,,,,,true,47942.6,8337.55
New York City,Queens,7003001,001628,Flushing Hospital Medical Center,0 to 17,113,M,Black/African American,Spanish/Hispanic,1,Emergency,Home or Self Care,2018,MUS010,"MUSCULOSKELETAL PAIN, NOT LOW BACK PAIN",,,351,OTHER MUSCULOSKELETAL SYSTEM & CONNECTIVE TISSUE DIAGNOSES,08,DISEASES AND DISORDERS OF THE MUSCULOSKELETAL SYSTEM AND CONNECTIVE TISSUE,1,Minor,Minor,Medical,Medicaid,,,,,true,3886.56,2583.08
New York City,Queens,7003001,001628,Flushing Hospital Medical Center,50 to 69,113,M,Other Race,Not Span/Hispanic,4,Emergency,Home or Self Care,2018,MUS033,GOUT,,,351,OTHER MUSCULOSKELETAL SYSTEM & CONNECTIVE TISSUE DIAGNOSES,08,DISEASES AND DISORDERS OF THE MUSCULOSKELETAL SYSTEM AND CONNECTIVE TISSUE,1,Minor,Minor,Medical,Medicaid,,,,,true,9237.56,7396.35
New York City,Queens,7003004,001638,Long Island Jewish Forest Hills,70 or Older,113,M,Other Race,Not Span/Hispanic,1,Emergency,Home or Self Care,2018,MUS025,OTHER SPECIFIED CONNECTIVE TISSUE DISEASE,,,351,OTHER MUSCULOSKELETAL SYSTEM & CONNECTIVE TISSUE DIAGNOSES,08,DISEASES AND DISORDERS OF THE MUSCULOSKELETAL SYSTEM AND CONNECTIVE TISSUE,2,Moderate,Minor,Medical,Medicare,Blue Cross/Blue Shield,,,,true,15118.85,2651.39