Hospital Service Area,Hospital County,Operating Certificate Number,Permanent Facility Id,Facility Name,Age Group,Zip Code - 3 digits,Gender,Race,Ethnicity,Length of Stay,Type of Admission,Patient Disposition,Discharge Year,CCS Diagnosis Code,CCS Diagnosis Description,CCS Procedure Code,CCS Procedure Description,APR DRG Code,APR DRG Description,APR MDC Code,APR MDC Description,APR Severity of Illness Code,APR Severity of Illness Description,APR Risk of Mortality,APR Medical Surgical Description,Payment Typology 1,Payment Typology 2,Payment Typology 3,Birth Weight,Abortion Edit Indicator,Emergency Department Indicator,Total Charges,Total Costs
New York City,Manhattan,7002053,001446,NYU Langone Orthopedic Hospital,30 to 49,113,F,White,Not Span/Hispanic,1,Elective,Home w/ Home Health Services,2019,MUS006,OSTEOARTHRITIS,,,351,OTHER MUSCULOSKELETAL SYSTEM & CONNECTIVE TISSUE DIAGNOSES,08,DISEASES AND DISORDERS OF THE MUSCULOSKELETAL SYSTEM AND CONNECTIVE TISSUE,1,Minor,Minor,Medical,Private Health Insurance,,,,,false,6312.28,3300.52
New York City,Manhattan,7002053,001446,NYU Langone Orthopedic Hospital,70 or Older,100,F,Other Race,Not Span/Hispanic,1,Elective,Home or Self Care,2019,MUS006,OSTEOARTHRITIS,,,351,OTHER MUSCULOSKELETAL SYSTEM & CONNECTIVE TISSUE DIAGNOSES,08,DISEASES AND DISORDERS OF THE MUSCULOSKELETAL SYSTEM AND CONNECTIVE TISSUE,1,Minor,Minor,Medical,Medicare,Medicaid,,,,false,8133.26,3372.58
New York City,Manhattan,7002053,001446,NYU Langone Orthopedic Hospital,70 or Older,100,M,Other Race,Spanish/Hispanic,11,Emergency,Skilled Nursing Home,2019,SYM010,NERVOUS SYSTEM SIGNS AND SYMPTOMS,,,351,OTHER MUSCULOSKELETAL SYSTEM & CONNECTIVE TISSUE DIAGNOSES,08,DISEASES AND DISORDERS OF THE MUSCULOSKELETAL SYSTEM AND CONNECTIVE TISSUE,2,Moderate,Moderate,Medical,Blue Cross/Blue Shield,Medicare,,,,false,86986.93,38517.22
New York City,Manhattan,7002053,001446,NYU Langone Orthopedic Hospital,50 to 69,105,M,White,Not Span/Hispanic,1,Elective,Home or Self Care,2019,MUS006,OSTEOARTHRITIS,,,351,OTHER MUSCULOSKELETAL SYSTEM & CONNECTIVE TISSUE DIAGNOSES,08,DISEASES AND DISORDERS OF THE MUSCULOSKELETAL SYSTEM AND CONNECTIVE TISSUE,1,Minor,Minor,Medical,Blue Cross/Blue Shield,,,,,false,8700.76,3511.45
New York City,Manhattan,7002053,001446,NYU Langone Orthopedic Hospital,18 to 29,OOS,M,White,Spanish/Hispanic,6,Elective,Home or Self Care,2019,MUS021,ACQUIRED FOOT DEFORMITIES,RHB002,"PHYSICAL, OCCUPATIONAL, AND RESPIRATORY THERAPY TREATMENT",351,OTHER MUSCULOSKELETAL SYSTEM & CONNECTIVE TISSUE DIAGNOSES,08,DISEASES AND DISORDERS OF THE MUSCULOSKELETAL SYSTEM AND CONNECTIVE TISSUE,1,Minor,Minor,Medical,Private Health Insurance,,,,,false,86548.75,20402.24
New York City,Manhattan,7002053,001446,NYU Langone Orthopedic Hospital,70 or Older,100,F,White,Not Span/Hispanic,1,Elective,Home or Self Care,2019,MUS006,OSTEOARTHRITIS,,,351,OTHER MUSCULOSKELETAL SYSTEM & CONNECTIVE TISSUE DIAGNOSES,08,DISEASES AND DISORDERS OF THE MUSCULOSKELETAL SYSTEM AND CONNECTIVE TISSUE,2,Moderate,Minor,Medical,Medicare,,,,,false,6082.57,3131.23
New York City,Manhattan,7002053,001446,NYU Langone Orthopedic Hospital,50 to 69,100,F,Other Race,Not Span/Hispanic,1,Elective,Home or Self Care,2019,MUS006,OSTEOARTHRITIS,,,351,OTHER MUSCULOSKELETAL SYSTEM & CONNECTIVE TISSUE DIAGNOSES,08,DISEASES AND DISORDERS OF THE MUSCULOSKELETAL SYSTEM AND CONNECTIVE TISSUE,1,Minor,Minor,Medical,Private Health Insurance,,,,,false,5718.72,3065.79
New York City,Manhattan,7002053,001446,NYU Langone Orthopedic Hospital,50 to 69,103,M,Other Race,Spanish/Hispanic,1,Elective,Home or Self Care,2019,MUS006,OSTEOARTHRITIS,,,351,OTHER MUSCULOSKELETAL SYSTEM & CONNECTIVE TISSUE DIAGNOSES,08,DISEASES AND DISORDERS OF THE MUSCULOSKELETAL SYSTEM AND CONNECTIVE TISSUE,2,Moderate,Minor,Medical,Private Health Insurance,,,,,false,5506.2,3038.79
New York City,Manhattan,7002053,001446,NYU Langone Orthopedic Hospital,70 or Older,103,F,White,Not Span/Hispanic,1,Elective,Home or Self Care,2019,MUS006,OSTEOARTHRITIS,,,351,OTHER MUSCULOSKELETAL SYSTEM & CONNECTIVE TISSUE DIAGNOSES,08,DISEASES AND DISORDERS OF THE MUSCULOSKELETAL SYSTEM AND CONNECTIVE TISSUE,1,Minor,Minor,Medical,Private Health Insurance,,,,,false,5992.82,3111.02
New York City,Manhattan,7002053,001446,NYU Langone Orthopedic Hospital,70 or Older,113,M,White,Not Span/Hispanic,1,Elective,Home or Self Care,2019,MUS006,OSTEOARTHRITIS,MST002,BONE AND JOINT BIOPSY,351,OTHER MUSCULOSKELETAL SYSTEM & CONNECTIVE TISSUE DIAGNOSES,08,DISEASES AND DISORDERS OF THE MUSCULOSKELETAL SYSTEM AND CONNECTIVE TISSUE,1,Minor,Minor,Medical,Medicare,Medicaid,,,,false,31701.57,6913.97
New York City,Manhattan,7002053,001446,NYU Langone Orthopedic Hospital,70 or Older,100,F,White,Not Span/Hispanic,1,Elective,Home w/ Home Health Services,2019,MUS006,OSTEOARTHRITIS,,,351,OTHER MUSCULOSKELETAL SYSTEM & CONNECTIVE TISSUE DIAGNOSES,08,DISEASES AND DISORDERS OF THE MUSCULOSKELETAL SYSTEM AND CONNECTIVE TISSUE,2,Moderate,Moderate,Medical,Medicare,Blue Cross/Blue Shield,,,,false,33199.12,15300.08
New York City,Manhattan,7002053,001446,NYU Langone Orthopedic Hospital,50 to 69,112,F,Black/African American,Not Span/Hispanic,1,Elective,Home or Self Care,2019,MUS006,OSTEOARTHRITIS,,,351,OTHER MUSCULOSKELETAL SYSTEM & CONNECTIVE TISSUE DIAGNOSES,08,DISEASES AND DISORDERS OF THE MUSCULOSKELETAL SYSTEM AND CONNECTIVE TISSUE,2,Moderate,Minor,Medical,Blue Cross/Blue Shield,,,,,false,5881.2,3245.75
New York City,Manhattan,7002053,001446,NYU Langone Orthopedic Hospital,50 to 69,116,M,Other Race,Spanish/Hispanic,1,Elective,Home or Self Care,2019,MUS010,"MUSCULOSKELETAL PAIN, NOT LOW BACK PAIN",,,351,OTHER MUSCULOSKELETAL SYSTEM & CONNECTIVE TISSUE DIAGNOSES,08,DISEASES AND DISORDERS OF THE MUSCULOSKELETAL SYSTEM AND CONNECTIVE TISSUE,1,Minor,Minor,Medical,Miscellaneous/Other,,,,,false,25382.19,5989.18
New York City,Manhattan,7002053,001446,NYU Langone Orthopedic Hospital,70 or Older,112,F,Black/African American,Not Span/Hispanic,1,Elective,Home or Self Care,2019,MUS006,OSTEOARTHRITIS,,,351,OTHER MUSCULOSKELETAL SYSTEM & CONNECTIVE TISSUE DIAGNOSES,08,DISEASES AND DISORDERS OF THE MUSCULOSKELETAL SYSTEM AND CONNECTIVE TISSUE,1,Minor,Minor,Medical,Medicare,Medicaid,,,,false,5578.16,3047.93
New York City,Manhattan,7002053,001446,NYU Langone Orthopedic Hospital,50 to 69,116,F,Black/African American,Not Span/Hispanic,2,Elective,Home w/ Home Health Services,2019,MUS006,OSTEOARTHRITIS,ESA004,NON-INVASIVE VENTILATION,351,OTHER MUSCULOSKELETAL SYSTEM & CONNECTIVE TISSUE DIAGNOSES,08,DISEASES AND DISORDERS OF THE MUSCULOSKELETAL SYSTEM AND CONNECTIVE TISSUE,2,Moderate,Minor,Medical,Medicare,Medicaid,,,,false,52082.42,17777.92
New York City,Manhattan,7002053,001446,NYU Langone Orthopedic Hospital,70 or Older,106,M,White,Not Span/Hispanic,2,Urgent,Home or Self Care,2019,MUS010,"MUSCULOSKELETAL PAIN, NOT LOW BACK PAIN",MST001,ARTHROCENTESIS,351,OTHER MUSCULOSKELETAL SYSTEM & CONNECTIVE TISSUE DIAGNOSES,08,DISEASES AND DISORDERS OF THE MUSCULOSKELETAL SYSTEM AND CONNECTIVE TISSUE,1,Minor,Minor,Medical,Medicaid,,,,,false,24560.07,8420.9
New York City,Manhattan,7002053,001446,NYU Langone Orthopedic Hospital,50 to 69,OOS,F,White,Not Span/Hispanic,1,Urgent,Home or Self Care,2019,MUS010,"MUSCULOSKELETAL PAIN, NOT LOW BACK PAIN",MST001,ARTHROCENTESIS,351,OTHER MUSCULOSKELETAL SYSTEM & CONNECTIVE TISSUE DIAGNOSES,08,DISEASES AND DISORDERS OF THE MUSCULOSKELETAL SYSTEM AND CONNECTIVE TISSUE,3,Major,Moderate,Medical,Medicare,Private Health Insurance,,,,false,11465.67,3906.5
