Hospital Service Area,Hospital County,Operating Certificate Number,Permanent Facility Id,Facility Name,Age Group,Zip Code - 3 digits,Gender,Race,Ethnicity,Length of Stay,Type of Admission,Patient Disposition,Discharge Year,CCS Diagnosis Code,CCS Diagnosis Description,CCS Procedure Code,CCS Procedure Description,APR DRG Code,APR DRG Description,APR MDC Code,APR MDC Description,APR Severity of Illness Code,APR Severity of Illness Description,APR Risk of Mortality,APR Medical Surgical Description,Payment Typology 1,Payment Typology 2,Payment Typology 3,Birth Weight,Abortion Edit Indicator,Emergency Department Indicator,Total Charges,Total Costs
Long Island,Nassau,2908000,000511,NYU Langone Hospital-Long Island,30 to 49,117,M,White,Not Span/Hispanic,1,Emergency,Home or Self Care,2019,MUS010,"MUSCULOSKELETAL PAIN, NOT LOW BACK PAIN",,,351,OTHER MUSCULOSKELETAL SYSTEM & CONNECTIVE TISSUE DIAGNOSES,08,DISEASES AND DISORDERS OF THE MUSCULOSKELETAL SYSTEM AND CONNECTIVE TISSUE,2,Moderate,Minor,Medical,Blue Cross/Blue Shield,,,,,true,25021.81,3054.13
Long Island,Nassau,2908000,000511,NYU Langone Hospital-Long Island,50 to 69,115,M,White,Not Span/Hispanic,7,Emergency,Home w/ Home Health Services,2019,MUS025,OTHER SPECIFIED CONNECTIVE TISSUE DISEASE,,,351,OTHER MUSCULOSKELETAL SYSTEM & CONNECTIVE TISSUE DIAGNOSES,08,DISEASES AND DISORDERS OF THE MUSCULOSKELETAL SYSTEM AND CONNECTIVE TISSUE,1,Minor,Minor,Medical,Medicare,Medicare,,,,true,71783.44,14544.05
Long Island,Nassau,2908000,000511,NYU Langone Hospital-Long Island,70 or Older,110,F,White,Not Span/Hispanic,3,Trauma,Skilled Nursing Home,2019,MUS010,"MUSCULOSKELETAL PAIN, NOT LOW BACK PAIN",,,351,OTHER MUSCULOSKELETAL SYSTEM & CONNECTIVE TISSUE DIAGNOSES,08,DISEASES AND DISORDERS OF THE MUSCULOSKELETAL SYSTEM AND CONNECTIVE TISSUE,2,Moderate,Moderate,Medical,Medicare,Medicare,Blue Cross/Blue Shield,,,true,54715.85,9027.75
Long Island,Nassau,2908000,000511,NYU Langone Hospital-Long Island,70 or Older,115,M,White,Not Span/Hispanic,3,Emergency,Home w/ Home Health Services,2019,MUS033,GOUT,,,351,OTHER MUSCULOSKELETAL SYSTEM & CONNECTIVE TISSUE DIAGNOSES,08,DISEASES AND DISORDERS OF THE MUSCULOSKELETAL SYSTEM AND CONNECTIVE TISSUE,1,Minor,Minor,Medical,Medicare,Medicare,,,,true,41424.14,7913.93
Long Island,Nassau,2908000,000511,NYU Langone Hospital-Long Island,50 to 69,115,F,White,Not Span/Hispanic,6,Emergency,Skilled Nursing Home,2019,MUS006,OSTEOARTHRITIS,,,351,OTHER MUSCULOSKELETAL SYSTEM & CONNECTIVE TISSUE DIAGNOSES,08,DISEASES AND DISORDERS OF THE MUSCULOSKELETAL SYSTEM AND CONNECTIVE TISSUE,3,Major,Moderate,Medical,Medicare,Medicare,Medicaid,,,true,56166.04,12849.65
Long Island,Nassau,2908000,000511,NYU Langone Hospital-Long Island,0 to 17,115,M,Other Race,Not Span/Hispanic,5,Urgent,Home or Self Care,2019,INJ014,"AMPUTATION OF A LIMB, INITIAL ENCOUNTER",SKB006,SKIN LACERATION REPAIR (EXCLUDING PERINEUM),351,OTHER MUSCULOSKELETAL SYSTEM & CONNECTIVE TISSUE DIAGNOSES,08,DISEASES AND DISORDERS OF THE MUSCULOSKELETAL SYSTEM AND CONNECTIVE TISSUE,1,Minor,Minor,Medical,Private Health Insurance,,,,,true,60980.06,12692.95
Long Island,Nassau,2908000,000511,NYU Langone Hospital-Long Island,30 to 49,115,M,Black/African American,Not Span/Hispanic,3,Emergency,Home or Self Care,2019,MUS026,MUSCLE DISORDERS,MAM011,ELECTROENCEPHALOGRAM (EEG),351,OTHER MUSCULOSKELETAL SYSTEM & CONNECTIVE TISSUE DIAGNOSES,08,DISEASES AND DISORDERS OF THE MUSCULOSKELETAL SYSTEM AND CONNECTIVE TISSUE,1,Minor,Minor,Medical,Private Health Insurance,,,,,true,142266.4,11366.7
Long Island,Nassau,2908000,000511,NYU Langone Hospital-Long Island,70 or Older,115,F,White,Not Span/Hispanic,7,Emergency,Skilled Nursing Home,2019,MUS025,OTHER SPECIFIED CONNECTIVE TISSUE DISEASE,,,351,OTHER MUSCULOSKELETAL SYSTEM & CONNECTIVE TISSUE DIAGNOSES,08,DISEASES AND DISORDERS OF THE MUSCULOSKELETAL SYSTEM AND CONNECTIVE TISSUE,3,Major,Major,Medical,Medicare,Medicare,Private Health Insurance,,,true,78440.14,16319.39
Long Island,Nassau,2908000,000511,NYU Langone Hospital-Long Island,50 to 69,113,M,Other Race,Not Span/Hispanic,4,Urgent,Home or Self Care,2019,NEO073,BENIGN NEOPLASMS,GIS016,GI SYSTEM ENDOSCOPIC THERAPEUTIC PROCEDURES,351,OTHER MUSCULOSKELETAL SYSTEM & CONNECTIVE TISSUE DIAGNOSES,08,DISEASES AND DISORDERS OF THE MUSCULOSKELETAL SYSTEM AND CONNECTIVE TISSUE,1,Minor,Minor,Medical,Federal/State/Local/VA,,,,,false,132100.64,20134.17
Long Island,Nassau,2908000,000511,NYU Langone Hospital-Long Island,70 or Older,117,F,White,Not Span/Hispanic,4,Emergency,Skilled Nursing Home,2019,MUS006,OSTEOARTHRITIS,,,351,OTHER MUSCULOSKELETAL SYSTEM & CONNECTIVE TISSUE DIAGNOSES,08,DISEASES AND DISORDERS OF THE MUSCULOSKELETAL SYSTEM AND CONNECTIVE TISSUE,2,Moderate,Moderate,Medical,Medicare,Medicare,Private Health Insurance,,,true,55468.89,9625.09
Long Island,Nassau,2908000,000511,NYU Langone Hospital-Long Island,70 or Older,115,M,White,Not Span/Hispanic,4,Emergency,Skilled Nursing Home,2019,MUS006,OSTEOARTHRITIS,MST001,ARTHROCENTESIS,351,OTHER MUSCULOSKELETAL SYSTEM & CONNECTIVE TISSUE DIAGNOSES,08,DISEASES AND DISORDERS OF THE MUSCULOSKELETAL SYSTEM AND CONNECTIVE TISSUE,2,Moderate,Major,Medical,Medicare,Medicare,Blue Cross/Blue Shield,,,true,43856.16,9077.24
Long Island,Nassau,2908000,000511,NYU Langone Hospital-Long Island,50 to 69,115,M,Other Race,Spanish/Hispanic,2,Emergency,Home or Self Care,2019,MUS025,OTHER SPECIFIED CONNECTIVE TISSUE DISEASE,,,351,OTHER MUSCULOSKELETAL SYSTEM & CONNECTIVE TISSUE DIAGNOSES,08,DISEASES AND DISORDERS OF THE MUSCULOSKELETAL SYSTEM AND CONNECTIVE TISSUE,2,Moderate,Minor,Medical,Medicare,Medicare,,,,true,24761.13,4734.73
Long Island,Nassau,2908000,000511,NYU Langone Hospital-Long Island,50 to 69,116,F,White,Not Span/Hispanic,1,Emergency,Home w/ Home Health Services,2019,MUS009,TENDON AND SYNOVIAL DISORDERS,,,351,OTHER MUSCULOSKELETAL SYSTEM & CONNECTIVE TISSUE DIAGNOSES,08,DISEASES AND DISORDERS OF THE MUSCULOSKELETAL SYSTEM AND CONNECTIVE TISSUE,1,Minor,Minor,Medical,Blue Cross/Blue Shield,,,,,true,23805.8,3312.76
Long Island,Nassau,2908000,000511,NYU Langone Hospital-Long Island,70 or Older,117,M,White,Not Span/Hispanic,3,Emergency,Skilled Nursing Home,2019,MUS010,"MUSCULOSKELETAL PAIN, NOT LOW BACK PAIN",,,351,OTHER MUSCULOSKELETAL SYSTEM & CONNECTIVE TISSUE DIAGNOSES,08,DISEASES AND DISORDERS OF THE MUSCULOSKELETAL SYSTEM AND CONNECTIVE TISSUE,3,Major,Moderate,Medical,Medicare,Medicare,Private Health Insurance,,,true,34379.59,6699.88
Long Island,Nassau,2908000,000511,NYU Langone Hospital-Long Island,70 or Older,115,F,Black/African American,Spanish/Hispanic,2,Emergency,Home w/ Home Health Services,2019,MUS006,OSTEOARTHRITIS,,,351,OTHER MUSCULOSKELETAL SYSTEM & CONNECTIVE TISSUE DIAGNOSES,08,DISEASES AND DISORDERS OF THE MUSCULOSKELETAL SYSTEM AND CONNECTIVE TISSUE,2,Moderate,Moderate,Medical,Medicare,Medicaid,,,,true,36073.23,5766.44
Long Island,Nassau,2908000,000511,NYU Langone Hospital-Long Island,70 or Older,115,F,White,Not Span/Hispanic,4,Emergency,Skilled Nursing Home,2019,MUS010,"MUSCULOSKELETAL PAIN, NOT LOW BACK PAIN",,,351,OTHER MUSCULOSKELETAL SYSTEM & CONNECTIVE TISSUE DIAGNOSES,08,DISEASES AND DISORDERS OF THE MUSCULOSKELETAL SYSTEM AND CONNECTIVE TISSUE,1,Minor,Minor,Medical,Medicare,Medicare,Blue Cross/Blue Shield,,,true,40005.36,8939.26
Long Island,Nassau,2908000,000511,NYU Langone Hospital-Long Island,50 to 69,110,M,White,Not Span/Hispanic,3,Emergency,Home w/ Home Health Services,2019,INJ030,DRUG INDUCED OR TOXIC RELATED CONDITION,,,351,OTHER MUSCULOSKELETAL SYSTEM & CONNECTIVE TISSUE DIAGNOSES,08,DISEASES AND DISORDERS OF THE MUSCULOSKELETAL SYSTEM AND CONNECTIVE TISSUE,2,Moderate,Moderate,Medical,Medicare,Medicare,,,,true,54041.76,7832.17
Long Island,Nassau,2908000,000511,NYU Langone Hospital-Long Island,70 or Older,113,M,Other Race,Not Span/Hispanic,2,Urgent,Home or Self Care,2019,NEO073,BENIGN NEOPLASMS,GIS010,GASTRECTOMY,351,OTHER MUSCULOSKELETAL SYSTEM & CONNECTIVE TISSUE DIAGNOSES,08,DISEASES AND DISORDERS OF THE MUSCULOSKELETAL SYSTEM AND CONNECTIVE TISSUE,1,Minor,Minor,Medical,Medicare,Medicare,,,,false,74755.1,11053.53
Long Island,Nassau,2908000,000511,NYU Langone Hospital-Long Island,70 or Older,110,M,White,Not Span/Hispanic,5,Emergency,Skilled Nursing Home,2019,MUS009,TENDON AND SYNOVIAL DISORDERS,,,351,OTHER MUSCULOSKELETAL SYSTEM & CONNECTIVE TISSUE DIAGNOSES,08,DISEASES AND DISORDERS OF THE MUSCULOSKELETAL SYSTEM AND CONNECTIVE TISSUE,2,Moderate,Moderate,Medical,Medicare,Medicare,,,,true,45941.37,10085.49
Long Island,Nassau,2908000,000511,NYU Langone Hospital-Long Island,30 to 49,115,F,Black/African American,Spanish/Hispanic,3,Emergency,Home or Self Care,2019,MUS010,"MUSCULOSKELETAL PAIN, NOT LOW BACK PAIN",,,351,OTHER MUSCULOSKELETAL SYSTEM & CONNECTIVE TISSUE DIAGNOSES,08,DISEASES AND DISORDERS OF THE MUSCULOSKELETAL SYSTEM AND CONNECTIVE TISSUE,1,Minor,Minor,Medical,Medicaid,Medicaid,,,,true,58800.98,9098.69
Long Island,Nassau,2908000,000511,NYU Langone Hospital-Long Island,30 to 49,115,M,Black/African American,Spanish/Hispanic,3,Emergency,Home or Self Care,2019,MUS026,MUSCLE DISORDERS,,,351,OTHER MUSCULOSKELETAL SYSTEM & CONNECTIVE TISSUE DIAGNOSES,08,DISEASES AND DISORDERS OF THE MUSCULOSKELETAL SYSTEM AND CONNECTIVE TISSUE,2,Moderate,Minor,Medical,Blue Cross/Blue Shield,,,,,true,36696.63,6846.83
Long Island,Nassau,2908000,000511,NYU Langone Hospital-Long Island,70 or Older,110,F,White,Not Span/Hispanic,2,Emergency,Skilled Nursing Home,2019,MUS006,OSTEOARTHRITIS,,,351,OTHER MUSCULOSKELETAL SYSTEM & CONNECTIVE TISSUE DIAGNOSES,08,DISEASES AND DISORDERS OF THE MUSCULOSKELETAL SYSTEM AND CONNECTIVE TISSUE,2,Moderate,Moderate,Medical,Medicare,Medicare,,,,true,27845.55,5386.26
Long Island,Nassau,2908000,000511,NYU Langone Hospital-Long Island,30 to 49,115,M,White,Not Span/Hispanic,1,Emergency,Left Against Medical Advice,2019,MUS010,"MUSCULOSKELETAL PAIN, NOT LOW BACK PAIN",,,351,OTHER MUSCULOSKELETAL SYSTEM & CONNECTIVE TISSUE DIAGNOSES,08,DISEASES AND DISORDERS OF THE MUSCULOSKELETAL SYSTEM AND CONNECTIVE TISSUE,2,Moderate,Moderate,Medical,Private Health Insurance,,,,,true,37917.55,4343.81
Long Island,Nassau,2908000,000511,NYU Langone Hospital-Long Island,70 or Older,115,M,Black/African American,Not Span/Hispanic,4,Emergency,Skilled Nursing Home,2019,MUS006,OSTEOARTHRITIS,,,351,OTHER MUSCULOSKELETAL SYSTEM & CONNECTIVE TISSUE DIAGNOSES,08,DISEASES AND DISORDERS OF THE MUSCULOSKELETAL SYSTEM AND CONNECTIVE TISSUE,2,Moderate,Minor,Medical,Medicare,Medicare,Medicaid,,,true,40786.88,9003.75
Long Island,Nassau,2908000,000511,NYU Langone Hospital-Long Island,30 to 49,117,M,Black/African American,Not Span/Hispanic,2,Emergency,Home or Self Care,2019,MUS011,SPONDYLOPATHIES/SPONDYLOARTHROPATHY (INCLUDING INFECTIVE),,,351,OTHER MUSCULOSKELETAL SYSTEM & CONNECTIVE TISSUE DIAGNOSES,08,DISEASES AND DISORDERS OF THE MUSCULOSKELETAL SYSTEM AND CONNECTIVE TISSUE,1,Minor,Minor,Medical,Blue Cross/Blue Shield,,,,,true,67096.15,6082.71
Long Island,Nassau,2908000,000511,NYU Langone Hospital-Long Island,50 to 69,115,F,Black/African American,Not Span/Hispanic,3,Emergency,Home or Self Care,2019,MUS010,"MUSCULOSKELETAL PAIN, NOT LOW BACK PAIN",,,351,OTHER MUSCULOSKELETAL SYSTEM & CONNECTIVE TISSUE DIAGNOSES,08,DISEASES AND DISORDERS OF THE MUSCULOSKELETAL SYSTEM AND CONNECTIVE TISSUE,2,Moderate,Minor,Medical,Blue Cross/Blue Shield,,,,,true,43049.58,7172.61
Long Island,Nassau,2908000,000511,NYU Langone Hospital-Long Island,0 to 17,115,M,Black/African American,Not Span/Hispanic,1,Emergency,Home or Self Care,2019,MUS025,OTHER SPECIFIED CONNECTIVE TISSUE DISEASE,,,351,OTHER MUSCULOSKELETAL SYSTEM & CONNECTIVE TISSUE DIAGNOSES,08,DISEASES AND DISORDERS OF THE MUSCULOSKELETAL SYSTEM AND CONNECTIVE TISSUE,1,Minor,Minor,Medical,Private Health Insurance,,,,,true,18806.92,3329.96
Long Island,Nassau,2908000,000511,NYU Langone Hospital-Long Island,70 or Older,115,F,Other Race,Not Span/Hispanic,2,Emergency,Left Against Medical Advice,2019,MUS026,MUSCLE DISORDERS,,,351,OTHER MUSCULOSKELETAL SYSTEM & CONNECTIVE TISSUE DIAGNOSES,08,DISEASES AND DISORDERS OF THE MUSCULOSKELETAL SYSTEM AND CONNECTIVE TISSUE,2,Moderate,Moderate,Medical,Medicare,Medicare,,,,true,63701.01,6311.74
Long Island,Nassau,2908000,000511,NYU Langone Hospital-Long Island,50 to 69,110,M,White,Spanish/Hispanic,1,Emergency,Home or Self Care,2019,INJ024,"SPRAINS AND STRAINS, INITIAL ENCOUNTER",,,351,OTHER MUSCULOSKELETAL SYSTEM & CONNECTIVE TISSUE DIAGNOSES,08,DISEASES AND DISORDERS OF THE MUSCULOSKELETAL SYSTEM AND CONNECTIVE TISSUE,2,Moderate,Minor,Medical,Federal/State/Local/VA,,,,,true,20669.93,3061.88
Long Island,Nassau,2908000,000511,NYU Langone Hospital-Long Island,70 or Older,117,M,White,Not Span/Hispanic,5,Emergency,Home w/ Home Health Services,2019,MUS023,ACQUIRED DEFORMITIES (EXCLUDING FOOT),,,351,OTHER MUSCULOSKELETAL SYSTEM & CONNECTIVE TISSUE DIAGNOSES,08,DISEASES AND DISORDERS OF THE MUSCULOSKELETAL SYSTEM AND CONNECTIVE TISSUE,2,Moderate,Moderate,Medical,Medicare,Medicare,Blue Cross/Blue Shield,,,true,63476.47,12255.43
Long Island,Nassau,2908000,000511,NYU Langone Hospital-Long Island,30 to 49,115,M,White,Not Span/Hispanic,5,Emergency,Home w/ Home Health Services,2019,MUS026,MUSCLE DISORDERS,,,351,OTHER MUSCULOSKELETAL SYSTEM & CONNECTIVE TISSUE DIAGNOSES,08,DISEASES AND DISORDERS OF THE MUSCULOSKELETAL SYSTEM AND CONNECTIVE TISSUE,2,Moderate,Minor,Medical,Blue Cross/Blue Shield,Medicare,,,,true,75110.53,12159.37
Long Island,Nassau,2908000,000511,NYU Langone Hospital-Long Island,70 or Older,115,F,White,Not Span/Hispanic,3,Emergency,Inpatient Rehabilitation Facility,2019,MUS026,MUSCLE DISORDERS,,,351,OTHER MUSCULOSKELETAL SYSTEM & CONNECTIVE TISSUE DIAGNOSES,08,DISEASES AND DISORDERS OF THE MUSCULOSKELETAL SYSTEM AND CONNECTIVE TISSUE,3,Major,Moderate,Medical,Medicare,Medicare,Private Health Insurance,,,true,51735.62,7935.35
Long Island,Nassau,2908000,000511,NYU Langone Hospital-Long Island,18 to 29,115,M,Black/African American,Not Span/Hispanic,3,Emergency,Home or Self Care,2019,MUS026,MUSCLE DISORDERS,,,351,OTHER MUSCULOSKELETAL SYSTEM & CONNECTIVE TISSUE DIAGNOSES,08,DISEASES AND DISORDERS OF THE MUSCULOSKELETAL SYSTEM AND CONNECTIVE TISSUE,2,Moderate,Minor,Medical,Federal/State/Local/VA,,,,,true,40765.38,7272.75
Long Island,Nassau,2908000,000511,NYU Langone Hospital-Long Island,50 to 69,110,F,White,Not Span/Hispanic,2,Emergency,Skilled Nursing Home,2019,MUS010,"MUSCULOSKELETAL PAIN, NOT LOW BACK PAIN",,,351,OTHER MUSCULOSKELETAL SYSTEM & CONNECTIVE TISSUE DIAGNOSES,08,DISEASES AND DISORDERS OF THE MUSCULOSKELETAL SYSTEM AND CONNECTIVE TISSUE,2,Moderate,Major,Medical,Private Health Insurance,Medicare,Medicare,,,true,35590.72,6353.63
Long Island,Nassau,2908000,000511,NYU Langone Hospital-Long Island,70 or Older,110,F,White,Not Span/Hispanic,1,Elective,Home or Self Care,2019,MUS006,OSTEOARTHRITIS,,,351,OTHER MUSCULOSKELETAL SYSTEM & CONNECTIVE TISSUE DIAGNOSES,08,DISEASES AND DISORDERS OF THE MUSCULOSKELETAL SYSTEM AND CONNECTIVE TISSUE,2,Moderate,Minor,Medical,Medicare,Medicare,Private Health Insurance,,,false,5803.32,1676.3
Long Island,Nassau,2908000,000511,NYU Langone Hospital-Long Island,70 or Older,113,M,White,Not Span/Hispanic,2,Emergency,Home or Self Care,2019,MUS026,MUSCLE DISORDERS,,,351,OTHER MUSCULOSKELETAL SYSTEM & CONNECTIVE TISSUE DIAGNOSES,08,DISEASES AND DISORDERS OF THE MUSCULOSKELETAL SYSTEM AND CONNECTIVE TISSUE,2,Moderate,Moderate,Medical,Medicare,Medicare,,,,true,29337.88,5225.19
Long Island,Nassau,2908000,000511,NYU Langone Hospital-Long Island,70 or Older,117,F,White,Not Span/Hispanic,9,Emergency,Skilled Nursing Home,2019,MUS026,MUSCLE DISORDERS,ADM001,TRANSFUSION OF BLOOD AND BLOOD PRODUCTS,351,OTHER MUSCULOSKELETAL SYSTEM & CONNECTIVE TISSUE DIAGNOSES,08,DISEASES AND DISORDERS OF THE MUSCULOSKELETAL SYSTEM AND CONNECTIVE TISSUE,4,Extreme,Major,Medical,Medicare,Medicare,,,,true,109726.62,20429.35
Long Island,Nassau,2908000,000511,NYU Langone Hospital-Long Island,70 or Older,115,F,Black/African American,Not Span/Hispanic,5,Emergency,Skilled Nursing Home,2019,MUS006,OSTEOARTHRITIS,,,351,OTHER MUSCULOSKELETAL SYSTEM & CONNECTIVE TISSUE DIAGNOSES,08,DISEASES AND DISORDERS OF THE MUSCULOSKELETAL SYSTEM AND CONNECTIVE TISSUE,2,Moderate,Moderate,Medical,Medicare,Medicare,Blue Cross/Blue Shield,,,true,55205.59,10975.64
Long Island,Nassau,2908000,000511,NYU Langone Hospital-Long Island,70 or Older,119,M,White,Not Span/Hispanic,3,Emergency,Home or Self Care,2019,MUS034,CRYSTAL ARTHROPATHIES (EXCLUDING GOUT),,,351,OTHER MUSCULOSKELETAL SYSTEM & CONNECTIVE TISSUE DIAGNOSES,08,DISEASES AND DISORDERS OF THE MUSCULOSKELETAL SYSTEM AND CONNECTIVE TISSUE,1,Minor,Moderate,Medical,Medicare,Medicare,Private Health Insurance,,,true,45653.95,8117.05
Long Island,Nassau,2908000,000511,NYU Langone Hospital-Long Island,30 to 49,115,M,Black/African American,Not Span/Hispanic,2,Emergency,Home or Self Care,2019,MUS026,MUSCLE DISORDERS,,,351,OTHER MUSCULOSKELETAL SYSTEM & CONNECTIVE TISSUE DIAGNOSES,08,DISEASES AND DISORDERS OF THE MUSCULOSKELETAL SYSTEM AND CONNECTIVE TISSUE,2,Moderate,Moderate,Medical,Private Health Insurance,,,,,true,24865.98,4637.91
Long Island,Nassau,2908000,000511,NYU Langone Hospital-Long Island,70 or Older,115,F,White,Not Span/Hispanic,3,Trauma,Skilled Nursing Home,2019,INJ024,"SPRAINS AND STRAINS, INITIAL ENCOUNTER",,,351,OTHER MUSCULOSKELETAL SYSTEM & CONNECTIVE TISSUE DIAGNOSES,08,DISEASES AND DISORDERS OF THE MUSCULOSKELETAL SYSTEM AND CONNECTIVE TISSUE,1,Minor,Moderate,Medical,Medicare,Medicare,Blue Cross/Blue Shield,,,true,59756.65,10194.21
Long Island,Nassau,2908000,000511,NYU Langone Hospital-Long Island,30 to 49,115,M,White,Not Span/Hispanic,3,Emergency,Home or Self Care,2019,MUS034,CRYSTAL ARTHROPATHIES (EXCLUDING GOUT),,,351,OTHER MUSCULOSKELETAL SYSTEM & CONNECTIVE TISSUE DIAGNOSES,08,DISEASES AND DISORDERS OF THE MUSCULOSKELETAL SYSTEM AND CONNECTIVE TISSUE,2,Moderate,Minor,Medical,Private Health Insurance,,,,,true,41477.04,7481.39
Long Island,Nassau,2908000,000511,NYU Langone Hospital-Long Island,30 to 49,115,F,Black/African American,Not Span/Hispanic,5,Emergency,Home or Self Care,2019,MUS025,OTHER SPECIFIED CONNECTIVE TISSUE DISEASE,,,351,OTHER MUSCULOSKELETAL SYSTEM & CONNECTIVE TISSUE DIAGNOSES,08,DISEASES AND DISORDERS OF THE MUSCULOSKELETAL SYSTEM AND CONNECTIVE TISSUE,1,Minor,Minor,Medical,Private Health Insurance,Blue Cross/Blue Shield,,,,true,59231.41,11287.03
Long Island,Nassau,2908000,000511,NYU Langone Hospital-Long Island,70 or Older,110,F,White,Not Span/Hispanic,6,Emergency,Skilled Nursing Home,2019,MUS026,MUSCLE DISORDERS,MAM011,ELECTROENCEPHALOGRAM (EEG),351,OTHER MUSCULOSKELETAL SYSTEM & CONNECTIVE TISSUE DIAGNOSES,08,DISEASES AND DISORDERS OF THE MUSCULOSKELETAL SYSTEM AND CONNECTIVE TISSUE,2,Moderate,Minor,Medical,Medicare,Medicare,Private Health Insurance,,,true,96166.45,14801.51
Long Island,Nassau,2908000,000511,NYU Langone Hospital-Long Island,50 to 69,115,F,White,Spanish/Hispanic,9,Emergency,Home w/ Home Health Services,2019,MUS025,OTHER SPECIFIED CONNECTIVE TISSUE DISEASE,,,351,OTHER MUSCULOSKELETAL SYSTEM & CONNECTIVE TISSUE DIAGNOSES,08,DISEASES AND DISORDERS OF THE MUSCULOSKELETAL SYSTEM AND CONNECTIVE TISSUE,2,Moderate,Minor,Medical,Federal/State/Local/VA,,,,,true,102720.97,19215.51
Long Island,Nassau,2908000,000511,NYU Langone Hospital-Long Island,70 or Older,115,F,White,Not Span/Hispanic,1,Emergency,Home w/ Home Health Services,2019,MUS025,OTHER SPECIFIED CONNECTIVE TISSUE DISEASE,ADM016,ADMINISTRATION OF ANTI-INFLAMMATORY AGENTS,351,OTHER MUSCULOSKELETAL SYSTEM & CONNECTIVE TISSUE DIAGNOSES,08,DISEASES AND DISORDERS OF THE MUSCULOSKELETAL SYSTEM AND CONNECTIVE TISSUE,1,Minor,Minor,Medical,Medicare,Medicare,Blue Cross/Blue Shield,,,true,27165.75,3625.86
Long Island,Nassau,2908000,000511,NYU Langone Hospital-Long Island,18 to 29,117,F,White,Not Span/Hispanic,1,Emergency,Home or Self Care,2019,MUS010,"MUSCULOSKELETAL PAIN, NOT LOW BACK PAIN",,,351,OTHER MUSCULOSKELETAL SYSTEM & CONNECTIVE TISSUE DIAGNOSES,08,DISEASES AND DISORDERS OF THE MUSCULOSKELETAL SYSTEM AND CONNECTIVE TISSUE,1,Minor,Minor,Medical,Medicaid,Medicaid,,,,true,25501.81,3684.88
Long Island,Nassau,2908000,000511,NYU Langone Hospital-Long Island,70 or Older,115,F,White,Not Span/Hispanic,5,Emergency,Skilled Nursing Home,2019,MUS007,OTHER SPECIFIED JOINT DISORDERS,,,351,OTHER MUSCULOSKELETAL SYSTEM & CONNECTIVE TISSUE DIAGNOSES,08,DISEASES AND DISORDERS OF THE MUSCULOSKELETAL SYSTEM AND CONNECTIVE TISSUE,2,Moderate,Moderate,Medical,Medicare,Medicare,Private Health Insurance,,,true,55287.21,11721.03
Long Island,Nassau,2908000,000511,NYU Langone Hospital-Long Island,70 or Older,115,F,White,Not Span/Hispanic,5,Emergency,Skilled Nursing Home,2019,MUS034,CRYSTAL ARTHROPATHIES (EXCLUDING GOUT),MST004,INCISION AND DRAINAGE OF MUSCULOSKELETAL TISSUE AND JOINTS,351,OTHER MUSCULOSKELETAL SYSTEM & CONNECTIVE TISSUE DIAGNOSES,08,DISEASES AND DISORDERS OF THE MUSCULOSKELETAL SYSTEM AND CONNECTIVE TISSUE,2,Moderate,Moderate,Medical,Medicare,Medicare,Blue Cross/Blue Shield,,,true,65536.81,12574.79
Long Island,Nassau,2908000,000511,NYU Langone Hospital-Long Island,70 or Older,115,F,White,Not Span/Hispanic,6,Trauma,Skilled Nursing Home,2019,INJ024,"SPRAINS AND STRAINS, INITIAL ENCOUNTER",,,351,OTHER MUSCULOSKELETAL SYSTEM & CONNECTIVE TISSUE DIAGNOSES,08,DISEASES AND DISORDERS OF THE MUSCULOSKELETAL SYSTEM AND CONNECTIVE TISSUE,3,Major,Major,Medical,Medicare,Medicare,,,,true,117931.46,16511.56
Long Island,Nassau,2908000,000511,NYU Langone Hospital-Long Island,18 to 29,115,M,Other Race,Spanish/Hispanic,2,Emergency,Home or Self Care,2019,MUS026,MUSCLE DISORDERS,,,351,OTHER MUSCULOSKELETAL SYSTEM & CONNECTIVE TISSUE DIAGNOSES,08,DISEASES AND DISORDERS OF THE MUSCULOSKELETAL SYSTEM AND CONNECTIVE TISSUE,2,Moderate,Minor,Medical,Medicaid,,,,,true,25162.17,4728.47
Long Island,Nassau,2908000,000511,NYU Langone Hospital-Long Island,70 or Older,115,F,White,Not Span/Hispanic,18,Trauma,Skilled Nursing Home,2019,MUS026,MUSCLE DISORDERS,MAM008,CARDIAC MONITORING,351,OTHER MUSCULOSKELETAL SYSTEM & CONNECTIVE TISSUE DIAGNOSES,08,DISEASES AND DISORDERS OF THE MUSCULOSKELETAL SYSTEM AND CONNECTIVE TISSUE,2,Moderate,Moderate,Medical,Medicare,Medicare,Blue Cross/Blue Shield,,,true,219425.06,40440.79
Long Island,Nassau,2908000,000511,NYU Langone Hospital-Long Island,70 or Older,115,F,White,Spanish/Hispanic,12,Emergency,Skilled Nursing Home,2019,INJ024,"SPRAINS AND STRAINS, INITIAL ENCOUNTER",,,351,OTHER MUSCULOSKELETAL SYSTEM & CONNECTIVE TISSUE DIAGNOSES,08,DISEASES AND DISORDERS OF THE MUSCULOSKELETAL SYSTEM AND CONNECTIVE TISSUE,3,Major,Major,Medical,Medicare,Medicare,Medicaid,,,true,127074.65,26748.57
Long Island,Nassau,2908000,000511,NYU Langone Hospital-Long Island,70 or Older,115,F,White,Not Span/Hispanic,4,Emergency,Skilled Nursing Home,2019,MUS006,OSTEOARTHRITIS,,,351,OTHER MUSCULOSKELETAL SYSTEM & CONNECTIVE TISSUE DIAGNOSES,08,DISEASES AND DISORDERS OF THE MUSCULOSKELETAL SYSTEM AND CONNECTIVE TISSUE,3,Major,Moderate,Medical,Medicare,Medicare,Medicaid,,,true,43593.73,8890.04
Long Island,Nassau,2908000,000511,NYU Langone Hospital-Long Island,70 or Older,115,M,White,Not Span/Hispanic,3,Trauma,Home w/ Home Health Services,2019,INJ026,OTHER SPECIFIED INJURY,,,351,OTHER MUSCULOSKELETAL SYSTEM & CONNECTIVE TISSUE DIAGNOSES,08,DISEASES AND DISORDERS OF THE MUSCULOSKELETAL SYSTEM AND CONNECTIVE TISSUE,1,Minor,Minor,Medical,Medicare,Medicare,Private Health Insurance,,,true,49795.04,8067.12
Long Island,Nassau,2908000,000511,NYU Langone Hospital-Long Island,30 to 49,115,F,White,Not Span/Hispanic,2,Emergency,Home or Self Care,2019,MUS021,ACQUIRED FOOT DEFORMITIES,,,351,OTHER MUSCULOSKELETAL SYSTEM & CONNECTIVE TISSUE DIAGNOSES,08,DISEASES AND DISORDERS OF THE MUSCULOSKELETAL SYSTEM AND CONNECTIVE TISSUE,2,Moderate,Minor,Medical,Blue Cross/Blue Shield,,,,,true,60036.24,6351.49