Hospital Service Area,Hospital County,Operating Certificate Number,Permanent Facility Id,Facility Name,Age Group,Zip Code - 3 digits,Gender,Race,Ethnicity,Length of Stay,Type of Admission,Patient Disposition,Discharge Year,CCS Diagnosis Code,CCS Diagnosis Description,CCS Procedure Code,CCS Procedure Description,APR DRG Code,APR DRG Description,APR MDC Code,APR MDC Description,APR Severity of Illness Code,APR Severity of Illness Description,APR Risk of Mortality,APR Medical Surgical Description,Payment Typology 1,Payment Typology 2,Payment Typology 3,Birth Weight,Abortion Edit Indicator,Emergency Department Indicator,Total Charges,Total Costs
Long Island,Nassau,2908000,000511,NYU Langone Hospital-Long Island,70 or Older,110,F,White,Not Span/Hispanic,5,Emergency,Skilled Nursing Home,2020,MUS009,TENDON AND SYNOVIAL DISORDERS,,,351,OTHER MUSCULOSKELETAL SYSTEM & CONNECTIVE TISSUE DIAGNOSES,08,DISEASES AND DISORDERS OF THE MUSCULOSKELETAL SYSTEM AND CONNECTIVE TISSUE,1,Minor,Minor,Medical,Private Health Insurance,,,,,Y,43164.52,16973.07
Long Island,Nassau,2908000,000511,NYU Langone Hospital-Long Island,0 to 17,115,M,White,Not Span/Hispanic,3,Emergency,Home or Self Care,2020,MUS026,MUSCLE DISORDERS,,,351,OTHER MUSCULOSKELETAL SYSTEM & CONNECTIVE TISSUE DIAGNOSES,08,DISEASES AND DISORDERS OF THE MUSCULOSKELETAL SYSTEM AND CONNECTIVE TISSUE,2,Moderate,Minor,Medical,Medicaid,,,,,Y,28982.92,8476.04
Long Island,Nassau,2908000,000511,NYU Langone Hospital-Long Island,0 to 17,115,M,Other Race,Spanish/Hispanic,4,Emergency,Home or Self Care,2020,MUS007,OTHER SPECIFIED JOINT DISORDERS,MST001,ARTHROCENTESIS,351,OTHER MUSCULOSKELETAL SYSTEM & CONNECTIVE TISSUE DIAGNOSES,08,DISEASES AND DISORDERS OF THE MUSCULOSKELETAL SYSTEM AND CONNECTIVE TISSUE,3,Major,Minor,Medical,Medicaid,,,,,Y,72294.13,11852.52
Long Island,Nassau,2908000,000511,NYU Langone Hospital-Long Island,50 to 69,115,M,White,Not Span/Hispanic,6,Emergency,Skilled Nursing Home,2020,MUS026,MUSCLE DISORDERS,MAM011,ELECTROENCEPHALOGRAM (EEG),351,OTHER MUSCULOSKELETAL SYSTEM & CONNECTIVE TISSUE DIAGNOSES,08,DISEASES AND DISORDERS OF THE MUSCULOSKELETAL SYSTEM AND CONNECTIVE TISSUE,2,Moderate,Moderate,Medical,Blue Cross/Blue Shield,,,,,Y,104829.88,24688.02
Long Island,Nassau,2908000,000511,NYU Langone Hospital-Long Island,50 to 69,115,M,Black/African American,Not Span/Hispanic,6,Emergency,Home or Self Care,2020,MUS033,GOUT,,,351,OTHER MUSCULOSKELETAL SYSTEM & CONNECTIVE TISSUE DIAGNOSES,08,DISEASES AND DISORDERS OF THE MUSCULOSKELETAL SYSTEM AND CONNECTIVE TISSUE,2,Moderate,Minor,Medical,Medicaid,,,,,Y,63334.58,20602.99
Long Island,Nassau,2908000,000511,NYU Langone Hospital-Long Island,30 to 49,115,F,Black/African American,Not Span/Hispanic,7,Emergency,Home or Self Care,2020,MUS026,MUSCLE DISORDERS,,,351,OTHER MUSCULOSKELETAL SYSTEM & CONNECTIVE TISSUE DIAGNOSES,08,DISEASES AND DISORDERS OF THE MUSCULOSKELETAL SYSTEM AND CONNECTIVE TISSUE,2,Moderate,Minor,Medical,Blue Cross/Blue Shield,,,,,Y,95355.45,26565.64
Long Island,Nassau,2908000,000511,NYU Langone Hospital-Long Island,50 to 69,110,M,White,Not Span/Hispanic,7,Emergency,Home w/ Home Health Services,2020,MUS030,ASEPTIC NECROSIS AND OSTEONECROSIS,IMG005,MAGNETIC RESONANCE IMAGING (MRI),351,OTHER MUSCULOSKELETAL SYSTEM & CONNECTIVE TISSUE DIAGNOSES,08,DISEASES AND DISORDERS OF THE MUSCULOSKELETAL SYSTEM AND CONNECTIVE TISSUE,2,Moderate,Moderate,Medical,Medicare,,,,,Y,112979.53,30211
Long Island,Nassau,2908000,000511,NYU Langone Hospital-Long Island,70 or Older,118,F,White,Not Span/Hispanic,2,Elective,Home w/ Home Health Services,2020,MUS006,OSTEOARTHRITIS,MST020,SUBCUTANEOUS TISSUE AND FASCIA EXCISION,351,OTHER MUSCULOSKELETAL SYSTEM & CONNECTIVE TISSUE DIAGNOSES,08,DISEASES AND DISORDERS OF THE MUSCULOSKELETAL SYSTEM AND CONNECTIVE TISSUE,2,Moderate,Minor,Medical,Medicare,Medicare,,,,N,56150.88,12030.81
Long Island,Nassau,2908000,000511,NYU Langone Hospital-Long Island,70 or Older,115,M,White,Not Span/Hispanic,7,Emergency,Inpatient Rehabilitation Facility,2020,MUS026,MUSCLE DISORDERS,,,351,OTHER MUSCULOSKELETAL SYSTEM & CONNECTIVE TISSUE DIAGNOSES,08,DISEASES AND DISORDERS OF THE MUSCULOSKELETAL SYSTEM AND CONNECTIVE TISSUE,3,Major,Extreme,Medical,Medicare,Blue Cross/Blue Shield,,,,Y,139974.36,30736.62
Long Island,Nassau,2908000,000511,NYU Langone Hospital-Long Island,18 to 29,OOS,F,White,Not Span/Hispanic,1,Emergency,Home or Self Care,2020,MAL008,MUSCULOSKELETAL CONGENITAL CONDITIONS,OTR004,ISOLATION PROCEDURES,351,OTHER MUSCULOSKELETAL SYSTEM & CONNECTIVE TISSUE DIAGNOSES,08,DISEASES AND DISORDERS OF THE MUSCULOSKELETAL SYSTEM AND CONNECTIVE TISSUE,3,Major,Moderate,Medical,Blue Cross/Blue Shield,,,,,Y,17189.84,3436.25
Long Island,Nassau,2908000,000511,NYU Langone Hospital-Long Island,30 to 49,117,M,Black/African American,Not Span/Hispanic,1,Emergency,Home or Self Care,2020,MUS026,MUSCLE DISORDERS,,,351,OTHER MUSCULOSKELETAL SYSTEM & CONNECTIVE TISSUE DIAGNOSES,08,DISEASES AND DISORDERS OF THE MUSCULOSKELETAL SYSTEM AND CONNECTIVE TISSUE,2,Moderate,Minor,Medical,Private Health Insurance,,,,,Y,14990.96,4199.9
Long Island,Nassau,2908000,000511,NYU Langone Hospital-Long Island,30 to 49,114,F,Black/African American,Not Span/Hispanic,2,Emergency,Home or Self Care,2020,MUS025,OTHER SPECIFIED CONNECTIVE TISSUE DISEASE,,,351,OTHER MUSCULOSKELETAL SYSTEM & CONNECTIVE TISSUE DIAGNOSES,08,DISEASES AND DISORDERS OF THE MUSCULOSKELETAL SYSTEM AND CONNECTIVE TISSUE,1,Minor,Minor,Medical,Private Health Insurance,Medicare,,,,Y,52992.01,14868.79
Long Island,Nassau,2908000,000511,NYU Langone Hospital-Long Island,70 or Older,115,F,White,Not Span/Hispanic,4,Emergency,Home w/ Home Health Services,2020,MUS007,OTHER SPECIFIED JOINT DISORDERS,MST001,ARTHROCENTESIS,351,OTHER MUSCULOSKELETAL SYSTEM & CONNECTIVE TISSUE DIAGNOSES,08,DISEASES AND DISORDERS OF THE MUSCULOSKELETAL SYSTEM AND CONNECTIVE TISSUE,2,Moderate,Minor,Medical,Medicare,Medicare,,,,Y,50169.62,15136.29
Long Island,Nassau,2908000,000511,NYU Langone Hospital-Long Island,50 to 69,110,M,White,Not Span/Hispanic,3,Emergency,Home or Self Care,2020,MUS034,CRYSTAL ARTHROPATHIES (EXCLUDING GOUT),,,351,OTHER MUSCULOSKELETAL SYSTEM & CONNECTIVE TISSUE DIAGNOSES,08,DISEASES AND DISORDERS OF THE MUSCULOSKELETAL SYSTEM AND CONNECTIVE TISSUE,1,Minor,Moderate,Medical,Blue Cross/Blue Shield,Medicare,,,,Y,46521.92,12380.21
Long Island,Nassau,2908000,000511,NYU Langone Hospital-Long Island,70 or Older,115,F,White,Not Span/Hispanic,2,Emergency,Home w/ Home Health Services,2020,MUS033,GOUT,,,351,OTHER MUSCULOSKELETAL SYSTEM & CONNECTIVE TISSUE DIAGNOSES,08,DISEASES AND DISORDERS OF THE MUSCULOSKELETAL SYSTEM AND CONNECTIVE TISSUE,3,Major,Major,Medical,Medicare,Medicare,,,,Y,49078.99,14580.46
Long Island,Nassau,2908000,000511,NYU Langone Hospital-Long Island,70 or Older,115,F,White,Not Span/Hispanic,5,Emergency,Skilled Nursing Home,2020,MUS026,MUSCLE DISORDERS,,,351,OTHER MUSCULOSKELETAL SYSTEM & CONNECTIVE TISSUE DIAGNOSES,08,DISEASES AND DISORDERS OF THE MUSCULOSKELETAL SYSTEM AND CONNECTIVE TISSUE,2,Moderate,Moderate,Medical,Blue Cross/Blue Shield,,,,,Y,77416.61,20605.42
Long Island,Nassau,2908000,000511,NYU Langone Hospital-Long Island,70 or Older,115,F,White,Not Span/Hispanic,2,Emergency,Home w/ Home Health Services,2020,MUS033,GOUT,,,351,OTHER MUSCULOSKELETAL SYSTEM & CONNECTIVE TISSUE DIAGNOSES,08,DISEASES AND DISORDERS OF THE MUSCULOSKELETAL SYSTEM AND CONNECTIVE TISSUE,2,Moderate,Moderate,Medical,Medicare,Medicare,,,,Y,28972.43,7915.76
Long Island,Nassau,2908000,000511,NYU Langone Hospital-Long Island,50 to 69,115,M,Other Race,Spanish/Hispanic,4,Emergency,Home or Self Care,2020,MUS033,GOUT,MST001,ARTHROCENTESIS,351,OTHER MUSCULOSKELETAL SYSTEM & CONNECTIVE TISSUE DIAGNOSES,08,DISEASES AND DISORDERS OF THE MUSCULOSKELETAL SYSTEM AND CONNECTIVE TISSUE,2,Moderate,Moderate,Medical,Blue Cross/Blue Shield,,,,,Y,46498.31,17296.95
Long Island,Nassau,2908000,000511,NYU Langone Hospital-Long Island,30 to 49,115,M,Black/African American,Not Span/Hispanic,2,Emergency,Home or Self Care,2020,MUS033,GOUT,,,351,OTHER MUSCULOSKELETAL SYSTEM & CONNECTIVE TISSUE DIAGNOSES,08,DISEASES AND DISORDERS OF THE MUSCULOSKELETAL SYSTEM AND CONNECTIVE TISSUE,1,Minor,Minor,Medical,Private Health Insurance,,,,,Y,26930.32,7854.65
Long Island,Nassau,2908000,000511,NYU Langone Hospital-Long Island,70 or Older,115,F,Black/African American,Not Span/Hispanic,2,Emergency,Home w/ Home Health Services,2020,MUS034,CRYSTAL ARTHROPATHIES (EXCLUDING GOUT),,,351,OTHER MUSCULOSKELETAL SYSTEM & CONNECTIVE TISSUE DIAGNOSES,08,DISEASES AND DISORDERS OF THE MUSCULOSKELETAL SYSTEM AND CONNECTIVE TISSUE,2,Moderate,Moderate,Medical,Medicare,Medicare,,,,Y,39280.27,8992.16
Long Island,Nassau,2908000,000511,NYU Langone Hospital-Long Island,70 or Older,115,F,White,Not Span/Hispanic,4,Emergency,Home or Self Care,2020,MUS034,CRYSTAL ARTHROPATHIES (EXCLUDING GOUT),,,351,OTHER MUSCULOSKELETAL SYSTEM & CONNECTIVE TISSUE DIAGNOSES,08,DISEASES AND DISORDERS OF THE MUSCULOSKELETAL SYSTEM AND CONNECTIVE TISSUE,2,Moderate,Moderate,Medical,Medicare,Medicare,,,,Y,45723.74,14338.37
Long Island,Nassau,2908000,000511,NYU Langone Hospital-Long Island,70 or Older,110,F,Black/African American,Not Span/Hispanic,4,Emergency,Home w/ Home Health Services,2020,MUS006,OSTEOARTHRITIS,,,351,OTHER MUSCULOSKELETAL SYSTEM & CONNECTIVE TISSUE DIAGNOSES,08,DISEASES AND DISORDERS OF THE MUSCULOSKELETAL SYSTEM AND CONNECTIVE TISSUE,2,Moderate,Major,Medical,Medicare,,,,,Y,63778.87,15895.59
Long Island,Nassau,2908000,000511,NYU Langone Hospital-Long Island,70 or Older,115,M,Black/African American,Not Span/Hispanic,2,Emergency,Home w/ Home Health Services,2020,MUS025,OTHER SPECIFIED CONNECTIVE TISSUE DISEASE,,,351,OTHER MUSCULOSKELETAL SYSTEM & CONNECTIVE TISSUE DIAGNOSES,08,DISEASES AND DISORDERS OF THE MUSCULOSKELETAL SYSTEM AND CONNECTIVE TISSUE,1,Minor,Major,Medical,Medicare,Medicare,,,,Y,49355.14,10732.62
Long Island,Nassau,2908000,000511,NYU Langone Hospital-Long Island,70 or Older,117,M,White,Not Span/Hispanic,9,Emergency,Skilled Nursing Home,2020,MUS033,GOUT,,,351,OTHER MUSCULOSKELETAL SYSTEM & CONNECTIVE TISSUE DIAGNOSES,08,DISEASES AND DISORDERS OF THE MUSCULOSKELETAL SYSTEM AND CONNECTIVE TISSUE,3,Major,Major,Medical,Blue Cross/Blue Shield,Medicare,,,,Y,95896.6,31156.54
Long Island,Nassau,2908000,000511,NYU Langone Hospital-Long Island,70 or Older,115,M,White,Not Span/Hispanic,10,Emergency,Skilled Nursing Home,2020,INJ024,"SPRAINS AND STRAINS, INITIAL ENCOUNTER",ENT002,ENT DIAGNOSTIC ENDOSCOPY (EXCLUDING LARYNGOSCOPY),351,OTHER MUSCULOSKELETAL SYSTEM & CONNECTIVE TISSUE DIAGNOSES,08,DISEASES AND DISORDERS OF THE MUSCULOSKELETAL SYSTEM AND CONNECTIVE TISSUE,3,Major,Major,Medical,Medicare,,,,,Y,89768.87,33230.97
Long Island,Nassau,2908000,000511,NYU Langone Hospital-Long Island,50 to 69,OOS,F,White,Not Span/Hispanic,2,Emergency,Home or Self Care,2020,MUS009,TENDON AND SYNOVIAL DISORDERS,,,351,OTHER MUSCULOSKELETAL SYSTEM & CONNECTIVE TISSUE DIAGNOSES,08,DISEASES AND DISORDERS OF THE MUSCULOSKELETAL SYSTEM AND CONNECTIVE TISSUE,2,Moderate,Major,Medical,Medicare,,,,,Y,49212.29,9908.79
Long Island,Nassau,2908000,000511,NYU Langone Hospital-Long Island,70 or Older,110,M,White,Not Span/Hispanic,5,Emergency,Home w/ Home Health Services,2020,MUS026,MUSCLE DISORDERS,,,351,OTHER MUSCULOSKELETAL SYSTEM & CONNECTIVE TISSUE DIAGNOSES,08,DISEASES AND DISORDERS OF THE MUSCULOSKELETAL SYSTEM AND CONNECTIVE TISSUE,2,Moderate,Moderate,Medical,Medicare,,,,,Y,62261.17,18430.3
Long Island,Nassau,2908000,000511,NYU Langone Hospital-Long Island,50 to 69,115,M,Black/African American,Not Span/Hispanic,7,Emergency,Skilled Nursing Home,2020,MUS033,GOUT,,,351,OTHER MUSCULOSKELETAL SYSTEM & CONNECTIVE TISSUE DIAGNOSES,08,DISEASES AND DISORDERS OF THE MUSCULOSKELETAL SYSTEM AND CONNECTIVE TISSUE,2,Moderate,Moderate,Medical,Medicaid,,,,,Y,100512.75,26480.58
Long Island,Nassau,2908000,000511,NYU Langone Hospital-Long Island,70 or Older,115,F,Black/African American,Not Span/Hispanic,2,Emergency,Home or Self Care,2020,MUS025,OTHER SPECIFIED CONNECTIVE TISSUE DISEASE,,,351,OTHER MUSCULOSKELETAL SYSTEM & CONNECTIVE TISSUE DIAGNOSES,08,DISEASES AND DISORDERS OF THE MUSCULOSKELETAL SYSTEM AND CONNECTIVE TISSUE,2,Moderate,Moderate,Medical,Medicare,Blue Cross/Blue Shield,,,,Y,41837.36,12842.7
Long Island,Nassau,2908000,000511,NYU Langone Hospital-Long Island,50 to 69,115,F,White,Not Span/Hispanic,3,Emergency,Skilled Nursing Home,2020,MUS025,OTHER SPECIFIED CONNECTIVE TISSUE DISEASE,,,351,OTHER MUSCULOSKELETAL SYSTEM & CONNECTIVE TISSUE DIAGNOSES,08,DISEASES AND DISORDERS OF THE MUSCULOSKELETAL SYSTEM AND CONNECTIVE TISSUE,1,Minor,Minor,Medical,Medicare,Private Health Insurance,,,,Y,76566.51,21164.34
Long Island,Nassau,2908000,000511,NYU Langone Hospital-Long Island,50 to 69,115,F,Black/African American,Not Span/Hispanic,5,Emergency,Skilled Nursing Home,2020,MUS006,OSTEOARTHRITIS,,,351,OTHER MUSCULOSKELETAL SYSTEM & CONNECTIVE TISSUE DIAGNOSES,08,DISEASES AND DISORDERS OF THE MUSCULOSKELETAL SYSTEM AND CONNECTIVE TISSUE,1,Minor,Minor,Medical,Medicare,,,,,Y,57190.62,18152.28
Long Island,Nassau,2908000,000511,NYU Langone Hospital-Long Island,70 or Older,113,F,White,Not Span/Hispanic,2,Emergency,Skilled Nursing Home,2020,MUS010,"MUSCULOSKELETAL PAIN, NOT LOW BACK PAIN",,,351,OTHER MUSCULOSKELETAL SYSTEM & CONNECTIVE TISSUE DIAGNOSES,08,DISEASES AND DISORDERS OF THE MUSCULOSKELETAL SYSTEM AND CONNECTIVE TISSUE,2,Moderate,Minor,Medical,Medicare,Medicaid,,,,Y,64620.89,12462.02
Long Island,Nassau,2908000,000511,NYU Langone Hospital-Long Island,50 to 69,117,M,White,Unknown,1,Emergency,Home or Self Care,2020,MUS034,CRYSTAL ARTHROPATHIES (EXCLUDING GOUT),,,351,OTHER MUSCULOSKELETAL SYSTEM & CONNECTIVE TISSUE DIAGNOSES,08,DISEASES AND DISORDERS OF THE MUSCULOSKELETAL SYSTEM AND CONNECTIVE TISSUE,1,Minor,Minor,Medical,Private Health Insurance,,,,,Y,14948.68,4166.36
Long Island,Nassau,2908000,000511,NYU Langone Hospital-Long Island,50 to 69,115,M,Black/African American,Not Span/Hispanic,6,Emergency,Skilled Nursing Home,2020,MUS006,OSTEOARTHRITIS,,,351,OTHER MUSCULOSKELETAL SYSTEM & CONNECTIVE TISSUE DIAGNOSES,08,DISEASES AND DISORDERS OF THE MUSCULOSKELETAL SYSTEM AND CONNECTIVE TISSUE,1,Minor,Minor,Medical,Private Health Insurance,Medicaid,,,,Y,76518.18,21721.66
Long Island,Nassau,2908000,000511,NYU Langone Hospital-Long Island,50 to 69,115,F,White,Not Span/Hispanic,3,Emergency,Home or Self Care,2020,MUS033,GOUT,,,351,OTHER MUSCULOSKELETAL SYSTEM & CONNECTIVE TISSUE DIAGNOSES,08,DISEASES AND DISORDERS OF THE MUSCULOSKELETAL SYSTEM AND CONNECTIVE TISSUE,2,Moderate,Major,Medical,Private Health Insurance,,,,,Y,50362.04,11960.85
Long Island,Nassau,2908000,000511,NYU Langone Hospital-Long Island,30 to 49,115,F,White,Not Span/Hispanic,1,Emergency,Home or Self Care,2020,MUS010,"MUSCULOSKELETAL PAIN, NOT LOW BACK PAIN",,,351,OTHER MUSCULOSKELETAL SYSTEM & CONNECTIVE TISSUE DIAGNOSES,08,DISEASES AND DISORDERS OF THE MUSCULOSKELETAL SYSTEM AND CONNECTIVE TISSUE,2,Moderate,Minor,Medical,Blue Cross/Blue Shield,,,,,Y,27996.92,5595.07
Long Island,Nassau,2908000,000511,NYU Langone Hospital-Long Island,70 or Older,117,F,White,Not Span/Hispanic,2,Emergency,Home w/ Home Health Services,2020,MUS025,OTHER SPECIFIED CONNECTIVE TISSUE DISEASE,,,351,OTHER MUSCULOSKELETAL SYSTEM & CONNECTIVE TISSUE DIAGNOSES,08,DISEASES AND DISORDERS OF THE MUSCULOSKELETAL SYSTEM AND CONNECTIVE TISSUE,2,Moderate,Minor,Medical,Private Health Insurance,,,,,Y,33853.63,8842.22
Long Island,Nassau,2908000,000511,NYU Langone Hospital-Long Island,50 to 69,110,F,White,Not Span/Hispanic,11,Emergency,Skilled Nursing Home,2020,MUS034,CRYSTAL ARTHROPATHIES (EXCLUDING GOUT),,,351,OTHER MUSCULOSKELETAL SYSTEM & CONNECTIVE TISSUE DIAGNOSES,08,DISEASES AND DISORDERS OF THE MUSCULOSKELETAL SYSTEM AND CONNECTIVE TISSUE,1,Minor,Minor,Medical,Medicaid,,,,,Y,97811.84,36249.57
Long Island,Nassau,2908000,000511,NYU Langone Hospital-Long Island,70 or Older,110,F,White,Not Span/Hispanic,2,Emergency,Skilled Nursing Home,2020,MUS006,OSTEOARTHRITIS,,,351,OTHER MUSCULOSKELETAL SYSTEM & CONNECTIVE TISSUE DIAGNOSES,08,DISEASES AND DISORDERS OF THE MUSCULOSKELETAL SYSTEM AND CONNECTIVE TISSUE,2,Moderate,Minor,Medical,Medicare,,,,,Y,23589.49,7703.23
Long Island,Nassau,2908000,000511,NYU Langone Hospital-Long Island,50 to 69,115,M,Black/African American,Not Span/Hispanic,4,Emergency,Home or Self Care,2020,MUS010,"MUSCULOSKELETAL PAIN, NOT LOW BACK PAIN",MAM011,ELECTROENCEPHALOGRAM (EEG),351,OTHER MUSCULOSKELETAL SYSTEM & CONNECTIVE TISSUE DIAGNOSES,08,DISEASES AND DISORDERS OF THE MUSCULOSKELETAL SYSTEM AND CONNECTIVE TISSUE,2,Moderate,Minor,Medical,Medicaid,,,,,Y,98009.03,17152.19
Long Island,Nassau,2908000,000511,NYU Langone Hospital-Long Island,50 to 69,100,F,White,Not Span/Hispanic,2,Elective,Home or Self Care,2020,NEO073,BENIGN NEOPLASMS,GIS016,GI SYSTEM ENDOSCOPIC THERAPEUTIC PROCEDURES,351,OTHER MUSCULOSKELETAL SYSTEM & CONNECTIVE TISSUE DIAGNOSES,08,DISEASES AND DISORDERS OF THE MUSCULOSKELETAL SYSTEM AND CONNECTIVE TISSUE,3,Major,Minor,Medical,Medicaid,,,,,N,86258.24,15486.44
Long Island,Nassau,2908000,000511,NYU Langone Hospital-Long Island,70 or Older,115,F,White,Not Span/Hispanic,4,Emergency,Home w/ Home Health Services,2020,MUS006,OSTEOARTHRITIS,,,351,OTHER MUSCULOSKELETAL SYSTEM & CONNECTIVE TISSUE DIAGNOSES,08,DISEASES AND DISORDERS OF THE MUSCULOSKELETAL SYSTEM AND CONNECTIVE TISSUE,2,Moderate,Moderate,Medical,Medicare,Medicare,,,,Y,57559.78,15711.7
Long Island,Nassau,2908000,000511,NYU Langone Hospital-Long Island,70 or Older,115,F,White,Not Span/Hispanic,3,Trauma,Home w/ Home Health Services,2020,MUS033,GOUT,,,351,OTHER MUSCULOSKELETAL SYSTEM & CONNECTIVE TISSUE DIAGNOSES,08,DISEASES AND DISORDERS OF THE MUSCULOSKELETAL SYSTEM AND CONNECTIVE TISSUE,2,Moderate,Major,Medical,Medicare,Medicare,Medicaid,,,Y,47971.29,13372.67
Long Island,Nassau,2908000,000511,NYU Langone Hospital-Long Island,50 to 69,115,F,White,Not Span/Hispanic,3,Emergency,Home w/ Home Health Services,2020,MUS010,"MUSCULOSKELETAL PAIN, NOT LOW BACK PAIN",,,351,OTHER MUSCULOSKELETAL SYSTEM & CONNECTIVE TISSUE DIAGNOSES,08,DISEASES AND DISORDERS OF THE MUSCULOSKELETAL SYSTEM AND CONNECTIVE TISSUE,2,Moderate,Moderate,Medical,Medicare,,,,,Y,39592.07,11480.52
Long Island,Nassau,2908000,000511,NYU Langone Hospital-Long Island,70 or Older,117,F,White,Not Span/Hispanic,5,Emergency,Home w/ Home Health Services,2020,INJ024,"SPRAINS AND STRAINS, INITIAL ENCOUNTER",,,351,OTHER MUSCULOSKELETAL SYSTEM & CONNECTIVE TISSUE DIAGNOSES,08,DISEASES AND DISORDERS OF THE MUSCULOSKELETAL SYSTEM AND CONNECTIVE TISSUE,1,Minor,Moderate,Medical,Medicare,Private Health Insurance,,,,Y,81309.85,23370.54
Long Island,Nassau,2908000,000511,NYU Langone Hospital-Long Island,50 to 69,115,F,Black/African American,Not Span/Hispanic,7,Emergency,Home w/ Home Health Services,2020,INJ024,"SPRAINS AND STRAINS, INITIAL ENCOUNTER",ESA001,HEMODIALYSIS,351,OTHER MUSCULOSKELETAL SYSTEM & CONNECTIVE TISSUE DIAGNOSES,08,DISEASES AND DISORDERS OF THE MUSCULOSKELETAL SYSTEM AND CONNECTIVE TISSUE,3,Major,Major,Medical,Medicare,Medicaid,,,,Y,152721.09,45729.82
Long Island,Nassau,2908000,000511,NYU Langone Hospital-Long Island,70 or Older,110,F,White,Not Span/Hispanic,5,Emergency,Skilled Nursing Home,2020,MUS006,OSTEOARTHRITIS,,,351,OTHER MUSCULOSKELETAL SYSTEM & CONNECTIVE TISSUE DIAGNOSES,08,DISEASES AND DISORDERS OF THE MUSCULOSKELETAL SYSTEM AND CONNECTIVE TISSUE,1,Minor,Minor,Medical,Medicare,Blue Cross/Blue Shield,,,,Y,47592.82,16940.92
Long Island,Nassau,2908000,000511,NYU Langone Hospital-Long Island,50 to 69,117,M,White,Not Span/Hispanic,1,Elective,Home or Self Care,2020,MUS006,OSTEOARTHRITIS,,,351,OTHER MUSCULOSKELETAL SYSTEM & CONNECTIVE TISSUE DIAGNOSES,08,DISEASES AND DISORDERS OF THE MUSCULOSKELETAL SYSTEM AND CONNECTIVE TISSUE,1,Minor,Minor,Medical,Medicare,,,,,N,28462.87,6084.83
Long Island,Nassau,2908000,000511,NYU Langone Hospital-Long Island,50 to 69,115,F,Other Race,Not Span/Hispanic,1,Emergency,Home or Self Care,2020,MUS010,"MUSCULOSKELETAL PAIN, NOT LOW BACK PAIN",,,351,OTHER MUSCULOSKELETAL SYSTEM & CONNECTIVE TISSUE DIAGNOSES,08,DISEASES AND DISORDERS OF THE MUSCULOSKELETAL SYSTEM AND CONNECTIVE TISSUE,2,Moderate,Moderate,Medical,Private Health Insurance,,,,,Y,46306.06,10389.54
Long Island,Nassau,2908000,000511,NYU Langone Hospital-Long Island,50 to 69,117,M,White,Not Span/Hispanic,3,Elective,Home or Self Care,2020,NEO073,BENIGN NEOPLASMS,GIS016,GI SYSTEM ENDOSCOPIC THERAPEUTIC PROCEDURES,351,OTHER MUSCULOSKELETAL SYSTEM & CONNECTIVE TISSUE DIAGNOSES,08,DISEASES AND DISORDERS OF THE MUSCULOSKELETAL SYSTEM AND CONNECTIVE TISSUE,2,Moderate,Minor,Medical,Blue Cross/Blue Shield,,,,,N,104868.68,20046.03
Long Island,Nassau,2908000,000511,NYU Langone Hospital-Long Island,70 or Older,115,M,White,Not Span/Hispanic,7,Emergency,Home or Self Care,2020,SYM010,NERVOUS SYSTEM SIGNS AND SYMPTOMS,,,351,OTHER MUSCULOSKELETAL SYSTEM & CONNECTIVE TISSUE DIAGNOSES,08,DISEASES AND DISORDERS OF THE MUSCULOSKELETAL SYSTEM AND CONNECTIVE TISSUE,3,Major,Major,Medical,Medicare,,,,,Y,106150.03,26212.92
Long Island,Nassau,2908000,000511,NYU Langone Hospital-Long Island,70 or Older,117,M,White,Not Span/Hispanic,4,Trauma,Home w/ Home Health Services,2020,MUS007,OTHER SPECIFIED JOINT DISORDERS,MST015,CLOSED REDUCTION OF BONES AND JOINTS,351,OTHER MUSCULOSKELETAL SYSTEM & CONNECTIVE TISSUE DIAGNOSES,08,DISEASES AND DISORDERS OF THE MUSCULOSKELETAL SYSTEM AND CONNECTIVE TISSUE,1,Minor,Minor,Medical,Medicare,Blue Cross/Blue Shield,,,,Y,54176.05,16515.05
Long Island,Nassau,2908000,000511,NYU Langone Hospital-Long Island,30 to 49,110,M,Other Race,Spanish/Hispanic,3,Emergency,Home w/ Home Health Services,2020,MUS026,MUSCLE DISORDERS,OTR004,ISOLATION PROCEDURES,351,OTHER MUSCULOSKELETAL SYSTEM & CONNECTIVE TISSUE DIAGNOSES,08,DISEASES AND DISORDERS OF THE MUSCULOSKELETAL SYSTEM AND CONNECTIVE TISSUE,2,Moderate,Minor,Medical,Private Health Insurance,,,,,Y,37850.47,10853.5
Long Island,Nassau,2908000,000511,NYU Langone Hospital-Long Island,50 to 69,115,M,White,Not Span/Hispanic,4,Emergency,Home w/ Home Health Services,2020,INJ024,"SPRAINS AND STRAINS, INITIAL ENCOUNTER",,,351,OTHER MUSCULOSKELETAL SYSTEM & CONNECTIVE TISSUE DIAGNOSES,08,DISEASES AND DISORDERS OF THE MUSCULOSKELETAL SYSTEM AND CONNECTIVE TISSUE,2,Moderate,Moderate,Medical,Medicare,Medicare,,,,Y,61639.43,16117.68
Long Island,Nassau,2908000,000511,NYU Langone Hospital-Long Island,0 to 17,115,M,White,Not Span/Hispanic,3,Emergency,Home or Self Care,2020,MUS026,MUSCLE DISORDERS,MAM011,ELECTROENCEPHALOGRAM (EEG),351,OTHER MUSCULOSKELETAL SYSTEM & CONNECTIVE TISSUE DIAGNOSES,08,DISEASES AND DISORDERS OF THE MUSCULOSKELETAL SYSTEM AND CONNECTIVE TISSUE,2,Moderate,Minor,Medical,Blue Cross/Blue Shield,,,,,Y,60875.18,8863
Long Island,Nassau,2908000,000511,NYU Langone Hospital-Long Island,50 to 69,117,F,White,Not Span/Hispanic,11,Emergency,Home or Self Care,2020,MUS026,MUSCLE DISORDERS,MST003,"SUBCUTANEOUS TISSUE, FASCIA, AND MUSCLE BIOPSY",351,OTHER MUSCULOSKELETAL SYSTEM & CONNECTIVE TISSUE DIAGNOSES,08,DISEASES AND DISORDERS OF THE MUSCULOSKELETAL SYSTEM AND CONNECTIVE TISSUE,2,Moderate,Minor,Medical,Blue Cross/Blue Shield,,,,,Y,183148.69,45494.11
Long Island,Nassau,2908000,000511,NYU Langone Hospital-Long Island,70 or Older,115,F,White,Not Span/Hispanic,4,Emergency,Skilled Nursing Home,2020,MUS006,OSTEOARTHRITIS,OTR004,ISOLATION PROCEDURES,351,OTHER MUSCULOSKELETAL SYSTEM & CONNECTIVE TISSUE DIAGNOSES,08,DISEASES AND DISORDERS OF THE MUSCULOSKELETAL SYSTEM AND CONNECTIVE TISSUE,3,Major,Moderate,Medical,Medicare,,,,,Y,57732.67,16159.75