Hospital Service Area,Hospital County,Operating Certificate Number,Permanent Facility Id,Facility Name,Age Group,Zip Code - 3 digits,Gender,Race,Ethnicity,Length of Stay,Type of Admission,Patient Disposition,Discharge Year,CCS Diagnosis Code,CCS Diagnosis Description,CCS Procedure Code,CCS Procedure Description,APR DRG Code,APR DRG Description,APR MDC Code,APR MDC Description,APR Severity of Illness Code,APR Severity of Illness Description,APR Risk of Mortality,APR Medical Surgical Description,Payment Typology 1,Payment Typology 2,Payment Typology 3,Birth Weight,Abortion Edit Indicator,Emergency Department Indicator,Total Charges,Total Costs
Hudson Valley,Westchester,5932000,001129,Phelps Hospital,50 to 69,105,M,White,Not Span/Hispanic,3,Emergency,Home or Self Care,2019,END003,DIABETES MELLITUS WITH COMPLICATION,SKB008,SKIN EXCISION AND DEBRIDEMENT,361,SKIN GRAFT FOR SKIN & SUBCUTANEOUS TISSUE DIAGNOSES,09,"DISEASES AND DISORDERS OF THE SKIN, SUBCUTANEOUS TISSUE AND BREAST",2,Moderate,Minor,Surgical,Private Health Insurance,,,,,true,27438.09,9514.61
Finger Lakes,Monroe,2701003,000411,Rochester General Hospital,30 to 49,146,F,White,Not Span/Hispanic,3,Elective,Home or Self Care,2019,END016,OTHER SPECIFIED AND UNSPECIFIED NUTRITIONAL AND METABOLIC DISORDERS,MST020,SUBCUTANEOUS TISSUE AND FASCIA EXCISION,361,SKIN GRAFT FOR SKIN & SUBCUTANEOUS TISSUE DIAGNOSES,09,"DISEASES AND DISORDERS OF THE SKIN, SUBCUTANEOUS TISSUE AND BREAST",1,Minor,Minor,Surgical,Self-Pay,,,,,false,19059.68,6496.62
New York City,Manhattan,7002001,001438,Bellevue Hospital Center,30 to 49,113,F,Other Race,Spanish/Hispanic,1,Emergency,Home or Self Care,2019,MUS025,OTHER SPECIFIED CONNECTIVE TISSUE DISEASE,SKB008,SKIN EXCISION AND DEBRIDEMENT,361,SKIN GRAFT FOR SKIN & SUBCUTANEOUS TISSUE DIAGNOSES,09,"DISEASES AND DISORDERS OF THE SKIN, SUBCUTANEOUS TISSUE AND BREAST",1,Minor,Minor,Surgical,Medicaid,,,,,false,6391.09,4247.52
New York City,Manhattan,7002001,001438,Bellevue Hospital Center,30 to 49,114,F,Other Race,Spanish/Hispanic,1,Emergency,Home or Self Care,2019,INJ012,"OPEN WOUNDS TO LIMBS, INITIAL ENCOUNTER",SKB008,SKIN EXCISION AND DEBRIDEMENT,361,SKIN GRAFT FOR SKIN & SUBCUTANEOUS TISSUE DIAGNOSES,09,"DISEASES AND DISORDERS OF THE SKIN, SUBCUTANEOUS TISSUE AND BREAST",1,Minor,Minor,Surgical,Medicaid,Medicaid,,,,true,7243.99,4814.36
New York City,Manhattan,7002001,001438,Bellevue Hospital Center,30 to 49,113,M,Other Race,Not Span/Hispanic,1,Emergency,Home or Self Care,2019,SKN007,OTHER SPECIFIED AND UNSPECIFIED SKIN DISORDERS,SKB008,SKIN EXCISION AND DEBRIDEMENT,361,SKIN GRAFT FOR SKIN & SUBCUTANEOUS TISSUE DIAGNOSES,09,"DISEASES AND DISORDERS OF THE SKIN, SUBCUTANEOUS TISSUE AND BREAST",1,Minor,Minor,Surgical,Medicaid,,,,,false,6110,4060.71
New York City,Manhattan,7002001,001438,Bellevue Hospital Center,30 to 49,113,F,Other Race,Not Span/Hispanic,3,Elective,Home w/ Home Health Services,2019,NEO030,BREAST CANCER - ALL OTHER TYPES,SKB004,BREAST RECONSTRUCTION,361,SKIN GRAFT FOR SKIN & SUBCUTANEOUS TISSUE DIAGNOSES,09,"DISEASES AND DISORDERS OF THE SKIN, SUBCUTANEOUS TISSUE AND BREAST",1,Minor,Minor,Surgical,Medicaid,,,,,false,13576.42,9022.89
New York City,Manhattan,7002054,001458,New York-Presbyterian Hospital - New York Weill Cornell Center,50 to 69,100,F,White,Not Span/Hispanic,3,Elective,Home or Self Care,2019,NEO030,BREAST CANCER - ALL OTHER TYPES,SKB003,MASTECTOMY AND LUMPECTOMY,361,SKIN GRAFT FOR SKIN & SUBCUTANEOUS TISSUE DIAGNOSES,09,"DISEASES AND DISORDERS OF THE SKIN, SUBCUTANEOUS TISSUE AND BREAST",2,Moderate,Minor,Surgical,Medicare,Medicaid,Self-Pay,,,false,58613.31,15609.27
Finger Lakes,Monroe,2701003,000411,Rochester General Hospital,70 or Older,145,M,White,Not Span/Hispanic,2,Emergency,Home w/ Home Health Services,2019,END003,DIABETES MELLITUS WITH COMPLICATION,SKB008,SKIN EXCISION AND DEBRIDEMENT,361,SKIN GRAFT FOR SKIN & SUBCUTANEOUS TISSUE DIAGNOSES,09,"DISEASES AND DISORDERS OF THE SKIN, SUBCUTANEOUS TISSUE AND BREAST",2,Moderate,Moderate,Surgical,Medicare,,,,,true,6976.18,2704.16
Long Island,Suffolk,5154001,000925,Good Samaritan Hospital Medical Center,18 to 29,117,M,White,Not Span/Hispanic,2,Emergency,Home w/ Home Health Services,2019,INJ012,"OPEN WOUNDS TO LIMBS, INITIAL ENCOUNTER",SKB007,SKIN GRAFT,361,SKIN GRAFT FOR SKIN & SUBCUTANEOUS TISSUE DIAGNOSES,09,"DISEASES AND DISORDERS OF THE SKIN, SUBCUTANEOUS TISSUE AND BREAST",1,Minor,Minor,Surgical,Blue Cross/Blue Shield,,,,,true,32338.59,7385.17
New York City,Manhattan,7002024,001456,Mount Sinai Hospital,50 to 69,109,F,White,Not Span/Hispanic,1,Elective,Home or Self Care,2019,NEO029,BREAST CANCER - DUCTAL CARCINOMA IN SITU (DCIS),SKB004,BREAST RECONSTRUCTION,361,SKIN GRAFT FOR SKIN & SUBCUTANEOUS TISSUE DIAGNOSES,09,"DISEASES AND DISORDERS OF THE SKIN, SUBCUTANEOUS TISSUE AND BREAST",2,Moderate,Minor,Surgical,Medicaid,Medicaid,Self-Pay,,,false,50021.86,19630.67
New York City,Manhattan,7002024,001456,Mount Sinai Hospital,18 to 29,114,F,Black/African American,Not Span/Hispanic,11,Elective,Home w/ Home Health Services,2019,SKN002,OTHER SPECIFIED INFLAMMATORY CONDITION OF SKIN,SKB008,SKIN EXCISION AND DEBRIDEMENT,361,SKIN GRAFT FOR SKIN & SUBCUTANEOUS TISSUE DIAGNOSES,09,"DISEASES AND DISORDERS OF THE SKIN, SUBCUTANEOUS TISSUE AND BREAST",2,Moderate,Minor,Surgical,Medicaid,Medicaid,Self-Pay,,,false,145739.75,48743.44
Finger Lakes,Monroe,2701003,000411,Rochester General Hospital,30 to 49,146,F,Black/African American,Not Span/Hispanic,10,Emergency,Home or Self Care,2019,SKN001,SKIN AND SUBCUTANEOUS TISSUE INFECTIONS,GIS004,GI SYSTEM ENDOSCOPY WITHOUT BIOPSY (DIAGNOSTIC),361,SKIN GRAFT FOR SKIN & SUBCUTANEOUS TISSUE DIAGNOSES,09,"DISEASES AND DISORDERS OF THE SKIN, SUBCUTANEOUS TISSUE AND BREAST",3,Major,Major,Surgical,Medicaid,,,,,true,37165.79,17664.28
New York City,Richmond,7004003,001740,Staten Island University Hosp-North,18 to 29,OOS,F,Black/African American,Not Span/Hispanic,21,Emergency,Home w/ Home Health Services,2019,SKN002,OTHER SPECIFIED INFLAMMATORY CONDITION OF SKIN,SKB007,SKIN GRAFT,361,SKIN GRAFT FOR SKIN & SUBCUTANEOUS TISSUE DIAGNOSES,09,"DISEASES AND DISORDERS OF THE SKIN, SUBCUTANEOUS TISSUE AND BREAST",2,Moderate,Minor,Surgical,Private Health Insurance,,,,,true,280569.93,76636.23
New York City,Manhattan,7002032,001466,Mount Sinai West,30 to 49,100,M,Other Race,Spanish/Hispanic,26,Emergency,Skilled Nursing Home,2019,NEO073,BENIGN NEOPLASMS,CNS007,CNS EXCISION PROCEDURES,361,SKIN GRAFT FOR SKIN & SUBCUTANEOUS TISSUE DIAGNOSES,09,"DISEASES AND DISORDERS OF THE SKIN, SUBCUTANEOUS TISSUE AND BREAST",3,Major,Moderate,Surgical,Medicaid,Medicaid,Self-Pay,,,true,333924.19,85987.7
New York City,Kings,7001021,001306,New York - Presbyterian Brooklyn Methodist Hospital,18 to 29,112,M,Black/African American,Not Span/Hispanic,5,Emergency,Home w/ Home Health Services,2019,SKN003,PRESSURE ULCER OF SKIN,SKB007,SKIN GRAFT,361,SKIN GRAFT FOR SKIN & SUBCUTANEOUS TISSUE DIAGNOSES,09,"DISEASES AND DISORDERS OF THE SKIN, SUBCUTANEOUS TISSUE AND BREAST",3,Major,Major,Surgical,"Managed Care, Unspecified",Medicaid,Self-Pay,,,true,46319.41,15554.88
Finger Lakes,Monroe,2701005,000413,Strong Memorial Hospital,50 to 69,134,F,Other Race,Not Span/Hispanic,43,Emergency,Home w/ Home Health Services,2019,SKN002,OTHER SPECIFIED INFLAMMATORY CONDITION OF SKIN,SKB007,SKIN GRAFT,361,SKIN GRAFT FOR SKIN & SUBCUTANEOUS TISSUE DIAGNOSES,09,"DISEASES AND DISORDERS OF THE SKIN, SUBCUTANEOUS TISSUE AND BREAST",3,Major,Moderate,Surgical,Blue Cross/Blue Shield,,,,,true,239261.72,138847.23
New York City,Manhattan,7002054,001464,New York-Presbyterian Hospital - Columbia Presbyterian Center,30 to 49,100,M,Black/African American,Not Span/Hispanic,4,Urgent,Home or Self Care,2019,END003,DIABETES MELLITUS WITH COMPLICATION,SKB007,SKIN GRAFT,361,SKIN GRAFT FOR SKIN & SUBCUTANEOUS TISSUE DIAGNOSES,09,"DISEASES AND DISORDERS OF THE SKIN, SUBCUTANEOUS TISSUE AND BREAST",1,Minor,Minor,Surgical,Blue Cross/Blue Shield,Self-Pay,,,,false,57513.57,14607.52
New York City,Manhattan,7002054,001464,New York-Presbyterian Hospital - Columbia Presbyterian Center,50 to 69,100,F,Black/African American,Not Span/Hispanic,9,Emergency,Skilled Nursing Home,2019,SKN003,PRESSURE ULCER OF SKIN,SKB008,SKIN EXCISION AND DEBRIDEMENT,361,SKIN GRAFT FOR SKIN & SUBCUTANEOUS TISSUE DIAGNOSES,09,"DISEASES AND DISORDERS OF THE SKIN, SUBCUTANEOUS TISSUE AND BREAST",3,Major,Moderate,Surgical,Medicare,Medicare,Medicaid,,,true,99712.86,22557.13
New York City,Manhattan,7002054,001464,New York-Presbyterian Hospital - Columbia Presbyterian Center,0 to 17,112,F,Black/African American,Not Span/Hispanic,11,Emergency,Home w/ Home Health Services,2019,SKN001,SKIN AND SUBCUTANEOUS TISSUE INFECTIONS,MST030,"MUSCULOSKELETAL PROCEDURES, NEC",361,SKIN GRAFT FOR SKIN & SUBCUTANEOUS TISSUE DIAGNOSES,09,"DISEASES AND DISORDERS OF THE SKIN, SUBCUTANEOUS TISSUE AND BREAST",2,Moderate,Minor,Surgical,Blue Cross/Blue Shield,Self-Pay,,,,true,167695.76,41286.8
New York City,Kings,7001021,001306,New York - Presbyterian Brooklyn Methodist Hospital,70 or Older,112,F,White,Not Span/Hispanic,8,Emergency,Skilled Nursing Home,2019,END003,DIABETES MELLITUS WITH COMPLICATION,SKB008,SKIN EXCISION AND DEBRIDEMENT,361,SKIN GRAFT FOR SKIN & SUBCUTANEOUS TISSUE DIAGNOSES,09,"DISEASES AND DISORDERS OF THE SKIN, SUBCUTANEOUS TISSUE AND BREAST",2,Moderate,Moderate,Surgical,Blue Cross/Blue Shield,Medicare,Self-Pay,,,true,57634.62,14262.45
New York City,Kings,7001021,001306,New York - Presbyterian Brooklyn Methodist Hospital,50 to 69,112,M,White,Not Span/Hispanic,8,Emergency,Home w/ Home Health Services,2019,SKN003,PRESSURE ULCER OF SKIN,MST020,SUBCUTANEOUS TISSUE AND FASCIA EXCISION,361,SKIN GRAFT FOR SKIN & SUBCUTANEOUS TISSUE DIAGNOSES,09,"DISEASES AND DISORDERS OF THE SKIN, SUBCUTANEOUS TISSUE AND BREAST",3,Major,Major,Surgical,Medicare,Private Health Insurance,Self-Pay,,,true,75344.13,27403.18
New York City,Kings,7001021,001306,New York - Presbyterian Brooklyn Methodist Hospital,50 to 69,112,M,White,Not Span/Hispanic,3,Emergency,Home w/ Home Health Services,2019,END003,DIABETES MELLITUS WITH COMPLICATION,MST020,SUBCUTANEOUS TISSUE AND FASCIA EXCISION,361,SKIN GRAFT FOR SKIN & SUBCUTANEOUS TISSUE DIAGNOSES,09,"DISEASES AND DISORDERS OF THE SKIN, SUBCUTANEOUS TISSUE AND BREAST",3,Major,Major,Surgical,Medicare,Self-Pay,,,,true,32190.99,13595.71
New York City,Manhattan,7002020,001453,Memorial Hospital for Cancer and Allied Diseases,70 or Older,112,M,White,Unknown,1,Emergency,Home w/ Home Health Services,2019,NEO025,SKIN CANCERS - MELANOMA,SKB007,SKIN GRAFT,361,SKIN GRAFT FOR SKIN & SUBCUTANEOUS TISSUE DIAGNOSES,09,"DISEASES AND DISORDERS OF THE SKIN, SUBCUTANEOUS TISSUE AND BREAST",2,Moderate,Moderate,Surgical,Medicare,Private Health Insurance,,,,false,18828.45,7970.18
Capital/Adirond,Albany,0101004,000005,St. Peter's Hospital,70 or Older,122,M,Black/African American,Not Span/Hispanic,15,Emergency,Skilled Nursing Home,2019,SKN001,SKIN AND SUBCUTANEOUS TISSUE INFECTIONS,MST005,INCISION AND DRAINAGE OF SUBCUTANEOUS TISSUE AND FASCIA,361,SKIN GRAFT FOR SKIN & SUBCUTANEOUS TISSUE DIAGNOSES,09,"DISEASES AND DISORDERS OF THE SKIN, SUBCUTANEOUS TISSUE AND BREAST",4,Extreme,Extreme,Surgical,Medicare,Medicare,,,,true,96716.5,35323.29
New York City,Manhattan,7002032,001469,Mount Sinai Morningside,50 to 69,100,M,Black/African American,Not Span/Hispanic,8,Elective,Skilled Nursing Home,2019,END003,DIABETES MELLITUS WITH COMPLICATION,SKB007,SKIN GRAFT,361,SKIN GRAFT FOR SKIN & SUBCUTANEOUS TISSUE DIAGNOSES,09,"DISEASES AND DISORDERS OF THE SKIN, SUBCUTANEOUS TISSUE AND BREAST",2,Moderate,Moderate,Surgical,Medicare,Medicare,Medicaid,,,false,90382.27,22790.22
Hudson Valley,Westchester,5901000,001039,NewYork-Presbyterian/Hudson Valley Hospital,70 or Older,105,F,White,Not Span/Hispanic,2,Elective,Home or Self Care,2019,NEO029,BREAST CANCER - DUCTAL CARCINOMA IN SITU (DCIS),SKB003,MASTECTOMY AND LUMPECTOMY,361,SKIN GRAFT FOR SKIN & SUBCUTANEOUS TISSUE DIAGNOSES,09,"DISEASES AND DISORDERS OF THE SKIN, SUBCUTANEOUS TISSUE AND BREAST",1,Minor,Minor,Surgical,Medicare,Federal/State/Local/VA,,,,false,164619.61,60714.97
New York City,Kings,7002002,001324,Mount Sinai Brooklyn,50 to 69,112,F,Black/African American,Unknown,1,Urgent,Home or Self Care,2019,GEN017,NONMALIGNANT BREAST CONDITIONS,SKB003,MASTECTOMY AND LUMPECTOMY,361,SKIN GRAFT FOR SKIN & SUBCUTANEOUS TISSUE DIAGNOSES,09,"DISEASES AND DISORDERS OF THE SKIN, SUBCUTANEOUS TISSUE AND BREAST",1,Minor,Minor,Surgical,Blue Cross/Blue Shield,Self-Pay,,,,false,46598.8,11401.86
New York City,Manhattan,7002020,001453,Memorial Hospital for Cancer and Allied Diseases,30 to 49,104,F,Other Race,Not Span/Hispanic,18,Elective,Home or Self Care,2019,NEO027,SKIN CANCERS - SQUAMOUS CELL CARCINOMA,GNR006,"CHEST WALL PROCEDURES, NEC",361,SKIN GRAFT FOR SKIN & SUBCUTANEOUS TISSUE DIAGNOSES,09,"DISEASES AND DISORDERS OF THE SKIN, SUBCUTANEOUS TISSUE AND BREAST",3,Major,Major,Surgical,Private Health Insurance,,,,,false,281477.46,117921.03
Capital/Adirond,Warren,5601000,001005,Glens Falls Hospital,50 to 69,128,F,White,Not Span/Hispanic,1,Elective,Home or Self Care,2019,NEO030,BREAST CANCER - ALL OTHER TYPES,SKB003,MASTECTOMY AND LUMPECTOMY,361,SKIN GRAFT FOR SKIN & SUBCUTANEOUS TISSUE DIAGNOSES,09,"DISEASES AND DISORDERS OF THE SKIN, SUBCUTANEOUS TISSUE AND BREAST",1,Minor,Minor,Surgical,Blue Cross/Blue Shield,,,,,false,85184.12,125803.82
Long Island,Nassau,2951001,000541,North Shore University Hospital,70 or Older,117,M,White,Not Span/Hispanic,1,Emergency,Home w/ Home Health Services,2019,SKN001,SKIN AND SUBCUTANEOUS TISSUE INFECTIONS,MST030,"MUSCULOSKELETAL PROCEDURES, NEC",361,SKIN GRAFT FOR SKIN & SUBCUTANEOUS TISSUE DIAGNOSES,09,"DISEASES AND DISORDERS OF THE SKIN, SUBCUTANEOUS TISSUE AND BREAST",1,Minor,Moderate,Surgical,Medicare,Private Health Insurance,,,,true,17042.88,3088.28
Finger Lakes,Monroe,2701005,000413,Strong Memorial Hospital,50 to 69,146,M,Black/African American,Not Span/Hispanic,1,Emergency,Home or Self Care,2019,SKN001,SKIN AND SUBCUTANEOUS TISSUE INFECTIONS,SKB008,SKIN EXCISION AND DEBRIDEMENT,361,SKIN GRAFT FOR SKIN & SUBCUTANEOUS TISSUE DIAGNOSES,09,"DISEASES AND DISORDERS OF THE SKIN, SUBCUTANEOUS TISSUE AND BREAST",2,Moderate,Minor,Surgical,Blue Cross/Blue Shield,,,,,true,12020.64,5467.25
Long Island,Nassau,2952006,000551,St. Joseph Hospital,30 to 49,117,F,White,Spanish/Hispanic,1,Elective,Home or Self Care,2019,NEO030,BREAST CANCER - ALL OTHER TYPES,SKB003,MASTECTOMY AND LUMPECTOMY,361,SKIN GRAFT FOR SKIN & SUBCUTANEOUS TISSUE DIAGNOSES,09,"DISEASES AND DISORDERS OF THE SKIN, SUBCUTANEOUS TISSUE AND BREAST",1,Minor,Minor,Surgical,Private Health Insurance,,,,,false,178908.3,39815.38
Long Island,Suffolk,5151001,000245,Stony Brook University Hospital,50 to 69,117,F,White,Not Span/Hispanic,8,Elective,Skilled Nursing Home,2019,SKN002,OTHER SPECIFIED INFLAMMATORY CONDITION OF SKIN,SKB007,SKIN GRAFT,361,SKIN GRAFT FOR SKIN & SUBCUTANEOUS TISSUE DIAGNOSES,09,"DISEASES AND DISORDERS OF THE SKIN, SUBCUTANEOUS TISSUE AND BREAST",1,Minor,Minor,Surgical,Private Health Insurance,Medicare,,,,false,69774.78,26311.59
Long Island,Suffolk,5154000,000924,South Shore University Hospital,50 to 69,117,M,White,Not Span/Hispanic,12,Emergency,Home w/ Home Health Services,2019,SKN002,OTHER SPECIFIED INFLAMMATORY CONDITION OF SKIN,SKB007,SKIN GRAFT,361,SKIN GRAFT FOR SKIN & SUBCUTANEOUS TISSUE DIAGNOSES,09,"DISEASES AND DISORDERS OF THE SKIN, SUBCUTANEOUS TISSUE AND BREAST",3,Major,Major,Surgical,Private Health Insurance,,,,,true,173049.42,39380.36
Capital/Adirond,Albany,0101004,000005,St. Peter's Hospital,30 to 49,122,M,White,Not Span/Hispanic,5,Elective,Home or Self Care,2019,FAC004,ENCOUNTER FOR PROPHYLACTIC OR OTHER PROCEDURES,SKB007,SKIN GRAFT,361,SKIN GRAFT FOR SKIN & SUBCUTANEOUS TISSUE DIAGNOSES,09,"DISEASES AND DISORDERS OF THE SKIN, SUBCUTANEOUS TISSUE AND BREAST",2,Moderate,Moderate,Surgical,Private Health Insurance,,,,,false,43027.6,19344.74
Capital/Adirond,Albany,0101000,000001,Albany Medical Center Hospital,70 or Older,123,F,White,Not Span/Hispanic,6,Elective,Home w/ Home Health Services,2019,FAC004,ENCOUNTER FOR PROPHYLACTIC OR OTHER PROCEDURES,SKB007,SKIN GRAFT,361,SKIN GRAFT FOR SKIN & SUBCUTANEOUS TISSUE DIAGNOSES,09,"DISEASES AND DISORDERS OF THE SKIN, SUBCUTANEOUS TISSUE AND BREAST",3,Major,Major,Surgical,Medicare,Blue Cross/Blue Shield,,,,false,30890.48,11617.55
Capital/Adirond,Albany,0101000,000001,Albany Medical Center Hospital,70 or Older,128,F,White,Not Span/Hispanic,13,Urgent,Home w/ Home Health Services,2019,SKN003,PRESSURE ULCER OF SKIN,MST018,BONE EXCISION,361,SKIN GRAFT FOR SKIN & SUBCUTANEOUS TISSUE DIAGNOSES,09,"DISEASES AND DISORDERS OF THE SKIN, SUBCUTANEOUS TISSUE AND BREAST",3,Major,Major,Surgical,Medicare,,,,,false,79966.22,28492.22
New York City,Queens,7003010,001637,New York - Presbyterian/Queens,70 or Older,113,M,Other Race,Not Span/Hispanic,1,Emergency,Home w/ Home Health Services,2019,SKN007,OTHER SPECIFIED AND UNSPECIFIED SKIN DISORDERS,SKB008,SKIN EXCISION AND DEBRIDEMENT,361,SKIN GRAFT FOR SKIN & SUBCUTANEOUS TISSUE DIAGNOSES,09,"DISEASES AND DISORDERS OF THE SKIN, SUBCUTANEOUS TISSUE AND BREAST",2,Moderate,Minor,Surgical,Medicare,Medicare,Medicaid,,,true,18335.63,6067.44
New York City,Kings,7001021,001306,New York - Presbyterian Brooklyn Methodist Hospital,50 to 69,112,F,Black/African American,Not Span/Hispanic,8,Emergency,Home or Self Care,2019,END003,DIABETES MELLITUS WITH COMPLICATION,MST020,SUBCUTANEOUS TISSUE AND FASCIA EXCISION,361,SKIN GRAFT FOR SKIN & SUBCUTANEOUS TISSUE DIAGNOSES,09,"DISEASES AND DISORDERS OF THE SKIN, SUBCUTANEOUS TISSUE AND BREAST",2,Moderate,Minor,Surgical,Medicare,Medicare,Medicaid,,,true,77667.95,25602.15
Finger Lakes,Monroe,2754001,000471,The Unity Hospital of Rochester,50 to 69,144,M,White,Not Span/Hispanic,80,Emergency,Skilled Nursing Home,2019,SKN003,PRESSURE ULCER OF SKIN,GIS018,ILEOSTOMY AND COLOSTOMY,361,SKIN GRAFT FOR SKIN & SUBCUTANEOUS TISSUE DIAGNOSES,09,"DISEASES AND DISORDERS OF THE SKIN, SUBCUTANEOUS TISSUE AND BREAST",4,Extreme,Major,Surgical,Medicaid,,,,,true,154973.8,115331.14
Capital/Adirond,Albany,0101000,000001,Albany Medical Center Hospital,50 to 69,120,F,White,Not Span/Hispanic,2,Elective,Home or Self Care,2019,END003,DIABETES MELLITUS WITH COMPLICATION,MST030,"MUSCULOSKELETAL PROCEDURES, NEC",361,SKIN GRAFT FOR SKIN & SUBCUTANEOUS TISSUE DIAGNOSES,09,"DISEASES AND DISORDERS OF THE SKIN, SUBCUTANEOUS TISSUE AND BREAST",1,Minor,Moderate,Surgical,Medicare,Blue Cross/Blue Shield,,,,false,12363.66,4547.49
New York City,Kings,7001021,001306,New York - Presbyterian Brooklyn Methodist Hospital,30 to 49,112,M,Black/African American,Spanish/Hispanic,7,Elective,Home or Self Care,2019,END003,DIABETES MELLITUS WITH COMPLICATION,SKB007,SKIN GRAFT,361,SKIN GRAFT FOR SKIN & SUBCUTANEOUS TISSUE DIAGNOSES,09,"DISEASES AND DISORDERS OF THE SKIN, SUBCUTANEOUS TISSUE AND BREAST",3,Major,Moderate,Surgical,"Managed Care, Unspecified",Medicaid,Self-Pay,,,false,51079.02,18065.43
New York City,Kings,7001021,001306,New York - Presbyterian Brooklyn Methodist Hospital,70 or Older,112,M,White,Spanish/Hispanic,8,Emergency,Home w/ Home Health Services,2019,END003,DIABETES MELLITUS WITH COMPLICATION,MST020,SUBCUTANEOUS TISSUE AND FASCIA EXCISION,361,SKIN GRAFT FOR SKIN & SUBCUTANEOUS TISSUE DIAGNOSES,09,"DISEASES AND DISORDERS OF THE SKIN, SUBCUTANEOUS TISSUE AND BREAST",3,Major,Major,Surgical,Medicare,Medicare,Medicaid,,,true,96459.1,30621.64
Southern Tier,Broome,0301001,000043,Our Lady of Lourdes Memorial Hospital,70 or Older,137,M,White,Not Span/Hispanic,13,Emergency,Home or Self Care,2019,SKN003,PRESSURE ULCER OF SKIN,SKB007,SKIN GRAFT,361,SKIN GRAFT FOR SKIN & SUBCUTANEOUS TISSUE DIAGNOSES,09,"DISEASES AND DISORDERS OF THE SKIN, SUBCUTANEOUS TISSUE AND BREAST",3,Major,Major,Surgical,Medicare,Medicare,Blue Cross/Blue Shield,,,true,51666.22,20202.13
New York City,Manhattan,7002054,001464,New York-Presbyterian Hospital - Columbia Presbyterian Center,30 to 49,100,M,Other Race,Multi-ethnic,5,Urgent,Home w/ Home Health Services,2019,SKN004,NON-PRESSURE ULCER OF SKIN,SKB007,SKIN GRAFT,361,SKIN GRAFT FOR SKIN & SUBCUTANEOUS TISSUE DIAGNOSES,09,"DISEASES AND DISORDERS OF THE SKIN, SUBCUTANEOUS TISSUE AND BREAST",1,Minor,Minor,Surgical,Medicaid,Medicaid,Self-Pay,,,false,94267.64,25288.19
New York City,Manhattan,7002054,001464,New York-Presbyterian Hospital - Columbia Presbyterian Center,30 to 49,100,F,White,Multi-ethnic,2,Urgent,Home w/ Home Health Services,2019,SKN002,OTHER SPECIFIED INFLAMMATORY CONDITION OF SKIN,SKB007,SKIN GRAFT,361,SKIN GRAFT FOR SKIN & SUBCUTANEOUS TISSUE DIAGNOSES,09,"DISEASES AND DISORDERS OF THE SKIN, SUBCUTANEOUS TISSUE AND BREAST",2,Moderate,Minor,Surgical,Medicare,Medicare,Medicaid,,,false,27196.56,6100.66
Hudson Valley,Westchester,5904001,001072,Montefiore New Rochelle Hospital,70 or Older,OOS,F,Black/African American,Not Span/Hispanic,1,Emergency,Home or Self Care,2019,SKN004,NON-PRESSURE ULCER OF SKIN,SKB008,SKIN EXCISION AND DEBRIDEMENT,361,SKIN GRAFT FOR SKIN & SUBCUTANEOUS TISSUE DIAGNOSES,09,"DISEASES AND DISORDERS OF THE SKIN, SUBCUTANEOUS TISSUE AND BREAST",1,Minor,Minor,Surgical,Medicare,Medicare,Self-Pay,,,true,13333.92,3472.93
New York City,Kings,7001021,001306,New York - Presbyterian Brooklyn Methodist Hospital,50 to 69,112,M,White,Spanish/Hispanic,10,Emergency,Home w/ Home Health Services,2019,INJ012,"OPEN WOUNDS TO LIMBS, INITIAL ENCOUNTER",SKB008,SKIN EXCISION AND DEBRIDEMENT,361,SKIN GRAFT FOR SKIN & SUBCUTANEOUS TISSUE DIAGNOSES,09,"DISEASES AND DISORDERS OF THE SKIN, SUBCUTANEOUS TISSUE AND BREAST",2,Moderate,Moderate,Surgical,"Managed Care, Unspecified",Medicaid,Self-Pay,,,false,61736.88,21025.92
New York City,Kings,7001021,001306,New York - Presbyterian Brooklyn Methodist Hospital,50 to 69,112,M,Other Race,Not Span/Hispanic,7,Emergency,Home or Self Care,2019,END003,DIABETES MELLITUS WITH COMPLICATION,SKB007,SKIN GRAFT,361,SKIN GRAFT FOR SKIN & SUBCUTANEOUS TISSUE DIAGNOSES,09,"DISEASES AND DISORDERS OF THE SKIN, SUBCUTANEOUS TISSUE AND BREAST",2,Moderate,Moderate,Surgical,"Managed Care, Unspecified",Medicaid,Self-Pay,,,true,81243.79,26084.5
Long Island,Nassau,2950002,000528,Nassau University Medical Center,30 to 49,115,M,Black/African American,Not Span/Hispanic,11,Emergency,Home w/ Home Health Services,2019,SKN003,PRESSURE ULCER OF SKIN,SKB007,SKIN GRAFT,361,SKIN GRAFT FOR SKIN & SUBCUTANEOUS TISSUE DIAGNOSES,09,"DISEASES AND DISORDERS OF THE SKIN, SUBCUTANEOUS TISSUE AND BREAST",3,Major,Moderate,Surgical,Medicaid,Medicaid,Self-Pay,,,false,151905.75,39473.61
Finger Lakes,Monroe,2701003,000411,Rochester General Hospital,30 to 49,146,M,Black/African American,Not Span/Hispanic,1,Emergency,Left Against Medical Advice,2019,END003,DIABETES MELLITUS WITH COMPLICATION,MST030,"MUSCULOSKELETAL PROCEDURES, NEC",361,SKIN GRAFT FOR SKIN & SUBCUTANEOUS TISSUE DIAGNOSES,09,"DISEASES AND DISORDERS OF THE SKIN, SUBCUTANEOUS TISSUE AND BREAST",1,Minor,Moderate,Surgical,Medicaid,,,,,true,4859.29,1835.69
New York City,Manhattan,7002024,001456,Mount Sinai Hospital,30 to 49,112,F,White,Not Span/Hispanic,1,Elective,Home w/ Home Health Services,2019,NEO029,BREAST CANCER - DUCTAL CARCINOMA IN SITU (DCIS),SKB004,BREAST RECONSTRUCTION,361,SKIN GRAFT FOR SKIN & SUBCUTANEOUS TISSUE DIAGNOSES,09,"DISEASES AND DISORDERS OF THE SKIN, SUBCUTANEOUS TISSUE AND BREAST",1,Minor,Minor,Surgical,"Managed Care, Unspecified",Medicaid,Self-Pay,,,false,55662.73,22021.24