Hospital Service Area,Hospital County,Operating Certificate Number,Permanent Facility Id,Facility Name,Age Group,Zip Code - 3 digits,Gender,Race,Ethnicity,Length of Stay,Type of Admission,Patient Disposition,Discharge Year,CCS Diagnosis Code,CCS Diagnosis Description,CCS Procedure Code,CCS Procedure Description,APR DRG Code,APR DRG Description,APR MDC Code,APR MDC Description,APR Severity of Illness Code,APR Severity of Illness Description,APR Risk of Mortality,APR Medical Surgical Description,Payment Typology 1,Payment Typology 2,Payment Typology 3,Birth Weight,Abortion Edit Indicator,Emergency Department Indicator,Total Charges,Total Costs
New York City,Manhattan,7002053,001463,NYU Langone Hospitals,70 or Older,100,M,White,Not Span/Hispanic,11,Emergency,Skilled Nursing Home,2020,SKN001,SKIN AND SUBCUTANEOUS TISSUE INFECTIONS,MST004,INCISION AND DRAINAGE OF MUSCULOSKELETAL TISSUE AND JOINTS,361,SKIN GRAFT FOR SKIN & SUBCUTANEOUS TISSUE DIAGNOSES,09,"DISEASES AND DISORDERS OF THE SKIN, SUBCUTANEOUS TISSUE AND BREAST",2,Moderate,Moderate,Surgical,Medicare,Blue Cross/Blue Shield,,,,Y,162671.26,44483.35
New York City,Manhattan,7002053,001463,NYU Langone Hospitals,50 to 69,100,M,Other Race,Not Span/Hispanic,19,Emergency,Skilled Nursing Home,2020,END003,DIABETES MELLITUS WITH COMPLICATION,MST020,SUBCUTANEOUS TISSUE AND FASCIA EXCISION,361,SKIN GRAFT FOR SKIN & SUBCUTANEOUS TISSUE DIAGNOSES,09,"DISEASES AND DISORDERS OF THE SKIN, SUBCUTANEOUS TISSUE AND BREAST",2,Moderate,Major,Surgical,Private Health Insurance,,,,,Y,412027.8,79570.56
New York City,Manhattan,7002053,001463,NYU Langone Hospitals,30 to 49,OOS,M,White,Not Span/Hispanic,1,Elective,Home or Self Care,2020,SKN007,OTHER SPECIFIED AND UNSPECIFIED SKIN DISORDERS,GNR002,ABDOMINAL WALL REPAIR (INCLUDING HERNIA),361,SKIN GRAFT FOR SKIN & SUBCUTANEOUS TISSUE DIAGNOSES,09,"DISEASES AND DISORDERS OF THE SKIN, SUBCUTANEOUS TISSUE AND BREAST",1,Minor,Minor,Surgical,Private Health Insurance,,,,,N,119676.57,18587.26
New York City,Manhattan,7002053,001463,NYU Langone Hospitals,50 to 69,117,F,Other Race,Spanish/Hispanic,1,Elective,Home or Self Care,2020,FAC004,ENCOUNTER FOR PROPHYLACTIC OR OTHER PROCEDURES,SKB004,BREAST RECONSTRUCTION,361,SKIN GRAFT FOR SKIN & SUBCUTANEOUS TISSUE DIAGNOSES,09,"DISEASES AND DISORDERS OF THE SKIN, SUBCUTANEOUS TISSUE AND BREAST",1,Minor,Minor,Surgical,Medicare,Blue Cross/Blue Shield,,,,N,85896.6,13375.98
New York City,Manhattan,7002053,001463,NYU Langone Hospitals,18 to 29,112,M,Other Race,Spanish/Hispanic,7,Elective,Skilled Nursing Home,2020,SKN003,PRESSURE ULCER OF SKIN,MST028,"SUBCUTANEOUS TISSUE AND FASCIA PROCEDURES, NEC",361,SKIN GRAFT FOR SKIN & SUBCUTANEOUS TISSUE DIAGNOSES,09,"DISEASES AND DISORDERS OF THE SKIN, SUBCUTANEOUS TISSUE AND BREAST",3,Major,Moderate,Surgical,Medicaid,,,,,N,113208.28,29124.52
New York City,Manhattan,7002053,001463,NYU Langone Hospitals,50 to 69,OOS,F,White,Not Span/Hispanic,10,Emergency,Home w/ Home Health Services,2020,SKN002,OTHER SPECIFIED INFLAMMATORY CONDITION OF SKIN,SKB001,SKIN BIOPSY AND DIAGNOSTIC DRAINAGE,361,SKIN GRAFT FOR SKIN & SUBCUTANEOUS TISSUE DIAGNOSES,09,"DISEASES AND DISORDERS OF THE SKIN, SUBCUTANEOUS TISSUE AND BREAST",2,Moderate,Minor,Surgical,Medicare,,,,,N,132745.8,35935.17
New York City,Manhattan,7002053,001463,NYU Langone Hospitals,50 to 69,110,F,White,Not Span/Hispanic,11,Elective,Home w/ Home Health Services,2020,SKN002,OTHER SPECIFIED INFLAMMATORY CONDITION OF SKIN,MST030,"MUSCULOSKELETAL PROCEDURES, NEC",361,SKIN GRAFT FOR SKIN & SUBCUTANEOUS TISSUE DIAGNOSES,09,"DISEASES AND DISORDERS OF THE SKIN, SUBCUTANEOUS TISSUE AND BREAST",2,Moderate,Moderate,Surgical,Private Health Insurance,,,,,N,225774.73,52251.98
New York City,Manhattan,7002053,001463,NYU Langone Hospitals,30 to 49,112,F,Other Race,Spanish/Hispanic,6,Elective,Home w/ Home Health Services,2020,SKN002,OTHER SPECIFIED INFLAMMATORY CONDITION OF SKIN,SKB007,SKIN GRAFT,361,SKIN GRAFT FOR SKIN & SUBCUTANEOUS TISSUE DIAGNOSES,09,"DISEASES AND DISORDERS OF THE SKIN, SUBCUTANEOUS TISSUE AND BREAST",2,Moderate,Moderate,Surgical,Medicare,Medicaid,,,,N,119353.15,28340.04
New York City,Manhattan,7002053,001463,NYU Langone Hospitals,70 or Older,100,M,White,Not Span/Hispanic,3,Emergency,Skilled Nursing Home,2020,END003,DIABETES MELLITUS WITH COMPLICATION,SKB008,SKIN EXCISION AND DEBRIDEMENT,361,SKIN GRAFT FOR SKIN & SUBCUTANEOUS TISSUE DIAGNOSES,09,"DISEASES AND DISORDERS OF THE SKIN, SUBCUTANEOUS TISSUE AND BREAST",2,Moderate,Moderate,Surgical,Medicare,,,,,Y,66212.19,13274.78
New York City,Manhattan,7002053,001463,NYU Langone Hospitals,50 to 69,117,M,White,Not Span/Hispanic,4,Elective,Home or Self Care,2020,NEO028,SKIN CANCERS - ALL OTHER TYPES,SKB007,SKIN GRAFT,361,SKIN GRAFT FOR SKIN & SUBCUTANEOUS TISSUE DIAGNOSES,09,"DISEASES AND DISORDERS OF THE SKIN, SUBCUTANEOUS TISSUE AND BREAST",2,Moderate,Moderate,Surgical,Medicare,Blue Cross/Blue Shield,,,,N,213437.22,39288.59
New York City,Manhattan,7002053,001463,NYU Langone Hospitals,50 to 69,104,M,Other Race,Spanish/Hispanic,4,Elective,Home w/ Home Health Services,2020,NEO026,SKIN CANCERS - BASAL CELL CARCINOMA,MST020,SUBCUTANEOUS TISSUE AND FASCIA EXCISION,361,SKIN GRAFT FOR SKIN & SUBCUTANEOUS TISSUE DIAGNOSES,09,"DISEASES AND DISORDERS OF THE SKIN, SUBCUTANEOUS TISSUE AND BREAST",1,Minor,Minor,Surgical,Blue Cross/Blue Shield,,,,,N,223922.06,48329.42
New York City,Manhattan,7002053,001463,NYU Langone Hospitals,50 to 69,117,M,White,Not Span/Hispanic,5,Elective,Home w/ Home Health Services,2020,NEO026,SKIN CANCERS - BASAL CELL CARCINOMA,MST018,BONE EXCISION,361,SKIN GRAFT FOR SKIN & SUBCUTANEOUS TISSUE DIAGNOSES,09,"DISEASES AND DISORDERS OF THE SKIN, SUBCUTANEOUS TISSUE AND BREAST",3,Major,Major,Surgical,Private Health Insurance,,,,,N,184604.52,35936.61
New York City,Manhattan,7002053,001463,NYU Langone Hospitals,50 to 69,105,M,White,Not Span/Hispanic,4,Emergency,Home or Self Care,2020,SKN007,OTHER SPECIFIED AND UNSPECIFIED SKIN DISORDERS,MST020,SUBCUTANEOUS TISSUE AND FASCIA EXCISION,361,SKIN GRAFT FOR SKIN & SUBCUTANEOUS TISSUE DIAGNOSES,09,"DISEASES AND DISORDERS OF THE SKIN, SUBCUTANEOUS TISSUE AND BREAST",1,Minor,Minor,Surgical,Private Health Insurance,,,,,Y,101301.84,20954.83
New York City,Manhattan,7002053,001463,NYU Langone Hospitals,50 to 69,112,F,Other Race,Spanish/Hispanic,3,Emergency,Home w/ Home Health Services,2020,SKN001,SKIN AND SUBCUTANEOUS TISSUE INFECTIONS,MST030,"MUSCULOSKELETAL PROCEDURES, NEC",361,SKIN GRAFT FOR SKIN & SUBCUTANEOUS TISSUE DIAGNOSES,09,"DISEASES AND DISORDERS OF THE SKIN, SUBCUTANEOUS TISSUE AND BREAST",3,Major,Moderate,Surgical,Medicare,Medicaid,,,,Y,34134.32,10654.14
New York City,Manhattan,7002053,001463,NYU Langone Hospitals,18 to 29,114,F,Black/African American,Not Span/Hispanic,7,Emergency,Home w/ Home Health Services,2020,SKN001,SKIN AND SUBCUTANEOUS TISSUE INFECTIONS,GNR008,"ABDOMINAL WALL PROCEDURES, NEC",361,SKIN GRAFT FOR SKIN & SUBCUTANEOUS TISSUE DIAGNOSES,09,"DISEASES AND DISORDERS OF THE SKIN, SUBCUTANEOUS TISSUE AND BREAST",1,Minor,Minor,Surgical,Private Health Insurance,,,,,Y,127977.82,31069.48
New York City,Manhattan,7002053,001463,NYU Langone Hospitals,50 to 69,115,M,Black/African American,Not Span/Hispanic,10,Elective,Home w/ Home Health Services,2020,NEO027,SKIN CANCERS - SQUAMOUS CELL CARCINOMA,MST028,"SUBCUTANEOUS TISSUE AND FASCIA PROCEDURES, NEC",361,SKIN GRAFT FOR SKIN & SUBCUTANEOUS TISSUE DIAGNOSES,09,"DISEASES AND DISORDERS OF THE SKIN, SUBCUTANEOUS TISSUE AND BREAST",2,Moderate,Minor,Surgical,Private Health Insurance,,,,,N,188112.61,47551.79
New York City,Manhattan,7002053,001463,NYU Langone Hospitals,70 or Older,113,M,White,Not Span/Hispanic,2,Elective,Home or Self Care,2020,NEO025,SKIN CANCERS - MELANOMA,SKB008,SKIN EXCISION AND DEBRIDEMENT,361,SKIN GRAFT FOR SKIN & SUBCUTANEOUS TISSUE DIAGNOSES,09,"DISEASES AND DISORDERS OF THE SKIN, SUBCUTANEOUS TISSUE AND BREAST",2,Moderate,Moderate,Surgical,Medicare,Medicaid,,,,N,78735.65,17374.07
New York City,Manhattan,7002053,001463,NYU Langone Hospitals,30 to 49,112,F,Black/African American,Not Span/Hispanic,5,Emergency,Home w/ Home Health Services,2020,GEN017,NONMALIGNANT BREAST CONDITIONS,SKB004,BREAST RECONSTRUCTION,361,SKIN GRAFT FOR SKIN & SUBCUTANEOUS TISSUE DIAGNOSES,09,"DISEASES AND DISORDERS OF THE SKIN, SUBCUTANEOUS TISSUE AND BREAST",2,Moderate,Moderate,Surgical,Medicaid,,,,,Y,109805.53,30802.18
New York City,Manhattan,7002053,001463,NYU Langone Hospitals,50 to 69,104,M,Black/African American,Not Span/Hispanic,21,Elective,Medicare Cert Long Term Care Hospital,2020,SKN003,PRESSURE ULCER OF SKIN,GIS018,ILEOSTOMY AND COLOSTOMY,361,SKIN GRAFT FOR SKIN & SUBCUTANEOUS TISSUE DIAGNOSES,09,"DISEASES AND DISORDERS OF THE SKIN, SUBCUTANEOUS TISSUE AND BREAST",4,Extreme,Extreme,Surgical,Medicare,,,,,N,550217.18,145234.47
New York City,Manhattan,7002053,001463,NYU Langone Hospitals,30 to 49,112,M,Black/African American,Not Span/Hispanic,13,Elective,Home w/ Home Health Services,2020,SKN003,PRESSURE ULCER OF SKIN,MST018,BONE EXCISION,361,SKIN GRAFT FOR SKIN & SUBCUTANEOUS TISSUE DIAGNOSES,09,"DISEASES AND DISORDERS OF THE SKIN, SUBCUTANEOUS TISSUE AND BREAST",2,Moderate,Minor,Surgical,Medicaid,,,,,N,314932.68,82659.13
New York City,Manhattan,7002053,001463,NYU Langone Hospitals,50 to 69,112,M,Other Race,Spanish/Hispanic,3,Elective,Skilled Nursing Home,2020,SKN003,PRESSURE ULCER OF SKIN,MST020,SUBCUTANEOUS TISSUE AND FASCIA EXCISION,361,SKIN GRAFT FOR SKIN & SUBCUTANEOUS TISSUE DIAGNOSES,09,"DISEASES AND DISORDERS OF THE SKIN, SUBCUTANEOUS TISSUE AND BREAST",2,Moderate,Minor,Surgical,Medicare,Medicaid,,,,N,78764.4,20274.72
New York City,Manhattan,7002053,001463,NYU Langone Hospitals,18 to 29,100,M,White,Not Span/Hispanic,5,Emergency,Home or Self Care,2020,SKN001,SKIN AND SUBCUTANEOUS TISSUE INFECTIONS,MST019,"MUSCLE, TENDON, BURSA, AND LIGAMENT EXCISION",361,SKIN GRAFT FOR SKIN & SUBCUTANEOUS TISSUE DIAGNOSES,09,"DISEASES AND DISORDERS OF THE SKIN, SUBCUTANEOUS TISSUE AND BREAST",2,Moderate,Minor,Surgical,Private Health Insurance,,,,,Y,164775.13,36749.16
New York City,Manhattan,7002053,001463,NYU Langone Hospitals,18 to 29,117,M,White,Unknown,2,Emergency,Inpatient Rehabilitation Facility,2020,SKN003,PRESSURE ULCER OF SKIN,MST018,BONE EXCISION,361,SKIN GRAFT FOR SKIN & SUBCUTANEOUS TISSUE DIAGNOSES,09,"DISEASES AND DISORDERS OF THE SKIN, SUBCUTANEOUS TISSUE AND BREAST",2,Moderate,Moderate,Surgical,Medicaid,,,,,N,102563.07,17935.49
New York City,Manhattan,7002053,001463,NYU Langone Hospitals,18 to 29,104,F,Other Race,Spanish/Hispanic,7,Elective,Home w/ Home Health Services,2020,SKN002,OTHER SPECIFIED INFLAMMATORY CONDITION OF SKIN,MST020,SUBCUTANEOUS TISSUE AND FASCIA EXCISION,361,SKIN GRAFT FOR SKIN & SUBCUTANEOUS TISSUE DIAGNOSES,09,"DISEASES AND DISORDERS OF THE SKIN, SUBCUTANEOUS TISSUE AND BREAST",1,Minor,Minor,Surgical,Medicaid,,,,,N,148816,43214.55
New York City,Manhattan,7002053,001463,NYU Langone Hospitals,50 to 69,100,F,Other Race,Not Span/Hispanic,5,Elective,Home w/ Home Health Services,2020,NEO028,SKIN CANCERS - ALL OTHER TYPES,MST020,SUBCUTANEOUS TISSUE AND FASCIA EXCISION,361,SKIN GRAFT FOR SKIN & SUBCUTANEOUS TISSUE DIAGNOSES,09,"DISEASES AND DISORDERS OF THE SKIN, SUBCUTANEOUS TISSUE AND BREAST",1,Minor,Minor,Surgical,Medicaid,,,,,N,269599.85,51459.87
New York City,Manhattan,7002053,001463,NYU Langone Hospitals,70 or Older,112,M,White,Not Span/Hispanic,8,Elective,Inpatient Rehabilitation Facility,2020,NEO027,SKIN CANCERS - SQUAMOUS CELL CARCINOMA,MST020,SUBCUTANEOUS TISSUE AND FASCIA EXCISION,361,SKIN GRAFT FOR SKIN & SUBCUTANEOUS TISSUE DIAGNOSES,09,"DISEASES AND DISORDERS OF THE SKIN, SUBCUTANEOUS TISSUE AND BREAST",3,Major,Moderate,Surgical,Medicare,,,,,N,225601.49,60039.83
New York City,Manhattan,7002053,001463,NYU Langone Hospitals,0 to 17,,F,Multi-racial,Not Span/Hispanic,1,Elective,Home or Self Care,2020,SKN007,OTHER SPECIFIED AND UNSPECIFIED SKIN DISORDERS,MST028,"SUBCUTANEOUS TISSUE AND FASCIA PROCEDURES, NEC",361,SKIN GRAFT FOR SKIN & SUBCUTANEOUS TISSUE DIAGNOSES,09,"DISEASES AND DISORDERS OF THE SKIN, SUBCUTANEOUS TISSUE AND BREAST",2,Moderate,Minor,Surgical,Private Health Insurance,,,,,N,56447.07,11104.93
New York City,Manhattan,7002053,001463,NYU Langone Hospitals,50 to 69,113,M,White,Not Span/Hispanic,8,Emergency,Home w/ Home Health Services,2020,END003,DIABETES MELLITUS WITH COMPLICATION,MST019,"MUSCLE, TENDON, BURSA, AND LIGAMENT EXCISION",361,SKIN GRAFT FOR SKIN & SUBCUTANEOUS TISSUE DIAGNOSES,09,"DISEASES AND DISORDERS OF THE SKIN, SUBCUTANEOUS TISSUE AND BREAST",3,Major,Major,Surgical,Private Health Insurance,,,,,Y,203432.73,59530.33
New York City,Manhattan,7002053,001463,NYU Langone Hospitals,50 to 69,113,F,Other Race,Spanish/Hispanic,1,Elective,Home w/ Home Health Services,2020,NEO073,BENIGN NEOPLASMS,GNR009,"RETROPERITONEAL PROCEDURES, NEC",361,SKIN GRAFT FOR SKIN & SUBCUTANEOUS TISSUE DIAGNOSES,09,"DISEASES AND DISORDERS OF THE SKIN, SUBCUTANEOUS TISSUE AND BREAST",2,Moderate,Moderate,Surgical,Medicare,,,,,N,118870.05,18759.54
New York City,Manhattan,7002053,001463,NYU Langone Hospitals,50 to 69,100,M,Other Race,Spanish/Hispanic,15,Elective,Skilled Nursing Home,2020,SKN003,PRESSURE ULCER OF SKIN,MST018,BONE EXCISION,361,SKIN GRAFT FOR SKIN & SUBCUTANEOUS TISSUE DIAGNOSES,09,"DISEASES AND DISORDERS OF THE SKIN, SUBCUTANEOUS TISSUE AND BREAST",3,Major,Moderate,Surgical,Medicare,,,,,N,293139.91,86613.73
New York City,Manhattan,7002053,001463,NYU Langone Hospitals,50 to 69,100,M,White,Not Span/Hispanic,13,Emergency,Skilled Nursing Home,2020,SKN003,PRESSURE ULCER OF SKIN,MST018,BONE EXCISION,361,SKIN GRAFT FOR SKIN & SUBCUTANEOUS TISSUE DIAGNOSES,09,"DISEASES AND DISORDERS OF THE SKIN, SUBCUTANEOUS TISSUE AND BREAST",2,Moderate,Moderate,Surgical,Medicaid,,,,,Y,303373.53,73884.05
New York City,Manhattan,7002053,001463,NYU Langone Hospitals,70 or Older,105,M,White,Not Span/Hispanic,6,Elective,Home w/ Home Health Services,2020,NEO027,SKIN CANCERS - SQUAMOUS CELL CARCINOMA,MST018,BONE EXCISION,361,SKIN GRAFT FOR SKIN & SUBCUTANEOUS TISSUE DIAGNOSES,09,"DISEASES AND DISORDERS OF THE SKIN, SUBCUTANEOUS TISSUE AND BREAST",2,Moderate,Moderate,Surgical,Medicare,Medicare,,,,N,417359.8,79028.16
New York City,Manhattan,7002053,001463,NYU Langone Hospitals,70 or Older,112,F,White,Not Span/Hispanic,1,Elective,Home w/ Home Health Services,2020,NEO025,SKIN CANCERS - MELANOMA,MST020,SUBCUTANEOUS TISSUE AND FASCIA EXCISION,361,SKIN GRAFT FOR SKIN & SUBCUTANEOUS TISSUE DIAGNOSES,09,"DISEASES AND DISORDERS OF THE SKIN, SUBCUTANEOUS TISSUE AND BREAST",1,Minor,Minor,Surgical,Medicare,Medicare,,,,N,65738.37,12398.04
New York City,Manhattan,7002053,001463,NYU Langone Hospitals,30 to 49,,M,Multi-racial,Not Span/Hispanic,4,Elective,Home w/ Home Health Services,2020,SKN003,PRESSURE ULCER OF SKIN,SKB007,SKIN GRAFT,361,SKIN GRAFT FOR SKIN & SUBCUTANEOUS TISSUE DIAGNOSES,09,"DISEASES AND DISORDERS OF THE SKIN, SUBCUTANEOUS TISSUE AND BREAST",3,Major,Moderate,Surgical,Medicaid,,,,,N,119026.08,28302.48
New York City,Manhattan,7002053,001463,NYU Langone Hospitals,50 to 69,112,M,White,Not Span/Hispanic,1,Elective,Home or Self Care,2020,NEO025,SKIN CANCERS - MELANOMA,MST020,SUBCUTANEOUS TISSUE AND FASCIA EXCISION,361,SKIN GRAFT FOR SKIN & SUBCUTANEOUS TISSUE DIAGNOSES,09,"DISEASES AND DISORDERS OF THE SKIN, SUBCUTANEOUS TISSUE AND BREAST",2,Moderate,Moderate,Surgical,Medicaid,,,,,N,132201.9,20702.43
New York City,Manhattan,7002053,001463,NYU Langone Hospitals,30 to 49,116,F,Black/African American,Not Span/Hispanic,4,Elective,Home w/ Home Health Services,2020,NEO030,BREAST CANCER - ALL OTHER TYPES,SKB003,MASTECTOMY AND LUMPECTOMY,361,SKIN GRAFT FOR SKIN & SUBCUTANEOUS TISSUE DIAGNOSES,09,"DISEASES AND DISORDERS OF THE SKIN, SUBCUTANEOUS TISSUE AND BREAST",2,Moderate,Moderate,Surgical,Medicaid,,,,,N,124178.75,29036.97
New York City,Manhattan,7002053,001463,NYU Langone Hospitals,50 to 69,112,F,White,Not Span/Hispanic,5,Elective,Home w/ Home Health Services,2020,END016,OTHER SPECIFIED AND UNSPECIFIED NUTRITIONAL AND METABOLIC DISORDERS,MST020,SUBCUTANEOUS TISSUE AND FASCIA EXCISION,361,SKIN GRAFT FOR SKIN & SUBCUTANEOUS TISSUE DIAGNOSES,09,"DISEASES AND DISORDERS OF THE SKIN, SUBCUTANEOUS TISSUE AND BREAST",2,Moderate,Moderate,Surgical,Medicare,Medicare,,,,N,142522.76,39134.71
New York City,Manhattan,7002053,001463,NYU Langone Hospitals,30 to 49,110,F,White,Not Span/Hispanic,3,Elective,Home w/ Home Health Services,2020,NEO030,BREAST CANCER - ALL OTHER TYPES,SKB003,MASTECTOMY AND LUMPECTOMY,361,SKIN GRAFT FOR SKIN & SUBCUTANEOUS TISSUE DIAGNOSES,09,"DISEASES AND DISORDERS OF THE SKIN, SUBCUTANEOUS TISSUE AND BREAST",1,Minor,Minor,Surgical,Blue Cross/Blue Shield,,,,,N,199725.29,36237.45
New York City,Manhattan,7002053,001463,NYU Langone Hospitals,50 to 69,100,F,Other Race,Spanish/Hispanic,1,Elective,Home or Self Care,2020,INJ037,"COMPLICATION OF OTHER SURGICAL OR MEDICAL CARE, INJURY, INITIAL ENCOUNTER",SKB004,BREAST RECONSTRUCTION,361,SKIN GRAFT FOR SKIN & SUBCUTANEOUS TISSUE DIAGNOSES,09,"DISEASES AND DISORDERS OF THE SKIN, SUBCUTANEOUS TISSUE AND BREAST",1,Minor,Minor,Surgical,Private Health Insurance,,,,,N,239563.18,29893.25
New York City,Manhattan,7002053,001463,NYU Langone Hospitals,30 to 49,100,M,White,Not Span/Hispanic,6,Emergency,Home or Self Care,2020,SKN001,SKIN AND SUBCUTANEOUS TISSUE INFECTIONS,PNS003,PERIPHERAL NERVE DECOMPRESSION (EXCLUDING LUMBOSACRAL AND CERVICOTHORACIC),361,SKIN GRAFT FOR SKIN & SUBCUTANEOUS TISSUE DIAGNOSES,09,"DISEASES AND DISORDERS OF THE SKIN, SUBCUTANEOUS TISSUE AND BREAST",2,Moderate,Moderate,Surgical,Medicaid,,,,,Y,139937.99,37519.25
New York City,Manhattan,7002053,001463,NYU Langone Hospitals,30 to 49,112,F,Black/African American,Not Span/Hispanic,3,Elective,Home w/ Home Health Services,2020,SKN002,OTHER SPECIFIED INFLAMMATORY CONDITION OF SKIN,FRS015,"FEMALE REPRODUCTIVE SYSTEM PROCEDURES, NEC",361,SKIN GRAFT FOR SKIN & SUBCUTANEOUS TISSUE DIAGNOSES,09,"DISEASES AND DISORDERS OF THE SKIN, SUBCUTANEOUS TISSUE AND BREAST",1,Minor,Moderate,Surgical,Private Health Insurance,,,,,N,111587.36,24566.3
New York City,Manhattan,7002053,001463,NYU Langone Hospitals,30 to 49,112,F,White,Not Span/Hispanic,4,Elective,Home or Self Care,2020,NEO027,SKIN CANCERS - SQUAMOUS CELL CARCINOMA,MST002,BONE AND JOINT BIOPSY,361,SKIN GRAFT FOR SKIN & SUBCUTANEOUS TISSUE DIAGNOSES,09,"DISEASES AND DISORDERS OF THE SKIN, SUBCUTANEOUS TISSUE AND BREAST",1,Minor,Minor,Surgical,Private Health Insurance,,,,,N,230783.77,50184.89
New York City,Manhattan,7002053,001463,NYU Langone Hospitals,30 to 49,115,F,White,Not Span/Hispanic,1,Elective,Home or Self Care,2020,FAC004,ENCOUNTER FOR PROPHYLACTIC OR OTHER PROCEDURES,SKB004,BREAST RECONSTRUCTION,361,SKIN GRAFT FOR SKIN & SUBCUTANEOUS TISSUE DIAGNOSES,09,"DISEASES AND DISORDERS OF THE SKIN, SUBCUTANEOUS TISSUE AND BREAST",1,Minor,Minor,Surgical,Private Health Insurance,,,,,N,114907.04,18565.82
New York City,Manhattan,7002053,001463,NYU Langone Hospitals,70 or Older,111,M,White,Not Span/Hispanic,2,Elective,Home w/ Home Health Services,2020,END003,DIABETES MELLITUS WITH COMPLICATION,SKB007,SKIN GRAFT,361,SKIN GRAFT FOR SKIN & SUBCUTANEOUS TISSUE DIAGNOSES,09,"DISEASES AND DISORDERS OF THE SKIN, SUBCUTANEOUS TISSUE AND BREAST",2,Moderate,Moderate,Surgical,Medicare,Private Health Insurance,,,,N,66009.92,13961.51
New York City,Manhattan,7002053,001463,NYU Langone Hospitals,70 or Older,112,F,Other Race,Not Span/Hispanic,17,Elective,Home w/ Home Health Services,2020,SKN004,NON-PRESSURE ULCER OF SKIN,SKB001,SKIN BIOPSY AND DIAGNOSTIC DRAINAGE,361,SKIN GRAFT FOR SKIN & SUBCUTANEOUS TISSUE DIAGNOSES,09,"DISEASES AND DISORDERS OF THE SKIN, SUBCUTANEOUS TISSUE AND BREAST",2,Moderate,Minor,Surgical,Medicare,Medicaid,,,,N,482031.27,134311.24
New York City,Manhattan,7002053,001463,NYU Langone Hospitals,70 or Older,100,F,Other Race,Spanish/Hispanic,28,Emergency,Home w/ Home Health Services,2020,INJ017,"SUPERFICIAL INJURY; CONTUSION, INITIAL ENCOUNTER",MST020,SUBCUTANEOUS TISSUE AND FASCIA EXCISION,361,SKIN GRAFT FOR SKIN & SUBCUTANEOUS TISSUE DIAGNOSES,09,"DISEASES AND DISORDERS OF THE SKIN, SUBCUTANEOUS TISSUE AND BREAST",3,Major,Major,Surgical,Medicare,Medicaid,,,,Y,716832.28,182186.4
New York City,Manhattan,7002053,001463,NYU Langone Hospitals,50 to 69,111,M,Other Race,Spanish/Hispanic,17,Urgent,Home w/ Home Health Services,2020,INJ012,"OPEN WOUNDS TO LIMBS, INITIAL ENCOUNTER",MST011,FIXATION OF LEG AND FOOT BONES,361,SKIN GRAFT FOR SKIN & SUBCUTANEOUS TISSUE DIAGNOSES,09,"DISEASES AND DISORDERS OF THE SKIN, SUBCUTANEOUS TISSUE AND BREAST",1,Minor,Minor,Surgical,Private Health Insurance,,,,,N,492282.5,119555.78
