Hospital Service Area,Hospital County,Operating Certificate Number,Permanent Facility Id,Facility Name,Age Group,Zip Code - 3 digits,Gender,Race,Ethnicity,Length of Stay,Type of Admission,Patient Disposition,Discharge Year,CCS Diagnosis Code,CCS Diagnosis Description,CCS Procedure Code,CCS Procedure Description,APR DRG Code,APR DRG Description,APR MDC Code,APR MDC Description,APR Severity of Illness Code,APR Severity of Illness Description,APR Risk of Mortality,APR Medical Surgical Description,Payment Typology 1,Payment Typology 2,Payment Typology 3,Birth Weight,Abortion Edit Indicator,Emergency Department Indicator,Total Charges,Total Costs
Long Island,Nassau,2908000,000511,NYU Langone Hospital-Long Island,70 or Older,115,M,White,Not Span/Hispanic,5,Emergency,Home w/ Home Health Services,2020,END003,DIABETES MELLITUS WITH COMPLICATION,MST002,BONE AND JOINT BIOPSY,361,SKIN GRAFT FOR SKIN & SUBCUTANEOUS TISSUE DIAGNOSES,09,"DISEASES AND DISORDERS OF THE SKIN, SUBCUTANEOUS TISSUE AND BREAST",2,Moderate,Moderate,Surgical,Medicaid,,,,,Y,102205.34,22769.24
Long Island,Nassau,2908000,000511,NYU Langone Hospital-Long Island,0 to 17,115,M,Other Race,Not Span/Hispanic,3,Emergency,Home or Self Care,2020,INJ013,"OPEN WOUNDS OF TRUNK, INITIAL ENCOUNTER",RES005,CHEST TUBE PLACEMENT AND THERAPEUTIC THORACENTESIS,361,SKIN GRAFT FOR SKIN & SUBCUTANEOUS TISSUE DIAGNOSES,09,"DISEASES AND DISORDERS OF THE SKIN, SUBCUTANEOUS TISSUE AND BREAST",1,Minor,Minor,Surgical,Medicaid,,,,,Y,85758.73,14790.29
Long Island,Nassau,2908000,000511,NYU Langone Hospital-Long Island,70 or Older,117,F,White,Not Span/Hispanic,16,Trauma,Skilled Nursing Home,2020,INJ012,"OPEN WOUNDS TO LIMBS, INITIAL ENCOUNTER",SKB007,SKIN GRAFT,361,SKIN GRAFT FOR SKIN & SUBCUTANEOUS TISSUE DIAGNOSES,09,"DISEASES AND DISORDERS OF THE SKIN, SUBCUTANEOUS TISSUE AND BREAST",3,Major,Moderate,Surgical,Medicare,Blue Cross/Blue Shield,,,,Y,734297.56,91579.91
Long Island,Nassau,2908000,000511,NYU Langone Hospital-Long Island,70 or Older,115,M,White,Not Span/Hispanic,6,Elective,Skilled Nursing Home,2020,SKN004,NON-PRESSURE ULCER OF SKIN,SKB007,SKIN GRAFT,361,SKIN GRAFT FOR SKIN & SUBCUTANEOUS TISSUE DIAGNOSES,09,"DISEASES AND DISORDERS OF THE SKIN, SUBCUTANEOUS TISSUE AND BREAST",3,Major,Moderate,Surgical,Medicare,Blue Cross/Blue Shield,,,,N,72633.73,23660.74
Long Island,Nassau,2908000,000511,NYU Langone Hospital-Long Island,50 to 69,110,F,White,Not Span/Hispanic,1,Elective,Home or Self Care,2020,NEO025,SKIN CANCERS - MELANOMA,SKB007,SKIN GRAFT,361,SKIN GRAFT FOR SKIN & SUBCUTANEOUS TISSUE DIAGNOSES,09,"DISEASES AND DISORDERS OF THE SKIN, SUBCUTANEOUS TISSUE AND BREAST",2,Moderate,Moderate,Surgical,Medicare,Medicare,,,,N,106257.22,15881.91
Long Island,Nassau,2908000,000511,NYU Langone Hospital-Long Island,18 to 29,110,M,Other Race,Not Span/Hispanic,2,Emergency,Home or Self Care,2020,INJ012,"OPEN WOUNDS TO LIMBS, INITIAL ENCOUNTER",SKB008,SKIN EXCISION AND DEBRIDEMENT,361,SKIN GRAFT FOR SKIN & SUBCUTANEOUS TISSUE DIAGNOSES,09,"DISEASES AND DISORDERS OF THE SKIN, SUBCUTANEOUS TISSUE AND BREAST",2,Moderate,Minor,Surgical,Self-Pay,,,,,Y,85264.44,15264.64
Long Island,Nassau,2908000,000511,NYU Langone Hospital-Long Island,50 to 69,115,F,White,Not Span/Hispanic,5,Elective,Home w/ Home Health Services,2020,FAC004,ENCOUNTER FOR PROPHYLACTIC OR OTHER PROCEDURES,SKB004,BREAST RECONSTRUCTION,361,SKIN GRAFT FOR SKIN & SUBCUTANEOUS TISSUE DIAGNOSES,09,"DISEASES AND DISORDERS OF THE SKIN, SUBCUTANEOUS TISSUE AND BREAST",1,Minor,Minor,Surgical,Private Health Insurance,,,,,N,147521.64,35862.29
Long Island,Nassau,2908000,000511,NYU Langone Hospital-Long Island,18 to 29,117,M,White,Not Span/Hispanic,1,Elective,Home or Self Care,2020,SKN001,SKIN AND SUBCUTANEOUS TISSUE INFECTIONS,SKB007,SKIN GRAFT,361,SKIN GRAFT FOR SKIN & SUBCUTANEOUS TISSUE DIAGNOSES,09,"DISEASES AND DISORDERS OF THE SKIN, SUBCUTANEOUS TISSUE AND BREAST",1,Minor,Minor,Surgical,Private Health Insurance,,,,,N,33079.71,6465.97
Long Island,Nassau,2908000,000511,NYU Langone Hospital-Long Island,70 or Older,115,F,White,Not Span/Hispanic,2,Elective,Home w/ Home Health Services,2020,NEO027,SKIN CANCERS - SQUAMOUS CELL CARCINOMA,SKB007,SKIN GRAFT,361,SKIN GRAFT FOR SKIN & SUBCUTANEOUS TISSUE DIAGNOSES,09,"DISEASES AND DISORDERS OF THE SKIN, SUBCUTANEOUS TISSUE AND BREAST",2,Moderate,Moderate,Surgical,Medicare,Medicare,,,,N,82820.17,16329.29
Long Island,Nassau,2908000,000511,NYU Langone Hospital-Long Island,18 to 29,112,M,Other Race,Spanish/Hispanic,16,Trauma,Home w/ Home Health Services,2020,INJ011,"OPEN WOUNDS OF HEAD AND NECK, INITIAL ENCOUNTER",SKB007,SKIN GRAFT,361,SKIN GRAFT FOR SKIN & SUBCUTANEOUS TISSUE DIAGNOSES,09,"DISEASES AND DISORDERS OF THE SKIN, SUBCUTANEOUS TISSUE AND BREAST",3,Major,Moderate,Surgical,Miscellaneous/Other,,,,,Y,472493.98,100426.78
Long Island,Nassau,2908000,000511,NYU Langone Hospital-Long Island,18 to 29,,F,Other Race,Unknown,4,Emergency,Home or Self Care,2020,INJ013,"OPEN WOUNDS OF TRUNK, INITIAL ENCOUNTER",MST020,SUBCUTANEOUS TISSUE AND FASCIA EXCISION,361,SKIN GRAFT FOR SKIN & SUBCUTANEOUS TISSUE DIAGNOSES,09,"DISEASES AND DISORDERS OF THE SKIN, SUBCUTANEOUS TISSUE AND BREAST",2,Moderate,Minor,Surgical,Blue Cross/Blue Shield,,,,,Y,138704.33,30668.87
Long Island,Nassau,2908000,000511,NYU Langone Hospital-Long Island,70 or Older,114,F,Other Race,Not Span/Hispanic,3,Elective,Home or Self Care,2020,NEO030,BREAST CANCER - ALL OTHER TYPES,LYM001,LYMPH NODE BIOPSY,361,SKIN GRAFT FOR SKIN & SUBCUTANEOUS TISSUE DIAGNOSES,09,"DISEASES AND DISORDERS OF THE SKIN, SUBCUTANEOUS TISSUE AND BREAST",1,Minor,Minor,Surgical,Medicare,Medicare,,,,N,271073.43,45364.81
Long Island,Nassau,2908000,000511,NYU Langone Hospital-Long Island,50 to 69,117,M,White,Not Span/Hispanic,2,Elective,Home w/ Home Health Services,2020,NEO027,SKIN CANCERS - SQUAMOUS CELL CARCINOMA,MST028,"SUBCUTANEOUS TISSUE AND FASCIA PROCEDURES, NEC",361,SKIN GRAFT FOR SKIN & SUBCUTANEOUS TISSUE DIAGNOSES,09,"DISEASES AND DISORDERS OF THE SKIN, SUBCUTANEOUS TISSUE AND BREAST",3,Major,Moderate,Surgical,Medicare,Blue Cross/Blue Shield,,,,N,185802.1,30326.32
Long Island,Nassau,2908000,000511,NYU Langone Hospital-Long Island,50 to 69,115,M,White,Not Span/Hispanic,3,Emergency,Home or Self Care,2020,SKN001,SKIN AND SUBCUTANEOUS TISSUE INFECTIONS,SKB008,SKIN EXCISION AND DEBRIDEMENT,361,SKIN GRAFT FOR SKIN & SUBCUTANEOUS TISSUE DIAGNOSES,09,"DISEASES AND DISORDERS OF THE SKIN, SUBCUTANEOUS TISSUE AND BREAST",1,Minor,Minor,Surgical,Medicaid,,,,,Y,37055.39,14607.54
Long Island,Nassau,2908000,000511,NYU Langone Hospital-Long Island,70 or Older,115,F,White,Not Span/Hispanic,11,Emergency,Home w/ Home Health Services,2020,SKN001,SKIN AND SUBCUTANEOUS TISSUE INFECTIONS,SKB007,SKIN GRAFT,361,SKIN GRAFT FOR SKIN & SUBCUTANEOUS TISSUE DIAGNOSES,09,"DISEASES AND DISORDERS OF THE SKIN, SUBCUTANEOUS TISSUE AND BREAST",3,Major,Minor,Surgical,Medicare,Medicaid,,,,Y,245490.29,71664.83
Long Island,Nassau,2908000,000511,NYU Langone Hospital-Long Island,30 to 49,117,F,White,Not Span/Hispanic,9,Emergency,Home w/ Home Health Services,2020,END003,DIABETES MELLITUS WITH COMPLICATION,SKB007,SKIN GRAFT,361,SKIN GRAFT FOR SKIN & SUBCUTANEOUS TISSUE DIAGNOSES,09,"DISEASES AND DISORDERS OF THE SKIN, SUBCUTANEOUS TISSUE AND BREAST",3,Major,Major,Surgical,Medicaid,,,,,Y,233348.67,53173.17
Long Island,Nassau,2908000,000511,NYU Langone Hospital-Long Island,18 to 29,115,M,Black/African American,Not Span/Hispanic,1,Elective,Home or Self Care,2020,INJ012,"OPEN WOUNDS TO LIMBS, INITIAL ENCOUNTER",SKB007,SKIN GRAFT,361,SKIN GRAFT FOR SKIN & SUBCUTANEOUS TISSUE DIAGNOSES,09,"DISEASES AND DISORDERS OF THE SKIN, SUBCUTANEOUS TISSUE AND BREAST",1,Minor,Minor,Surgical,Medicaid,,,,,N,47810.85,9876.73
Long Island,Nassau,2908000,000511,NYU Langone Hospital-Long Island,30 to 49,117,M,White,Not Span/Hispanic,3,Elective,Home w/ Home Health Services,2020,END003,DIABETES MELLITUS WITH COMPLICATION,MST018,BONE EXCISION,361,SKIN GRAFT FOR SKIN & SUBCUTANEOUS TISSUE DIAGNOSES,09,"DISEASES AND DISORDERS OF THE SKIN, SUBCUTANEOUS TISSUE AND BREAST",3,Major,Major,Surgical,Blue Cross/Blue Shield,,,,,N,121174.03,30086.52
Long Island,Nassau,2908000,000511,NYU Langone Hospital-Long Island,70 or Older,110,M,White,Not Span/Hispanic,4,Elective,Skilled Nursing Home,2020,NEO027,SKIN CANCERS - SQUAMOUS CELL CARCINOMA,SKB007,SKIN GRAFT,361,SKIN GRAFT FOR SKIN & SUBCUTANEOUS TISSUE DIAGNOSES,09,"DISEASES AND DISORDERS OF THE SKIN, SUBCUTANEOUS TISSUE AND BREAST",4,Extreme,Extreme,Surgical,Medicare,Blue Cross/Blue Shield,,,,N,250218.57,46884.74
Long Island,Nassau,2908000,000511,NYU Langone Hospital-Long Island,70 or Older,115,F,White,Not Span/Hispanic,2,Emergency,Home or Self Care,2020,FAC004,ENCOUNTER FOR PROPHYLACTIC OR OTHER PROCEDURES,SKB007,SKIN GRAFT,361,SKIN GRAFT FOR SKIN & SUBCUTANEOUS TISSUE DIAGNOSES,09,"DISEASES AND DISORDERS OF THE SKIN, SUBCUTANEOUS TISSUE AND BREAST",1,Minor,Minor,Surgical,Medicare,,,,,Y,69831.92,15319.86
Long Island,Nassau,2908000,000511,NYU Langone Hospital-Long Island,30 to 49,117,F,White,Not Span/Hispanic,3,Elective,Home w/ Home Health Services,2020,FAC004,ENCOUNTER FOR PROPHYLACTIC OR OTHER PROCEDURES,SKB004,BREAST RECONSTRUCTION,361,SKIN GRAFT FOR SKIN & SUBCUTANEOUS TISSUE DIAGNOSES,09,"DISEASES AND DISORDERS OF THE SKIN, SUBCUTANEOUS TISSUE AND BREAST",1,Minor,Minor,Surgical,Blue Cross/Blue Shield,,,,,N,203672.04,41344.09
Long Island,Nassau,2908000,000511,NYU Langone Hospital-Long Island,50 to 69,115,M,White,Not Span/Hispanic,4,Elective,Home w/ Home Health Services,2020,END003,DIABETES MELLITUS WITH COMPLICATION,SKB007,SKIN GRAFT,361,SKIN GRAFT FOR SKIN & SUBCUTANEOUS TISSUE DIAGNOSES,09,"DISEASES AND DISORDERS OF THE SKIN, SUBCUTANEOUS TISSUE AND BREAST",2,Moderate,Moderate,Surgical,Private Health Insurance,Medicare,,,,N,75115.35,21925.56
Long Island,Nassau,2908000,000511,NYU Langone Hospital-Long Island,70 or Older,115,F,White,Not Span/Hispanic,1,Trauma,Hospice - Home,2020,INJ011,"OPEN WOUNDS OF HEAD AND NECK, INITIAL ENCOUNTER",SKB007,SKIN GRAFT,361,SKIN GRAFT FOR SKIN & SUBCUTANEOUS TISSUE DIAGNOSES,09,"DISEASES AND DISORDERS OF THE SKIN, SUBCUTANEOUS TISSUE AND BREAST",1,Minor,Moderate,Surgical,Medicare,,,,,Y,34236.03,9652.33
