Hospital Service Area,Hospital County,Operating Certificate Number,Permanent Facility Id,Facility Name,Age Group,Zip Code - 3 digits,Gender,Race,Ethnicity,Length of Stay,Type of Admission,Patient Disposition,Discharge Year,CCS Diagnosis Code,CCS Diagnosis Description,CCS Procedure Code,CCS Procedure Description,APR DRG Code,APR DRG Description,APR MDC Code,APR MDC Description,APR Severity of Illness Code,APR Severity of Illness Description,APR Risk of Mortality,APR Medical Surgical Description,Payment Typology 1,Payment Typology 2,Payment Typology 3,Birth Weight,Abortion Edit Indicator,Emergency Department Indicator,Total Charges,Total Costs
New York City,Manhattan,7002024,001456,Mount Sinai Hospital,30 to 49,104,F,Other Race,Spanish/Hispanic,2,Elective,Home or Self Care,2020,NEO029,BREAST CANCER - DUCTAL CARCINOMA IN SITU (DCIS),LYM001,LYMPH NODE BIOPSY,362,MASTECTOMY PROCEDURES,09,"DISEASES AND DISORDERS OF THE SKIN, SUBCUTANEOUS TISSUE AND BREAST",2,Moderate,Minor,Surgical,Private Health Insurance,Self-Pay,,,,N,80772.77,29676.34
New York City,Manhattan,7002024,001456,Mount Sinai Hospital,30 to 49,103,F,White,Not Span/Hispanic,2,Elective,Home w/ Home Health Services,2020,NEO030,BREAST CANCER - ALL OTHER TYPES,LYM001,LYMPH NODE BIOPSY,362,MASTECTOMY PROCEDURES,09,"DISEASES AND DISORDERS OF THE SKIN, SUBCUTANEOUS TISSUE AND BREAST",2,Moderate,Moderate,Surgical,Private Health Insurance,Self-Pay,,,,N,90095.72,31646.97
New York City,Manhattan,7002024,001456,Mount Sinai Hospital,50 to 69,105,F,Other Race,Not Span/Hispanic,5,Elective,Home or Self Care,2020,NEO030,BREAST CANCER - ALL OTHER TYPES,SKB003,MASTECTOMY AND LUMPECTOMY,362,MASTECTOMY PROCEDURES,09,"DISEASES AND DISORDERS OF THE SKIN, SUBCUTANEOUS TISSUE AND BREAST",2,Moderate,Minor,Surgical,Medicaid,Medicaid,Self-Pay,,,N,123543.14,33168.81
New York City,Manhattan,7002024,001456,Mount Sinai Hospital,50 to 69,100,F,Other Race,Not Span/Hispanic,3,Elective,Home or Self Care,2020,NEO030,BREAST CANCER - ALL OTHER TYPES,LYM001,LYMPH NODE BIOPSY,362,MASTECTOMY PROCEDURES,09,"DISEASES AND DISORDERS OF THE SKIN, SUBCUTANEOUS TISSUE AND BREAST",2,Moderate,Moderate,Surgical,Medicare,Medicare,Self-Pay,,,N,96553.51,24971.27
New York City,Bronx,7000006,003058,Montefiore Med Center - Jack D Weiler Hosp of A Einstein College Div,30 to 49,104,F,Other Race,Spanish/Hispanic,2,Elective,Home or Self Care,2020,FAC004,ENCOUNTER FOR PROPHYLACTIC OR OTHER PROCEDURES,SKB003,MASTECTOMY AND LUMPECTOMY,362,MASTECTOMY PROCEDURES,09,"DISEASES AND DISORDERS OF THE SKIN, SUBCUTANEOUS TISSUE AND BREAST",2,Moderate,Minor,Surgical,Private Health Insurance,,,,,N,136857.11,39077.35
New York City,Manhattan,7002032,001469,Mount Sinai Morningside,50 to 69,100,F,Other Race,Spanish/Hispanic,2,Urgent,Home w/ Home Health Services,2020,NEO030,BREAST CANCER - ALL OTHER TYPES,SKB003,MASTECTOMY AND LUMPECTOMY,362,MASTECTOMY PROCEDURES,09,"DISEASES AND DISORDERS OF THE SKIN, SUBCUTANEOUS TISSUE AND BREAST",1,Minor,Minor,Surgical,Blue Cross/Blue Shield,Self-Pay,,,,N,74946.49,19671.23
New York City,Manhattan,7002002,001439,Mount Sinai Beth Israel,50 to 69,112,F,Other Race,Not Span/Hispanic,2,Elective,Home or Self Care,2020,NEO029,BREAST CANCER - DUCTAL CARCINOMA IN SITU (DCIS),SKB003,MASTECTOMY AND LUMPECTOMY,362,MASTECTOMY PROCEDURES,09,"DISEASES AND DISORDERS OF THE SKIN, SUBCUTANEOUS TISSUE AND BREAST",1,Minor,Minor,Surgical,Medicaid,Medicaid,Self-Pay,,,N,89763.95,17912.1
New York City,Manhattan,7002032,001466,Mount Sinai West,30 to 49,100,F,Other Race,Spanish/Hispanic,8,Elective,Home w/ Home Health Services,2020,NEO030,BREAST CANCER - ALL OTHER TYPES,SKB003,MASTECTOMY AND LUMPECTOMY,362,MASTECTOMY PROCEDURES,09,"DISEASES AND DISORDERS OF THE SKIN, SUBCUTANEOUS TISSUE AND BREAST",1,Minor,Moderate,Surgical,Medicaid,Medicaid,Self-Pay,,,N,123588.71,28772.74
New York City,Manhattan,7002032,001466,Mount Sinai West,30 to 49,104,F,Black/African American,Not Span/Hispanic,3,Elective,Home or Self Care,2020,NEO029,BREAST CANCER - DUCTAL CARCINOMA IN SITU (DCIS),SKB004,BREAST RECONSTRUCTION,362,MASTECTOMY PROCEDURES,09,"DISEASES AND DISORDERS OF THE SKIN, SUBCUTANEOUS TISSUE AND BREAST",2,Moderate,Minor,Surgical,Blue Cross/Blue Shield,Self-Pay,,,,N,76523.84,18128.24
Hudson Valley,Westchester,5901000,001039,NewYork-Presbyterian/Hudson Valley Hospital,50 to 69,105,F,White,Not Span/Hispanic,2,Elective,Home or Self Care,2020,NEO030,BREAST CANCER - ALL OTHER TYPES,SKB003,MASTECTOMY AND LUMPECTOMY,362,MASTECTOMY PROCEDURES,09,"DISEASES AND DISORDERS OF THE SKIN, SUBCUTANEOUS TISSUE AND BREAST",2,Moderate,Minor,Surgical,Medicare,Private Health Insurance,,,,N,254583.81,92975.33
New York City,Bronx,7000006,003058,Montefiore Med Center - Jack D Weiler Hosp of A Einstein College Div,50 to 69,107,F,Other Race,Spanish/Hispanic,1,Elective,Home w/ Home Health Services,2020,NEO030,BREAST CANCER - ALL OTHER TYPES,SKB003,MASTECTOMY AND LUMPECTOMY,362,MASTECTOMY PROCEDURES,09,"DISEASES AND DISORDERS OF THE SKIN, SUBCUTANEOUS TISSUE AND BREAST",1,Minor,Minor,Surgical,Medicare,Medicaid,,,,N,60437.21,9721.85
New York City,Manhattan,7002024,001456,Mount Sinai Hospital,50 to 69,111,F,White,Not Span/Hispanic,1,Elective,Home or Self Care,2020,NEO030,BREAST CANCER - ALL OTHER TYPES,SKB003,MASTECTOMY AND LUMPECTOMY,362,MASTECTOMY PROCEDURES,09,"DISEASES AND DISORDERS OF THE SKIN, SUBCUTANEOUS TISSUE AND BREAST",1,Minor,Minor,Surgical,Private Health Insurance,Self-Pay,,,,N,43122.8,14502.22
New York City,Manhattan,7002024,001456,Mount Sinai Hospital,50 to 69,103,F,White,Not Span/Hispanic,1,Elective,Home or Self Care,2020,NEO030,BREAST CANCER - ALL OTHER TYPES,SKB003,MASTECTOMY AND LUMPECTOMY,362,MASTECTOMY PROCEDURES,09,"DISEASES AND DISORDERS OF THE SKIN, SUBCUTANEOUS TISSUE AND BREAST",1,Minor,Moderate,Surgical,Blue Cross/Blue Shield,Self-Pay,,,,N,31023.58,8258.24
New York City,Manhattan,7002054,001464,New York-Presbyterian Hospital - Columbia Presbyterian Center,50 to 69,107,F,White,Not Span/Hispanic,2,Elective,Home or Self Care,2020,NEO030,BREAST CANCER - ALL OTHER TYPES,SKB003,MASTECTOMY AND LUMPECTOMY,362,MASTECTOMY PROCEDURES,09,"DISEASES AND DISORDERS OF THE SKIN, SUBCUTANEOUS TISSUE AND BREAST",2,Moderate,Moderate,Surgical,Blue Cross/Blue Shield,Self-Pay,,,,N,100076.6,33805.45
New York City,Manhattan,7002054,001464,New York-Presbyterian Hospital - Columbia Presbyterian Center,70 or Older,OOS,M,White,Not Span/Hispanic,1,Elective,Home or Self Care,2020,NEO029,BREAST CANCER - DUCTAL CARCINOMA IN SITU (DCIS),SKB003,MASTECTOMY AND LUMPECTOMY,362,MASTECTOMY PROCEDURES,09,"DISEASES AND DISORDERS OF THE SKIN, SUBCUTANEOUS TISSUE AND BREAST",3,Major,Moderate,Surgical,Medicare,Private Health Insurance,Self-Pay,,,N,37663.48,11503.17
New York City,Manhattan,7002054,001464,New York-Presbyterian Hospital - Columbia Presbyterian Center,50 to 69,114,F,Other Race,Not Span/Hispanic,2,Urgent,Home w/ Home Health Services,2020,NEO030,BREAST CANCER - ALL OTHER TYPES,SKB003,MASTECTOMY AND LUMPECTOMY,362,MASTECTOMY PROCEDURES,09,"DISEASES AND DISORDERS OF THE SKIN, SUBCUTANEOUS TISSUE AND BREAST",2,Moderate,Minor,Surgical,Medicaid,Self-Pay,,,,N,52875.2,15960.46
New York City,Manhattan,7002054,001464,New York-Presbyterian Hospital - Columbia Presbyterian Center,18 to 29,109,F,White,Not Span/Hispanic,4,Elective,Home or Self Care,2020,NEO030,BREAST CANCER - ALL OTHER TYPES,SKB003,MASTECTOMY AND LUMPECTOMY,362,MASTECTOMY PROCEDURES,09,"DISEASES AND DISORDERS OF THE SKIN, SUBCUTANEOUS TISSUE AND BREAST",2,Moderate,Minor,Surgical,Private Health Insurance,Self-Pay,,,,N,126582.29,43986.79
New York City,Manhattan,7002054,001464,New York-Presbyterian Hospital - Columbia Presbyterian Center,50 to 69,104,F,Black/African American,Spanish/Hispanic,2,Elective,Home w/ Home Health Services,2020,NEO030,BREAST CANCER - ALL OTHER TYPES,SKB003,MASTECTOMY AND LUMPECTOMY,362,MASTECTOMY PROCEDURES,09,"DISEASES AND DISORDERS OF THE SKIN, SUBCUTANEOUS TISSUE AND BREAST",2,Moderate,Moderate,Surgical,Private Health Insurance,Self-Pay,,,,N,78446.43,26344.37
New York City,Manhattan,7002054,001464,New York-Presbyterian Hospital - Columbia Presbyterian Center,50 to 69,100,F,Multi-racial,Spanish/Hispanic,2,Elective,Home or Self Care,2020,NEO030,BREAST CANCER - ALL OTHER TYPES,SKB003,MASTECTOMY AND LUMPECTOMY,362,MASTECTOMY PROCEDURES,09,"DISEASES AND DISORDERS OF THE SKIN, SUBCUTANEOUS TISSUE AND BREAST",2,Moderate,Minor,Surgical,Blue Cross/Blue Shield,Medicaid,Self-Pay,,,N,74968.77,25550.36
New York City,Manhattan,7002024,001456,Mount Sinai Hospital,30 to 49,100,F,Other Race,Unknown,2,Elective,Home w/ Home Health Services,2020,NEO029,BREAST CANCER - DUCTAL CARCINOMA IN SITU (DCIS),LYM001,LYMPH NODE BIOPSY,362,MASTECTOMY PROCEDURES,09,"DISEASES AND DISORDERS OF THE SKIN, SUBCUTANEOUS TISSUE AND BREAST",1,Minor,Minor,Surgical,Private Health Insurance,Self-Pay,,,,N,37990.5,10740.23
New York City,Manhattan,7002024,001456,Mount Sinai Hospital,50 to 69,100,F,Other Race,Not Span/Hispanic,3,Elective,Home w/ Home Health Services,2020,NEO029,BREAST CANCER - DUCTAL CARCINOMA IN SITU (DCIS),SKB003,MASTECTOMY AND LUMPECTOMY,362,MASTECTOMY PROCEDURES,09,"DISEASES AND DISORDERS OF THE SKIN, SUBCUTANEOUS TISSUE AND BREAST",3,Major,Major,Surgical,Medicaid,Medicaid,Self-Pay,,,N,93202.27,24252.58
New York City,Manhattan,7002024,001456,Mount Sinai Hospital,30 to 49,114,F,Multi-racial,Not Span/Hispanic,2,Elective,Home or Self Care,2020,NEO030,BREAST CANCER - ALL OTHER TYPES,LYM001,LYMPH NODE BIOPSY,362,MASTECTOMY PROCEDURES,09,"DISEASES AND DISORDERS OF THE SKIN, SUBCUTANEOUS TISSUE AND BREAST",1,Minor,Moderate,Surgical,Blue Cross/Blue Shield,Self-Pay,,,,N,61045.62,21630.13
New York City,Queens,7003010,001637,New York - Presbyterian/Queens,30 to 49,113,F,Other Race,Not Span/Hispanic,2,Elective,Home w/ Home Health Services,2020,NEO030,BREAST CANCER - ALL OTHER TYPES,SKB003,MASTECTOMY AND LUMPECTOMY,362,MASTECTOMY PROCEDURES,09,"DISEASES AND DISORDERS OF THE SKIN, SUBCUTANEOUS TISSUE AND BREAST",2,Moderate,Moderate,Surgical,"Managed Care, Unspecified",Medicaid,Self-Pay,,,N,69798.46,38986.9
New York City,Queens,7003010,001637,New York - Presbyterian/Queens,70 or Older,113,F,Black/African American,Not Span/Hispanic,2,Elective,Home or Self Care,2020,NEO030,BREAST CANCER - ALL OTHER TYPES,SKB003,MASTECTOMY AND LUMPECTOMY,362,MASTECTOMY PROCEDURES,09,"DISEASES AND DISORDERS OF THE SKIN, SUBCUTANEOUS TISSUE AND BREAST",1,Minor,Minor,Surgical,Medicare,Private Health Insurance,Self-Pay,,,N,37189.61,12008.98
New York City,Queens,7003010,001637,New York - Presbyterian/Queens,30 to 49,,F,White,Not Span/Hispanic,1,Elective,Home or Self Care,2020,NEO030,BREAST CANCER - ALL OTHER TYPES,SKB003,MASTECTOMY AND LUMPECTOMY,362,MASTECTOMY PROCEDURES,09,"DISEASES AND DISORDERS OF THE SKIN, SUBCUTANEOUS TISSUE AND BREAST",1,Minor,Moderate,Surgical,Private Health Insurance,,,,,N,25913.29,9891.42
New York City,Queens,7003010,001637,New York - Presbyterian/Queens,30 to 49,113,F,Other Race,Not Span/Hispanic,2,Elective,Home or Self Care,2020,NEO029,BREAST CANCER - DUCTAL CARCINOMA IN SITU (DCIS),SKB003,MASTECTOMY AND LUMPECTOMY,362,MASTECTOMY PROCEDURES,09,"DISEASES AND DISORDERS OF THE SKIN, SUBCUTANEOUS TISSUE AND BREAST",2,Moderate,Minor,Surgical,Private Health Insurance,,,,,N,56844.62,18517.88
New York City,Manhattan,7002054,001458,New York-Presbyterian Hospital - New York Weill Cornell Center,50 to 69,104,F,White,Spanish/Hispanic,3,Elective,Home w/ Home Health Services,2020,NEO030,BREAST CANCER - ALL OTHER TYPES,SKB003,MASTECTOMY AND LUMPECTOMY,362,MASTECTOMY PROCEDURES,09,"DISEASES AND DISORDERS OF THE SKIN, SUBCUTANEOUS TISSUE AND BREAST",2,Moderate,Minor,Surgical,Blue Cross/Blue Shield,Self-Pay,,,,N,181263.74,65305.05
New York City,Manhattan,7002054,001437,New York-Presbyterian/Lower Manhattan Hospital,50 to 69,112,F,Other Race,Not Span/Hispanic,1,Elective,Home or Self Care,2020,NEO029,BREAST CANCER - DUCTAL CARCINOMA IN SITU (DCIS),SKB003,MASTECTOMY AND LUMPECTOMY,362,MASTECTOMY PROCEDURES,09,"DISEASES AND DISORDERS OF THE SKIN, SUBCUTANEOUS TISSUE AND BREAST",1,Minor,Minor,Surgical,Medicare,Medicare,Self-Pay,,,N,45304.68,14760.55
New York City,Manhattan,7002054,001458,New York-Presbyterian Hospital - New York Weill Cornell Center,70 or Older,OOS,F,White,Not Span/Hispanic,2,Elective,Home or Self Care,2020,NEO030,BREAST CANCER - ALL OTHER TYPES,SKB003,MASTECTOMY AND LUMPECTOMY,362,MASTECTOMY PROCEDURES,09,"DISEASES AND DISORDERS OF THE SKIN, SUBCUTANEOUS TISSUE AND BREAST",1,Minor,Minor,Surgical,Medicare,Blue Cross/Blue Shield,Self-Pay,,,N,65160.77,21045.31
New York City,Manhattan,7002054,001458,New York-Presbyterian Hospital - New York Weill Cornell Center,50 to 69,113,F,Other Race,Not Span/Hispanic,2,Elective,Home or Self Care,2020,NEO030,BREAST CANCER - ALL OTHER TYPES,SKB003,MASTECTOMY AND LUMPECTOMY,362,MASTECTOMY PROCEDURES,09,"DISEASES AND DISORDERS OF THE SKIN, SUBCUTANEOUS TISSUE AND BREAST",1,Minor,Moderate,Surgical,Medicare,Medicare,Medicaid,,,N,91306.38,26997.09
New York City,Manhattan,7002054,001458,New York-Presbyterian Hospital - New York Weill Cornell Center,50 to 69,OOS,F,White,Not Span/Hispanic,1,Elective,Home or Self Care,2020,NEO030,BREAST CANCER - ALL OTHER TYPES,SKB003,MASTECTOMY AND LUMPECTOMY,362,MASTECTOMY PROCEDURES,09,"DISEASES AND DISORDERS OF THE SKIN, SUBCUTANEOUS TISSUE AND BREAST",2,Moderate,Minor,Surgical,Blue Cross/Blue Shield,Self-Pay,,,,N,60192.53,21426.46
New York City,Manhattan,7002054,001458,New York-Presbyterian Hospital - New York Weill Cornell Center,30 to 49,100,F,Other Race,Not Span/Hispanic,3,Elective,Home or Self Care,2020,FAC004,ENCOUNTER FOR PROPHYLACTIC OR OTHER PROCEDURES,SKB003,MASTECTOMY AND LUMPECTOMY,362,MASTECTOMY PROCEDURES,09,"DISEASES AND DISORDERS OF THE SKIN, SUBCUTANEOUS TISSUE AND BREAST",2,Moderate,Minor,Surgical,Miscellaneous/Other,Self-Pay,,,,N,137905.65,54743.62
New York City,Kings,7001021,001306,New York - Presbyterian Brooklyn Methodist Hospital,50 to 69,103,F,White,Not Span/Hispanic,2,Elective,Home or Self Care,2020,NEO030,BREAST CANCER - ALL OTHER TYPES,LYM001,LYMPH NODE BIOPSY,362,MASTECTOMY PROCEDURES,09,"DISEASES AND DISORDERS OF THE SKIN, SUBCUTANEOUS TISSUE AND BREAST",2,Moderate,Moderate,Surgical,Private Health Insurance,Self-Pay,,,,N,51800.39,18927.42
New York City,Manhattan,7002054,001458,New York-Presbyterian Hospital - New York Weill Cornell Center,30 to 49,112,F,Other Race,Not Span/Hispanic,1,Elective,Home or Self Care,2020,NEO030,BREAST CANCER - ALL OTHER TYPES,SKB003,MASTECTOMY AND LUMPECTOMY,362,MASTECTOMY PROCEDURES,09,"DISEASES AND DISORDERS OF THE SKIN, SUBCUTANEOUS TISSUE AND BREAST",2,Moderate,Minor,Surgical,Private Health Insurance,,,,,N,70989.82,29200.55
New York City,Manhattan,7002054,001458,New York-Presbyterian Hospital - New York Weill Cornell Center,50 to 69,OOS,F,White,Not Span/Hispanic,1,Elective,Home or Self Care,2020,NEO030,BREAST CANCER - ALL OTHER TYPES,SKB003,MASTECTOMY AND LUMPECTOMY,362,MASTECTOMY PROCEDURES,09,"DISEASES AND DISORDERS OF THE SKIN, SUBCUTANEOUS TISSUE AND BREAST",2,Moderate,Minor,Surgical,Private Health Insurance,Self-Pay,,,,N,60791.65,21452.74
New York City,Manhattan,7002054,001458,New York-Presbyterian Hospital - New York Weill Cornell Center,30 to 49,109,F,White,Not Span/Hispanic,1,Emergency,Home or Self Care,2020,NEO030,BREAST CANCER - ALL OTHER TYPES,SKB003,MASTECTOMY AND LUMPECTOMY,362,MASTECTOMY PROCEDURES,09,"DISEASES AND DISORDERS OF THE SKIN, SUBCUTANEOUS TISSUE AND BREAST",2,Moderate,Minor,Surgical,Private Health Insurance,Self-Pay,,,,N,77210.47,28950.09
New York City,Manhattan,7002054,001458,New York-Presbyterian Hospital - New York Weill Cornell Center,30 to 49,112,F,Other Race,Not Span/Hispanic,2,Elective,Home w/ Home Health Services,2020,NEO030,BREAST CANCER - ALL OTHER TYPES,SKB003,MASTECTOMY AND LUMPECTOMY,362,MASTECTOMY PROCEDURES,09,"DISEASES AND DISORDERS OF THE SKIN, SUBCUTANEOUS TISSUE AND BREAST",1,Minor,Minor,Surgical,Private Health Insurance,Self-Pay,,,,N,99025.5,32648.81
New York City,Manhattan,7002054,001458,New York-Presbyterian Hospital - New York Weill Cornell Center,50 to 69,OOS,F,Black/African American,Not Span/Hispanic,1,Emergency,Home w/ Home Health Services,2020,NEO030,BREAST CANCER - ALL OTHER TYPES,SKB003,MASTECTOMY AND LUMPECTOMY,362,MASTECTOMY PROCEDURES,09,"DISEASES AND DISORDERS OF THE SKIN, SUBCUTANEOUS TISSUE AND BREAST",1,Minor,Moderate,Surgical,Private Health Insurance,Self-Pay,,,,N,42375.96,12974.93
New York City,Kings,7001021,001306,New York - Presbyterian Brooklyn Methodist Hospital,50 to 69,112,F,Other Race,Not Span/Hispanic,1,Elective,Home or Self Care,2020,NEO030,BREAST CANCER - ALL OTHER TYPES,SKB003,MASTECTOMY AND LUMPECTOMY,362,MASTECTOMY PROCEDURES,09,"DISEASES AND DISORDERS OF THE SKIN, SUBCUTANEOUS TISSUE AND BREAST",1,Minor,Minor,Surgical,"Managed Care, Unspecified",Medicaid,Self-Pay,,,N,28801.63,11624.1
New York City,Bronx,7000006,003058,Montefiore Med Center - Jack D Weiler Hosp of A Einstein College Div,50 to 69,104,F,Black/African American,Not Span/Hispanic,3,Elective,Home w/ Home Health Services,2020,FAC004,ENCOUNTER FOR PROPHYLACTIC OR OTHER PROCEDURES,SKB003,MASTECTOMY AND LUMPECTOMY,362,MASTECTOMY PROCEDURES,09,"DISEASES AND DISORDERS OF THE SKIN, SUBCUTANEOUS TISSUE AND BREAST",2,Moderate,Minor,Surgical,Private Health Insurance,,,,,N,116261.95,22539.85
New York City,Manhattan,7002032,001466,Mount Sinai West,50 to 69,112,F,White,Not Span/Hispanic,1,Elective,Home or Self Care,2020,NEO030,BREAST CANCER - ALL OTHER TYPES,SKB003,MASTECTOMY AND LUMPECTOMY,362,MASTECTOMY PROCEDURES,09,"DISEASES AND DISORDERS OF THE SKIN, SUBCUTANEOUS TISSUE AND BREAST",1,Minor,Moderate,Surgical,Blue Cross/Blue Shield,Self-Pay,,,,N,84695.41,23854.48
New York City,Manhattan,7002032,001466,Mount Sinai West,50 to 69,100,F,White,Not Span/Hispanic,5,Elective,Home w/ Home Health Services,2020,NEO030,BREAST CANCER - ALL OTHER TYPES,SKB003,MASTECTOMY AND LUMPECTOMY,362,MASTECTOMY PROCEDURES,09,"DISEASES AND DISORDERS OF THE SKIN, SUBCUTANEOUS TISSUE AND BREAST",2,Moderate,Moderate,Surgical,Blue Cross/Blue Shield,Self-Pay,,,,N,101767.42,23587.46
New York City,Manhattan,7002032,001466,Mount Sinai West,50 to 69,100,F,White,Spanish/Hispanic,3,Elective,Home or Self Care,2020,NEO030,BREAST CANCER - ALL OTHER TYPES,SKB003,MASTECTOMY AND LUMPECTOMY,362,MASTECTOMY PROCEDURES,09,"DISEASES AND DISORDERS OF THE SKIN, SUBCUTANEOUS TISSUE AND BREAST",1,Minor,Minor,Surgical,Private Health Insurance,Self-Pay,,,,N,84326.73,21350.7
New York City,Manhattan,7002032,001466,Mount Sinai West,50 to 69,100,F,White,Spanish/Hispanic,3,Elective,Home or Self Care,2020,NEO030,BREAST CANCER - ALL OTHER TYPES,SKB003,MASTECTOMY AND LUMPECTOMY,362,MASTECTOMY PROCEDURES,09,"DISEASES AND DISORDERS OF THE SKIN, SUBCUTANEOUS TISSUE AND BREAST",1,Minor,Minor,Surgical,Blue Cross/Blue Shield,Self-Pay,,,,N,74070.25,18288.11
New York City,Manhattan,7002032,001466,Mount Sinai West,30 to 49,111,F,Other Race,Spanish/Hispanic,1,Elective,Home or Self Care,2020,NEO030,BREAST CANCER - ALL OTHER TYPES,SKB003,MASTECTOMY AND LUMPECTOMY,362,MASTECTOMY PROCEDURES,09,"DISEASES AND DISORDERS OF THE SKIN, SUBCUTANEOUS TISSUE AND BREAST",2,Moderate,Minor,Surgical,Blue Cross/Blue Shield,Self-Pay,,,,N,142856.72,42641.85
New York City,Manhattan,7002032,001466,Mount Sinai West,70 or Older,100,F,Black/African American,Not Span/Hispanic,2,Elective,Home or Self Care,2020,NEO030,BREAST CANCER - ALL OTHER TYPES,SKB003,MASTECTOMY AND LUMPECTOMY,362,MASTECTOMY PROCEDURES,09,"DISEASES AND DISORDERS OF THE SKIN, SUBCUTANEOUS TISSUE AND BREAST",2,Moderate,Moderate,Surgical,Medicare,Medicare,Self-Pay,,,N,62178.48,15109.19
New York City,Manhattan,7002032,001466,Mount Sinai West,50 to 69,112,F,White,Not Span/Hispanic,1,Elective,Home or Self Care,2020,NEO029,BREAST CANCER - DUCTAL CARCINOMA IN SITU (DCIS),SKB003,MASTECTOMY AND LUMPECTOMY,362,MASTECTOMY PROCEDURES,09,"DISEASES AND DISORDERS OF THE SKIN, SUBCUTANEOUS TISSUE AND BREAST",1,Minor,Minor,Surgical,Private Health Insurance,Self-Pay,,,,N,33253.47,8147.55
New York City,Manhattan,7002032,001466,Mount Sinai West,50 to 69,112,F,Black/African American,Not Span/Hispanic,1,Elective,Home or Self Care,2020,NEO030,BREAST CANCER - ALL OTHER TYPES,SKB003,MASTECTOMY AND LUMPECTOMY,362,MASTECTOMY PROCEDURES,09,"DISEASES AND DISORDERS OF THE SKIN, SUBCUTANEOUS TISSUE AND BREAST",2,Moderate,Moderate,Surgical,Private Health Insurance,Self-Pay,,,,N,80723.84,23595.79
New York City,Manhattan,7002024,001456,Mount Sinai Hospital,50 to 69,104,F,Black/African American,Not Span/Hispanic,2,Elective,Home or Self Care,2020,NEO030,BREAST CANCER - ALL OTHER TYPES,SKB003,MASTECTOMY AND LUMPECTOMY,362,MASTECTOMY PROCEDURES,09,"DISEASES AND DISORDERS OF THE SKIN, SUBCUTANEOUS TISSUE AND BREAST",1,Minor,Moderate,Surgical,Blue Cross/Blue Shield,Self-Pay,,,,N,75243.19,23465.02
New York City,Manhattan,7002024,001456,Mount Sinai Hospital,50 to 69,117,F,White,Not Span/Hispanic,1,Elective,Home w/ Home Health Services,2020,NEO030,BREAST CANCER - ALL OTHER TYPES,LYM001,LYMPH NODE BIOPSY,362,MASTECTOMY PROCEDURES,09,"DISEASES AND DISORDERS OF THE SKIN, SUBCUTANEOUS TISSUE AND BREAST",2,Moderate,Moderate,Surgical,Blue Cross/Blue Shield,Self-Pay,,,,N,57551.75,18835.14
New York City,Manhattan,7002024,001456,Mount Sinai Hospital,30 to 49,OOS,F,White,Not Span/Hispanic,4,Elective,Home w/ Home Health Services,2020,NEO029,BREAST CANCER - DUCTAL CARCINOMA IN SITU (DCIS),LYM002,LYMPH NODE EXCISION (THERAPEUTIC),362,MASTECTOMY PROCEDURES,09,"DISEASES AND DISORDERS OF THE SKIN, SUBCUTANEOUS TISSUE AND BREAST",2,Moderate,Minor,Surgical,Private Health Insurance,Self-Pay,,,,N,113898.35,30993.93
Hudson Valley,Orange,3535001,000708,Bon Secours Community Hospital,50 to 69,127,F,White,Not Span/Hispanic,2,Elective,Home or Self Care,2020,NEO030,BREAST CANCER - ALL OTHER TYPES,SKB003,MASTECTOMY AND LUMPECTOMY,362,MASTECTOMY PROCEDURES,09,"DISEASES AND DISORDERS OF THE SKIN, SUBCUTANEOUS TISSUE AND BREAST",2,Moderate,Minor,Surgical,Private Health Insurance,,,,,N,67936.05,8546.48
Capital/Adirond,Otsego,3801000,000739,A.O. Fox Memorial Hospital,70 or Older,,F,Other Race,Not Span/Hispanic,3,Elective,Home or Self Care,2020,NEO030,BREAST CANCER - ALL OTHER TYPES,SKB003,MASTECTOMY AND LUMPECTOMY,362,MASTECTOMY PROCEDURES,09,"DISEASES AND DISORDERS OF THE SKIN, SUBCUTANEOUS TISSUE AND BREAST",2,Moderate,Moderate,Surgical,Medicare,Medicare,,,,N,14053,8487.72
Hudson Valley,Rockland,4329000,000779,Good Samaritan Hospital of Suffern,50 to 69,125,F,White,Not Span/Hispanic,2,Elective,Home or Self Care,2020,NEO030,BREAST CANCER - ALL OTHER TYPES,SKB003,MASTECTOMY AND LUMPECTOMY,362,MASTECTOMY PROCEDURES,09,"DISEASES AND DISORDERS OF THE SKIN, SUBCUTANEOUS TISSUE AND BREAST",1,Minor,Minor,Surgical,Medicare,,,,,N,103115.79,14766.79
New York City,Bronx,7000006,003058,Montefiore Med Center - Jack D Weiler Hosp of A Einstein College Div,50 to 69,104,F,Black/African American,Not Span/Hispanic,3,Elective,Home w/ Home Health Services,2020,NEO030,BREAST CANCER - ALL OTHER TYPES,SKB003,MASTECTOMY AND LUMPECTOMY,362,MASTECTOMY PROCEDURES,09,"DISEASES AND DISORDERS OF THE SKIN, SUBCUTANEOUS TISSUE AND BREAST",1,Minor,Minor,Surgical,Private Health Insurance,,,,,N,136918.74,25655.55
New York City,Bronx,7000006,003058,Montefiore Med Center - Jack D Weiler Hosp of A Einstein College Div,70 or Older,104,F,Other Race,Spanish/Hispanic,4,Emergency,Skilled Nursing Home,2020,NEO030,BREAST CANCER - ALL OTHER TYPES,SKB003,MASTECTOMY AND LUMPECTOMY,362,MASTECTOMY PROCEDURES,09,"DISEASES AND DISORDERS OF THE SKIN, SUBCUTANEOUS TISSUE AND BREAST",2,Moderate,Moderate,Surgical,Medicare,Medicaid,,,,N,89530.79,15644.19