Hospital Service Area,Hospital County,Operating Certificate Number,Permanent Facility Id,Facility Name,Age Group,Zip Code - 3 digits,Gender,Race,Ethnicity,Length of Stay,Type of Admission,Patient Disposition,Discharge Year,CCS Diagnosis Code,CCS Diagnosis Description,CCS Procedure Code,CCS Procedure Description,APR DRG Code,APR DRG Description,APR MDC Code,APR MDC Description,APR Severity of Illness Code,APR Severity of Illness Description,APR Risk of Mortality,APR Medical Surgical Description,Payment Typology 1,Payment Typology 2,Payment Typology 3,Birth Weight,Abortion Edit Indicator,Emergency Department Indicator,Total Charges,Total Costs
Long Island,Nassau,2908000,000511,NYU Winthrop Hospital,50 to 69,117,F,White,Not Span/Hispanic,3,Elective,Home or Self Care,2017,024,Cancer of breast,175,OT OR THER PRC SKN/BRST,363,Breast procedures except mastectomy,09,"Diseases and Disorders of the Skin, Subcutaneous Tissue and Breast",3,Major,Minor,Surgical,Blue Cross/Blue Shield,,,,N,N,76915.20,21955.08
Long Island,Nassau,2908000,000511,NYU Winthrop Hospital,50 to 69,117,F,White,Not Span/Hispanic,3,Elective,Home or Self Care,2017,257,Other aftercare,067,OT THER PRCS; HEM/LYMPH,363,Breast procedures except mastectomy,09,"Diseases and Disorders of the Skin, Subcutaneous Tissue and Breast",2,Moderate,Minor,Surgical,Blue Cross/Blue Shield,,,,N,N,78013.40,22655.84
Long Island,Nassau,2908000,000511,NYU Winthrop Hospital,30 to 49,115,F,White,Not Span/Hispanic,3,Elective,Home w/ Home Health Services,2017,257,Other aftercare,175,OT OR THER PRC SKN/BRST,363,Breast procedures except mastectomy,09,"Diseases and Disorders of the Skin, Subcutaneous Tissue and Breast",2,Moderate,Minor,Surgical,Blue Cross/Blue Shield,,,,N,N,87591.56,25298.60
Long Island,Nassau,2908000,000511,NYU Winthrop Hospital,30 to 49,113,F,White,Not Span/Hispanic,4,Elective,Home or Self Care,2017,257,Other aftercare,067,OT THER PRCS; HEM/LYMPH,363,Breast procedures except mastectomy,09,"Diseases and Disorders of the Skin, Subcutaneous Tissue and Breast",2,Moderate,Minor,Surgical,Blue Cross/Blue Shield,,,,N,N,58034.92,16985.63
Long Island,Nassau,2908000,000511,NYU Winthrop Hospital,70 or Older,115,F,White,Not Span/Hispanic,2,Elective,Home w/ Home Health Services,2017,024,Cancer of breast,166,"LUMPECTOMY, QUAD BREAST",363,Breast procedures except mastectomy,09,"Diseases and Disorders of the Skin, Subcutaneous Tissue and Breast",1,Minor,Minor,Surgical,Medicare,Medicare,,,N,N,82393.58,20488.04
Long Island,Nassau,2908000,000511,NYU Winthrop Hospital,30 to 49,117,F,Black/African American,Not Span/Hispanic,4,Elective,Home w/ Home Health Services,2017,259,Residual codes; unclassified,175,OT OR THER PRC SKN/BRST,363,Breast procedures except mastectomy,09,"Diseases and Disorders of the Skin, Subcutaneous Tissue and Breast",2,Moderate,Minor,Surgical,Private Health Insurance,,,,N,N,86590.12,23527.84
Long Island,Nassau,2908000,000511,NYU Winthrop Hospital,50 to 69,110,F,White,Not Span/Hispanic,4,Elective,Home w/ Home Health Services,2017,257,Other aftercare,175,OT OR THER PRC SKN/BRST,363,Breast procedures except mastectomy,09,"Diseases and Disorders of the Skin, Subcutaneous Tissue and Breast",2,Moderate,Minor,Surgical,Medicare,Medicare,,,N,N,62068.21,18627.62
Long Island,Nassau,2908000,000511,NYU Winthrop Hospital,30 to 49,117,F,White,Not Span/Hispanic,4,Elective,Home or Self Care,2017,237,Complication of device; implant or graft,175,OT OR THER PRC SKN/BRST,363,Breast procedures except mastectomy,09,"Diseases and Disorders of the Skin, Subcutaneous Tissue and Breast",2,Moderate,Minor,Surgical,Private Health Insurance,,,,N,N,95798.12,26374.56
Long Island,Nassau,2908000,000511,NYU Winthrop Hospital,50 to 69,110,F,White,Not Span/Hispanic,3,Elective,Home or Self Care,2017,167,Nonmalignant breast conditions,175,OT OR THER PRC SKN/BRST,363,Breast procedures except mastectomy,09,"Diseases and Disorders of the Skin, Subcutaneous Tissue and Breast",3,Major,Minor,Surgical,Blue Cross/Blue Shield,,,,N,N,90002.54,24733.03
Long Island,Nassau,2908000,000511,NYU Winthrop Hospital,30 to 49,117,F,Other Race,Not Span/Hispanic,7,Elective,Home w/ Home Health Services,2017,024,Cancer of breast,175,OT OR THER PRC SKN/BRST,363,Breast procedures except mastectomy,09,"Diseases and Disorders of the Skin, Subcutaneous Tissue and Breast",2,Moderate,Minor,Surgical,Blue Cross/Blue Shield,,,,N,N,114729.99,28310.88
Long Island,Nassau,2908000,000511,NYU Winthrop Hospital,50 to 69,115,F,Black/African American,Not Span/Hispanic,3,Elective,Home or Self Care,2017,257,Other aftercare,175,OT OR THER PRC SKN/BRST,363,Breast procedures except mastectomy,09,"Diseases and Disorders of the Skin, Subcutaneous Tissue and Breast",2,Moderate,Minor,Surgical,Private Health Insurance,,,,N,N,137841.57,44375.29
Long Island,Nassau,2908000,000511,NYU Winthrop Hospital,30 to 49,117,F,White,Not Span/Hispanic,4,Elective,Home w/ Home Health Services,2017,259,Residual codes; unclassified,175,OT OR THER PRC SKN/BRST,363,Breast procedures except mastectomy,09,"Diseases and Disorders of the Skin, Subcutaneous Tissue and Breast",2,Moderate,Minor,Surgical,Blue Cross/Blue Shield,,,,N,N,191121.85,58422.63
Long Island,Nassau,2908000,000511,NYU Winthrop Hospital,30 to 49,117,F,White,Not Span/Hispanic,4,Elective,Home or Self Care,2017,257,Other aftercare,175,OT OR THER PRC SKN/BRST,363,Breast procedures except mastectomy,09,"Diseases and Disorders of the Skin, Subcutaneous Tissue and Breast",2,Moderate,Minor,Surgical,Blue Cross/Blue Shield,,,,N,N,98537.62,27501.91
Long Island,Nassau,2908000,000511,NYU Winthrop Hospital,50 to 69,113,F,Black/African American,Not Span/Hispanic,2,Elective,Home or Self Care,2017,237,Complication of device; implant or graft,175,OT OR THER PRC SKN/BRST,363,Breast procedures except mastectomy,09,"Diseases and Disorders of the Skin, Subcutaneous Tissue and Breast",2,Moderate,Minor,Surgical,Private Health Insurance,,,,N,N,139734.82,43412.10
Long Island,Nassau,2908000,000511,NYU Winthrop Hospital,50 to 69,115,F,White,Not Span/Hispanic,3,Elective,Home w/ Home Health Services,2017,257,Other aftercare,175,OT OR THER PRC SKN/BRST,363,Breast procedures except mastectomy,09,"Diseases and Disorders of the Skin, Subcutaneous Tissue and Breast",2,Moderate,Minor,Surgical,Blue Cross/Blue Shield,,,,N,N,184192.49,58110.58
Long Island,Nassau,2908000,000511,NYU Winthrop Hospital,50 to 69,114,F,Black/African American,Not Span/Hispanic,3,Elective,Home or Self Care,2017,257,Other aftercare,175,OT OR THER PRC SKN/BRST,363,Breast procedures except mastectomy,09,"Diseases and Disorders of the Skin, Subcutaneous Tissue and Breast",2,Moderate,Minor,Surgical,Blue Cross/Blue Shield,,,,N,N,192008.08,61971.59
Long Island,Nassau,2908000,000511,NYU Winthrop Hospital,50 to 69,115,F,White,Spanish/Hispanic,5,Elective,Home w/ Home Health Services,2017,257,Other aftercare,175,OT OR THER PRC SKN/BRST,363,Breast procedures except mastectomy,09,"Diseases and Disorders of the Skin, Subcutaneous Tissue and Breast",2,Moderate,Minor,Surgical,Blue Cross/Blue Shield,,,,N,N,183951.44,56346.73
Long Island,Nassau,2908000,000511,NYU Winthrop Hospital,30 to 49,117,F,White,Not Span/Hispanic,5,Elective,Home w/ Home Health Services,2017,257,Other aftercare,175,OT OR THER PRC SKN/BRST,363,Breast procedures except mastectomy,09,"Diseases and Disorders of the Skin, Subcutaneous Tissue and Breast",3,Major,Minor,Surgical,Private Health Insurance,,,,N,N,192695.74,59218.02
Long Island,Nassau,2908000,000511,NYU Winthrop Hospital,50 to 69,117,F,White,Not Span/Hispanic,3,Elective,Home w/ Home Health Services,2017,257,Other aftercare,175,OT OR THER PRC SKN/BRST,363,Breast procedures except mastectomy,09,"Diseases and Disorders of the Skin, Subcutaneous Tissue and Breast",3,Major,Minor,Surgical,Private Health Insurance,,,,N,N,246596.04,77433.55
Long Island,Nassau,2908000,000511,NYU Winthrop Hospital,50 to 69,115,F,Black/African American,Not Span/Hispanic,3,Elective,Home w/ Home Health Services,2017,257,Other aftercare,175,OT OR THER PRC SKN/BRST,363,Breast procedures except mastectomy,09,"Diseases and Disorders of the Skin, Subcutaneous Tissue and Breast",2,Moderate,Minor,Surgical,Medicaid,,,,N,N,128195.76,39032.95
Long Island,Nassau,2908000,000511,NYU Winthrop Hospital,70 or Older,115,M,White,Not Span/Hispanic,1,Elective,Home w/ Home Health Services,2017,167,Nonmalignant breast conditions,166,"LUMPECTOMY, QUAD BREAST",363,Breast procedures except mastectomy,09,"Diseases and Disorders of the Skin, Subcutaneous Tissue and Breast",1,Minor,Minor,Surgical,Blue Cross/Blue Shield,,,,N,N,38988.08,11239.29
Long Island,Nassau,2908000,000511,NYU Winthrop Hospital,50 to 69,110,F,White,Not Span/Hispanic,3,Elective,Home w/ Home Health Services,2017,257,Other aftercare,067,OT THER PRCS; HEM/LYMPH,363,Breast procedures except mastectomy,09,"Diseases and Disorders of the Skin, Subcutaneous Tissue and Breast",2,Moderate,Minor,Surgical,Private Health Insurance,,,,N,N,130819.90,38001.00
Long Island,Nassau,2908000,000511,NYU Winthrop Hospital,50 to 69,117,F,White,Not Span/Hispanic,5,Elective,Home w/ Home Health Services,2017,024,Cancer of breast,166,"LUMPECTOMY, QUAD BREAST",363,Breast procedures except mastectomy,09,"Diseases and Disorders of the Skin, Subcutaneous Tissue and Breast",2,Moderate,Minor,Surgical,Private Health Insurance,,,,N,N,167918.86,52126.05
Long Island,Nassau,2908000,000511,NYU Winthrop Hospital,30 to 49,115,F,White,Not Span/Hispanic,6,Emergency,Home or Self Care,2017,167,Nonmalignant breast conditions,175,OT OR THER PRC SKN/BRST,363,Breast procedures except mastectomy,09,"Diseases and Disorders of the Skin, Subcutaneous Tissue and Breast",2,Moderate,Minor,Surgical,Private Health Insurance,,,,N,Y,57286.65,16356.49
Long Island,Nassau,2908000,000511,NYU Winthrop Hospital,50 to 69,117,F,White,Not Span/Hispanic,4,Elective,Home or Self Care,2017,257,Other aftercare,175,OT OR THER PRC SKN/BRST,363,Breast procedures except mastectomy,09,"Diseases and Disorders of the Skin, Subcutaneous Tissue and Breast",2,Moderate,Minor,Surgical,Blue Cross/Blue Shield,,,,N,N,162211.21,48807.27
Long Island,Nassau,2908000,000511,NYU Winthrop Hospital,50 to 69,117,F,White,Not Span/Hispanic,4,Elective,Home w/ Home Health Services,2017,257,Other aftercare,175,OT OR THER PRC SKN/BRST,363,Breast procedures except mastectomy,09,"Diseases and Disorders of the Skin, Subcutaneous Tissue and Breast",2,Moderate,Minor,Surgical,Private Health Insurance,,,,N,N,171786.01,53589.74
Long Island,Nassau,2908000,000511,NYU Winthrop Hospital,30 to 49,100,F,White,Spanish/Hispanic,6,Elective,Home w/ Home Health Services,2017,257,Other aftercare,175,OT OR THER PRC SKN/BRST,363,Breast procedures except mastectomy,09,"Diseases and Disorders of the Skin, Subcutaneous Tissue and Breast",2,Moderate,Minor,Surgical,Medicaid,Medicaid,,,N,N,203358.16,60098.96
Long Island,Nassau,2908000,000511,NYU Winthrop Hospital,50 to 69,118,F,White,Spanish/Hispanic,5,Elective,Home w/ Home Health Services,2017,024,Cancer of breast,175,OT OR THER PRC SKN/BRST,363,Breast procedures except mastectomy,09,"Diseases and Disorders of the Skin, Subcutaneous Tissue and Breast",3,Major,Minor,Surgical,Federal/State/Local/VA,Self-Pay,,,N,N,412382.12,119819.93
Long Island,Nassau,2908000,000511,NYU Winthrop Hospital,30 to 49,117,F,White,Not Span/Hispanic,3,Elective,Home or Self Care,2017,257,Other aftercare,175,OT OR THER PRC SKN/BRST,363,Breast procedures except mastectomy,09,"Diseases and Disorders of the Skin, Subcutaneous Tissue and Breast",2,Moderate,Minor,Surgical,Private Health Insurance,,,,N,N,158980.19,49679.44
Long Island,Nassau,2908000,000511,NYU Winthrop Hospital,50 to 69,117,F,White,Not Span/Hispanic,4,Elective,Home or Self Care,2017,257,Other aftercare,175,OT OR THER PRC SKN/BRST,363,Breast procedures except mastectomy,09,"Diseases and Disorders of the Skin, Subcutaneous Tissue and Breast",2,Moderate,Minor,Surgical,Private Health Insurance,,,,N,N,161441.78,49993.68
Long Island,Nassau,2908000,000511,NYU Winthrop Hospital,50 to 69,112,F,White,Not Span/Hispanic,4,Elective,Home or Self Care,2017,257,Other aftercare,067,OT THER PRCS; HEM/LYMPH,363,Breast procedures except mastectomy,09,"Diseases and Disorders of the Skin, Subcutaneous Tissue and Breast",2,Moderate,Minor,Surgical,Blue Cross/Blue Shield,,,,N,N,151237.88,48045.46
