Hospital Service Area,Hospital County,Operating Certificate Number,Permanent Facility Id,Facility Name,Age Group,Zip Code - 3 digits,Gender,Race,Ethnicity,Length of Stay,Type of Admission,Patient Disposition,Discharge Year,CCS Diagnosis Code,CCS Diagnosis Description,CCS Procedure Code,CCS Procedure Description,APR DRG Code,APR DRG Description,APR MDC Code,APR MDC Description,APR Severity of Illness Code,APR Severity of Illness Description,APR Risk of Mortality,APR Medical Surgical Description,Payment Typology 1,Payment Typology 2,Payment Typology 3,Birth Weight,Abortion Edit Indicator,Emergency Department Indicator,Total Charges,Total Costs
New York City,Manhattan,7002053,001463,NYU Langone Hospitals,50 to 69,113,F,White,Not Span/Hispanic,5,Elective,Home w/ Home Health Services,2019,NEO030,BREAST CANCER - ALL OTHER TYPES,SKB003,MASTECTOMY AND LUMPECTOMY,363,BREAST PROCEDURES EXCEPT MASTECTOMY,09,"DISEASES AND DISORDERS OF THE SKIN, SUBCUTANEOUS TISSUE AND BREAST",3,Major,Minor,Surgical,Private Health Insurance,,,,,false,236523.39,59381.46
New York City,Manhattan,7002053,001463,NYU Langone Hospitals,50 to 69,100,F,Other Race,Not Span/Hispanic,4,Elective,Home w/ Home Health Services,2019,FAC004,ENCOUNTER FOR PROPHYLACTIC OR OTHER PROCEDURES,SKB004,BREAST RECONSTRUCTION,363,BREAST PROCEDURES EXCEPT MASTECTOMY,09,"DISEASES AND DISORDERS OF THE SKIN, SUBCUTANEOUS TISSUE AND BREAST",2,Moderate,Minor,Surgical,Medicaid,,,,,false,135406.17,28129.92
New York City,Manhattan,7002053,001463,NYU Langone Hospitals,50 to 69,OOS,F,White,Not Span/Hispanic,1,Elective,Home or Self Care,2019,GEN017,NONMALIGNANT BREAST CONDITIONS,SKB004,BREAST RECONSTRUCTION,363,BREAST PROCEDURES EXCEPT MASTECTOMY,09,"DISEASES AND DISORDERS OF THE SKIN, SUBCUTANEOUS TISSUE AND BREAST",1,Minor,Moderate,Surgical,Private Health Insurance,,,,,false,100440.68,16824.07
New York City,Manhattan,7002053,001463,NYU Langone Hospitals,50 to 69,117,F,White,Not Span/Hispanic,4,Elective,Home w/ Home Health Services,2019,GEN017,NONMALIGNANT BREAST CONDITIONS,SKB004,BREAST RECONSTRUCTION,363,BREAST PROCEDURES EXCEPT MASTECTOMY,09,"DISEASES AND DISORDERS OF THE SKIN, SUBCUTANEOUS TISSUE AND BREAST",2,Moderate,Minor,Surgical,Private Health Insurance,,,,,false,252955.5,55032.08
New York City,Manhattan,7002053,001463,NYU Langone Hospitals,30 to 49,114,F,White,Not Span/Hispanic,3,Elective,Home or Self Care,2019,NEO029,BREAST CANCER - DUCTAL CARCINOMA IN SITU (DCIS),SKB003,MASTECTOMY AND LUMPECTOMY,363,BREAST PROCEDURES EXCEPT MASTECTOMY,09,"DISEASES AND DISORDERS OF THE SKIN, SUBCUTANEOUS TISSUE AND BREAST",2,Moderate,Minor,Surgical,Medicaid,,,,,false,173854.73,31177.5
New York City,Manhattan,7002053,001463,NYU Langone Hospitals,50 to 69,OOS,F,White,Not Span/Hispanic,4,Elective,Home or Self Care,2019,GEN017,NONMALIGNANT BREAST CONDITIONS,SKB004,BREAST RECONSTRUCTION,363,BREAST PROCEDURES EXCEPT MASTECTOMY,09,"DISEASES AND DISORDERS OF THE SKIN, SUBCUTANEOUS TISSUE AND BREAST",2,Moderate,Minor,Surgical,Private Health Insurance,,,,,false,161706.79,31808.62
New York City,Manhattan,7002053,001463,NYU Langone Hospitals,50 to 69,115,F,White,Not Span/Hispanic,4,Elective,Home w/ Home Health Services,2019,NEO030,BREAST CANCER - ALL OTHER TYPES,SKB003,MASTECTOMY AND LUMPECTOMY,363,BREAST PROCEDURES EXCEPT MASTECTOMY,09,"DISEASES AND DISORDERS OF THE SKIN, SUBCUTANEOUS TISSUE AND BREAST",2,Moderate,Minor,Surgical,Blue Cross/Blue Shield,,,,,false,222452.1,39935.93
New York City,Manhattan,7002053,001463,NYU Langone Hospitals,30 to 49,112,F,White,Not Span/Hispanic,1,Elective,Home or Self Care,2019,NEO030,BREAST CANCER - ALL OTHER TYPES,SKB003,MASTECTOMY AND LUMPECTOMY,363,BREAST PROCEDURES EXCEPT MASTECTOMY,09,"DISEASES AND DISORDERS OF THE SKIN, SUBCUTANEOUS TISSUE AND BREAST",1,Minor,Minor,Surgical,Private Health Insurance,,,,,false,134002.55,21765.71
New York City,Manhattan,7002053,001463,NYU Langone Hospitals,50 to 69,113,F,White,Not Span/Hispanic,1,Elective,Home or Self Care,2019,FAC004,ENCOUNTER FOR PROPHYLACTIC OR OTHER PROCEDURES,SKB004,BREAST RECONSTRUCTION,363,BREAST PROCEDURES EXCEPT MASTECTOMY,09,"DISEASES AND DISORDERS OF THE SKIN, SUBCUTANEOUS TISSUE AND BREAST",3,Major,Minor,Surgical,Medicaid,,,,,false,75942.33,13348.77
New York City,Manhattan,7002053,001463,NYU Langone Hospitals,30 to 49,104,F,White,Not Span/Hispanic,3,Elective,Home or Self Care,2019,GEN017,NONMALIGNANT BREAST CONDITIONS,SKB004,BREAST RECONSTRUCTION,363,BREAST PROCEDURES EXCEPT MASTECTOMY,09,"DISEASES AND DISORDERS OF THE SKIN, SUBCUTANEOUS TISSUE AND BREAST",2,Moderate,Minor,Surgical,Private Health Insurance,,,,,false,185292.62,33557.1
New York City,Manhattan,7002053,001463,NYU Langone Hospitals,50 to 69,112,F,Other Race,Not Span/Hispanic,1,Elective,Home or Self Care,2019,GEN017,NONMALIGNANT BREAST CONDITIONS,GNR001,COSMETIC PROCEDURES,363,BREAST PROCEDURES EXCEPT MASTECTOMY,09,"DISEASES AND DISORDERS OF THE SKIN, SUBCUTANEOUS TISSUE AND BREAST",2,Moderate,Minor,Surgical,Self-Pay,,,,,false,67927.9,12022.32
New York City,Manhattan,7002053,001463,NYU Langone Hospitals,30 to 49,105,F,Other Race,Spanish/Hispanic,3,Elective,Home w/ Home Health Services,2019,FAC004,ENCOUNTER FOR PROPHYLACTIC OR OTHER PROCEDURES,SKB004,BREAST RECONSTRUCTION,363,BREAST PROCEDURES EXCEPT MASTECTOMY,09,"DISEASES AND DISORDERS OF THE SKIN, SUBCUTANEOUS TISSUE AND BREAST",2,Moderate,Minor,Surgical,Medicaid,,,,,false,193808.21,34727.47
New York City,Manhattan,7002053,001463,NYU Langone Hospitals,50 to 69,OOS,F,Other Race,Not Span/Hispanic,4,Elective,Home or Self Care,2019,NEO030,BREAST CANCER - ALL OTHER TYPES,SKB003,MASTECTOMY AND LUMPECTOMY,363,BREAST PROCEDURES EXCEPT MASTECTOMY,09,"DISEASES AND DISORDERS OF THE SKIN, SUBCUTANEOUS TISSUE AND BREAST",2,Moderate,Minor,Surgical,Private Health Insurance,,,,,false,184752.82,35514.95
New York City,Manhattan,7002053,001463,NYU Langone Hospitals,30 to 49,100,F,White,Not Span/Hispanic,3,Elective,Home w/ Home Health Services,2019,FAC004,ENCOUNTER FOR PROPHYLACTIC OR OTHER PROCEDURES,SKB004,BREAST RECONSTRUCTION,363,BREAST PROCEDURES EXCEPT MASTECTOMY,09,"DISEASES AND DISORDERS OF THE SKIN, SUBCUTANEOUS TISSUE AND BREAST",2,Moderate,Minor,Surgical,Private Health Insurance,,,,,false,156843.59,28861.66
New York City,Manhattan,7002053,001463,NYU Langone Hospitals,30 to 49,OOS,M,White,Not Span/Hispanic,5,Elective,Home or Self Care,2019,CIR039,OTHER SPECIFIED DISEASES OF VEINS AND LYMPHATICS,LYM002,LYMPH NODE EXCISION (THERAPEUTIC),363,BREAST PROCEDURES EXCEPT MASTECTOMY,09,"DISEASES AND DISORDERS OF THE SKIN, SUBCUTANEOUS TISSUE AND BREAST",3,Major,Minor,Surgical,Blue Cross/Blue Shield,,,,,false,361784.53,63811.11
New York City,Manhattan,7002053,001463,NYU Langone Hospitals,50 to 69,100,F,White,Not Span/Hispanic,4,Elective,Home w/ Home Health Services,2019,FAC004,ENCOUNTER FOR PROPHYLACTIC OR OTHER PROCEDURES,SKB004,BREAST RECONSTRUCTION,363,BREAST PROCEDURES EXCEPT MASTECTOMY,09,"DISEASES AND DISORDERS OF THE SKIN, SUBCUTANEOUS TISSUE AND BREAST",3,Major,Minor,Surgical,Private Health Insurance,,,,,false,159822.8,30887.73
New York City,Manhattan,7002053,001463,NYU Langone Hospitals,50 to 69,112,F,Other Race,Spanish/Hispanic,2,Elective,Home or Self Care,2019,FAC004,ENCOUNTER FOR PROPHYLACTIC OR OTHER PROCEDURES,SKB004,BREAST RECONSTRUCTION,363,BREAST PROCEDURES EXCEPT MASTECTOMY,09,"DISEASES AND DISORDERS OF THE SKIN, SUBCUTANEOUS TISSUE AND BREAST",3,Major,Minor,Surgical,Medicare,Medicaid,,,,false,86349.96,17357.48
New York City,Manhattan,7002053,001463,NYU Langone Hospitals,30 to 49,112,F,Black/African American,Not Span/Hispanic,3,Elective,Home or Self Care,2019,FAC004,ENCOUNTER FOR PROPHYLACTIC OR OTHER PROCEDURES,SKB004,BREAST RECONSTRUCTION,363,BREAST PROCEDURES EXCEPT MASTECTOMY,09,"DISEASES AND DISORDERS OF THE SKIN, SUBCUTANEOUS TISSUE AND BREAST",2,Moderate,Minor,Surgical,Blue Cross/Blue Shield,,,,,false,283286.32,47653.94
New York City,Manhattan,7002053,001463,NYU Langone Hospitals,30 to 49,112,F,White,Not Span/Hispanic,1,Elective,Home or Self Care,2019,NEO030,BREAST CANCER - ALL OTHER TYPES,SKB003,MASTECTOMY AND LUMPECTOMY,363,BREAST PROCEDURES EXCEPT MASTECTOMY,09,"DISEASES AND DISORDERS OF THE SKIN, SUBCUTANEOUS TISSUE AND BREAST",1,Minor,Minor,Surgical,Private Health Insurance,,,,,false,145242.19,23622.8
New York City,Manhattan,7002053,001463,NYU Langone Hospitals,50 to 69,103,F,White,Not Span/Hispanic,1,Elective,Home or Self Care,2019,GEN017,NONMALIGNANT BREAST CONDITIONS,SKB004,BREAST RECONSTRUCTION,363,BREAST PROCEDURES EXCEPT MASTECTOMY,09,"DISEASES AND DISORDERS OF THE SKIN, SUBCUTANEOUS TISSUE AND BREAST",1,Minor,Minor,Surgical,Private Health Insurance,,,,,false,125650.88,19950.74
New York City,Manhattan,7002053,001463,NYU Langone Hospitals,50 to 69,OOS,F,White,Not Span/Hispanic,3,Elective,Home or Self Care,2019,FAC004,ENCOUNTER FOR PROPHYLACTIC OR OTHER PROCEDURES,SKB004,BREAST RECONSTRUCTION,363,BREAST PROCEDURES EXCEPT MASTECTOMY,09,"DISEASES AND DISORDERS OF THE SKIN, SUBCUTANEOUS TISSUE AND BREAST",2,Moderate,Minor,Surgical,Private Health Insurance,,,,,false,134728.73,26096
New York City,Manhattan,7002053,001463,NYU Langone Hospitals,50 to 69,100,F,White,Not Span/Hispanic,4,Elective,Home or Self Care,2019,FAC004,ENCOUNTER FOR PROPHYLACTIC OR OTHER PROCEDURES,SKB004,BREAST RECONSTRUCTION,363,BREAST PROCEDURES EXCEPT MASTECTOMY,09,"DISEASES AND DISORDERS OF THE SKIN, SUBCUTANEOUS TISSUE AND BREAST",2,Moderate,Minor,Surgical,Private Health Insurance,,,,,false,196290.55,36744.42
New York City,Manhattan,7002053,001463,NYU Langone Hospitals,50 to 69,112,F,White,Not Span/Hispanic,3,Elective,Home w/ Home Health Services,2019,INJ037,"COMPLICATION OF OTHER SURGICAL OR MEDICAL CARE, INJURY, INITIAL ENCOUNTER",SKB004,BREAST RECONSTRUCTION,363,BREAST PROCEDURES EXCEPT MASTECTOMY,09,"DISEASES AND DISORDERS OF THE SKIN, SUBCUTANEOUS TISSUE AND BREAST",2,Moderate,Minor,Surgical,Medicaid,,,,,false,173694.9,30403.66
New York City,Manhattan,7002053,001463,NYU Langone Hospitals,30 to 49,100,F,White,Not Span/Hispanic,4,Elective,Home or Self Care,2019,FAC004,ENCOUNTER FOR PROPHYLACTIC OR OTHER PROCEDURES,MST030,"MUSCULOSKELETAL PROCEDURES, NEC",363,BREAST PROCEDURES EXCEPT MASTECTOMY,09,"DISEASES AND DISORDERS OF THE SKIN, SUBCUTANEOUS TISSUE AND BREAST",2,Moderate,Minor,Surgical,Private Health Insurance,,,,,false,218318.18,39915.25
New York City,Manhattan,7002053,001463,NYU Langone Hospitals,50 to 69,112,F,Black/African American,Not Span/Hispanic,4,Elective,Home w/ Home Health Services,2019,NEO030,BREAST CANCER - ALL OTHER TYPES,LYM001,LYMPH NODE BIOPSY,363,BREAST PROCEDURES EXCEPT MASTECTOMY,09,"DISEASES AND DISORDERS OF THE SKIN, SUBCUTANEOUS TISSUE AND BREAST",3,Major,Minor,Surgical,Private Health Insurance,,,,,false,224082.02,41425.42
New York City,Manhattan,7002053,001463,NYU Langone Hospitals,70 or Older,100,F,White,Not Span/Hispanic,6,Elective,Home or Self Care,2019,NEO030,BREAST CANCER - ALL OTHER TYPES,SKB003,MASTECTOMY AND LUMPECTOMY,363,BREAST PROCEDURES EXCEPT MASTECTOMY,09,"DISEASES AND DISORDERS OF THE SKIN, SUBCUTANEOUS TISSUE AND BREAST",3,Major,Moderate,Surgical,Medicare,Medicare,,,,false,229367.77,45097.7
New York City,Manhattan,7002053,001463,NYU Langone Hospitals,30 to 49,OOS,F,White,Not Span/Hispanic,1,Elective,Home w/ Home Health Services,2019,FAC004,ENCOUNTER FOR PROPHYLACTIC OR OTHER PROCEDURES,SKB003,MASTECTOMY AND LUMPECTOMY,363,BREAST PROCEDURES EXCEPT MASTECTOMY,09,"DISEASES AND DISORDERS OF THE SKIN, SUBCUTANEOUS TISSUE AND BREAST",1,Minor,Minor,Surgical,Blue Cross/Blue Shield,,,,,false,140584.67,22529.53
New York City,Manhattan,7002053,001463,NYU Langone Hospitals,70 or Older,101,F,White,Not Span/Hispanic,1,Elective,Home or Self Care,2019,INJ037,"COMPLICATION OF OTHER SURGICAL OR MEDICAL CARE, INJURY, INITIAL ENCOUNTER",SKB004,BREAST RECONSTRUCTION,363,BREAST PROCEDURES EXCEPT MASTECTOMY,09,"DISEASES AND DISORDERS OF THE SKIN, SUBCUTANEOUS TISSUE AND BREAST",1,Minor,Minor,Surgical,Medicare,Private Health Insurance,,,,false,84994.8,14519.64
New York City,Manhattan,7002053,001463,NYU Langone Hospitals,30 to 49,105,F,Black/African American,Not Span/Hispanic,1,Elective,Home or Self Care,2019,GEN017,NONMALIGNANT BREAST CONDITIONS,MST020,SUBCUTANEOUS TISSUE AND FASCIA EXCISION,363,BREAST PROCEDURES EXCEPT MASTECTOMY,09,"DISEASES AND DISORDERS OF THE SKIN, SUBCUTANEOUS TISSUE AND BREAST",1,Minor,Minor,Surgical,Blue Cross/Blue Shield,,,,,false,136584.71,21048.76
New York City,Manhattan,7002053,001463,NYU Langone Hospitals,50 to 69,112,F,Black/African American,Not Span/Hispanic,3,Elective,Home w/ Home Health Services,2019,GEN017,NONMALIGNANT BREAST CONDITIONS,SKB004,BREAST RECONSTRUCTION,363,BREAST PROCEDURES EXCEPT MASTECTOMY,09,"DISEASES AND DISORDERS OF THE SKIN, SUBCUTANEOUS TISSUE AND BREAST",2,Moderate,Minor,Surgical,Blue Cross/Blue Shield,,,,,false,161930.51,30266.97
New York City,Manhattan,7002053,001463,NYU Langone Hospitals,30 to 49,115,F,White,Not Span/Hispanic,1,Elective,Home or Self Care,2019,GEN017,NONMALIGNANT BREAST CONDITIONS,SKB004,BREAST RECONSTRUCTION,363,BREAST PROCEDURES EXCEPT MASTECTOMY,09,"DISEASES AND DISORDERS OF THE SKIN, SUBCUTANEOUS TISSUE AND BREAST",1,Minor,Minor,Surgical,Private Health Insurance,,,,,false,109659.72,17636.83
New York City,Manhattan,7002053,001463,NYU Langone Hospitals,30 to 49,111,F,Multi-racial,Spanish/Hispanic,2,Elective,Home or Self Care,2019,NEO030,BREAST CANCER - ALL OTHER TYPES,SKB003,MASTECTOMY AND LUMPECTOMY,363,BREAST PROCEDURES EXCEPT MASTECTOMY,09,"DISEASES AND DISORDERS OF THE SKIN, SUBCUTANEOUS TISSUE AND BREAST",2,Moderate,Minor,Surgical,Private Health Insurance,,,,,false,215323.17,29742.12
New York City,Manhattan,7002053,001463,NYU Langone Hospitals,50 to 69,112,F,White,Not Span/Hispanic,1,Elective,Home or Self Care,2019,GEN017,NONMALIGNANT BREAST CONDITIONS,SKB004,BREAST RECONSTRUCTION,363,BREAST PROCEDURES EXCEPT MASTECTOMY,09,"DISEASES AND DISORDERS OF THE SKIN, SUBCUTANEOUS TISSUE AND BREAST",1,Minor,Minor,Surgical,Private Health Insurance,,,,,false,199849.57,31260.06
New York City,Manhattan,7002053,001463,NYU Langone Hospitals,30 to 49,113,F,White,Not Span/Hispanic,9,Emergency,Skilled Nursing Home,2019,SKN002,OTHER SPECIFIED INFLAMMATORY CONDITION OF SKIN,MST020,SUBCUTANEOUS TISSUE AND FASCIA EXCISION,363,BREAST PROCEDURES EXCEPT MASTECTOMY,09,"DISEASES AND DISORDERS OF THE SKIN, SUBCUTANEOUS TISSUE AND BREAST",4,Extreme,Minor,Surgical,Medicare,Medicaid,,,,true,182471.8,43420.28
New York City,Manhattan,7002053,001463,NYU Langone Hospitals,50 to 69,104,F,Black/African American,Not Span/Hispanic,4,Elective,Home w/ Home Health Services,2019,FAC004,ENCOUNTER FOR PROPHYLACTIC OR OTHER PROCEDURES,SKB004,BREAST RECONSTRUCTION,363,BREAST PROCEDURES EXCEPT MASTECTOMY,09,"DISEASES AND DISORDERS OF THE SKIN, SUBCUTANEOUS TISSUE AND BREAST",2,Moderate,Minor,Surgical,Medicare,Medicaid,,,,false,135328.27,27858.4
