Hospital Service Area,Hospital County,Operating Certificate Number,Permanent Facility Id,Facility Name,Age Group,Zip Code - 3 digits,Gender,Race,Ethnicity,Length of Stay,Type of Admission,Patient Disposition,Discharge Year,CCS Diagnosis Code,CCS Diagnosis Description,CCS Procedure Code,CCS Procedure Description,APR DRG Code,APR DRG Description,APR MDC Code,APR MDC Description,APR Severity of Illness Code,APR Severity of Illness Description,APR Risk of Mortality,APR Medical Surgical Description,Payment Typology 1,Payment Typology 2,Payment Typology 3,Birth Weight,Abortion Edit Indicator,Emergency Department Indicator,Total Charges,Total Costs
Long Island,Suffolk,5123000,000885,Long Island Community Hospital,50 to 69,117,F,Other Race,Not Span/Hispanic,4,Elective,Home w/ Home Health Services,2019,NEO030,BREAST CANCER - ALL OTHER TYPES,LYM001,LYMPH NODE BIOPSY,363,BREAST PROCEDURES EXCEPT MASTECTOMY,09,"DISEASES AND DISORDERS OF THE SKIN, SUBCUTANEOUS TISSUE AND BREAST",3,Major,Minor,Surgical,Medicare,Medicare,Medicaid,,,false,75793.87,17263.04
Long Island,Suffolk,5123000,000885,Long Island Community Hospital,50 to 69,117,F,White,Not Span/Hispanic,1,Elective,Home or Self Care,2019,GEN017,NONMALIGNANT BREAST CONDITIONS,SKB003,MASTECTOMY AND LUMPECTOMY,363,BREAST PROCEDURES EXCEPT MASTECTOMY,09,"DISEASES AND DISORDERS OF THE SKIN, SUBCUTANEOUS TISSUE AND BREAST",2,Moderate,Minor,Surgical,Blue Cross/Blue Shield,Private Health Insurance,,,,false,20729.73,6769.81
Long Island,Suffolk,5123000,000885,Long Island Community Hospital,30 to 49,117,F,Other Race,Not Span/Hispanic,4,Elective,Home w/ Home Health Services,2019,NEO029,BREAST CANCER - DUCTAL CARCINOMA IN SITU (DCIS),SKB004,BREAST RECONSTRUCTION,363,BREAST PROCEDURES EXCEPT MASTECTOMY,09,"DISEASES AND DISORDERS OF THE SKIN, SUBCUTANEOUS TISSUE AND BREAST",3,Major,Minor,Surgical,Medicaid,,,,,false,91201.37,19894.57
Long Island,Suffolk,5123000,000885,Long Island Community Hospital,30 to 49,117,F,Black/African American,Not Span/Hispanic,4,Urgent,Home or Self Care,2019,NEO030,BREAST CANCER - ALL OTHER TYPES,ADM001,TRANSFUSION OF BLOOD AND BLOOD PRODUCTS,363,BREAST PROCEDURES EXCEPT MASTECTOMY,09,"DISEASES AND DISORDERS OF THE SKIN, SUBCUTANEOUS TISSUE AND BREAST",2,Moderate,Minor,Surgical,Private Health Insurance,Medicaid,,,,false,100754.76,18408.1
Long Island,Suffolk,5123000,000885,Long Island Community Hospital,30 to 49,119,F,Black/African American,Not Span/Hispanic,5,Urgent,Home w/ Home Health Services,2019,NEO030,BREAST CANCER - ALL OTHER TYPES,SKB004,BREAST RECONSTRUCTION,363,BREAST PROCEDURES EXCEPT MASTECTOMY,09,"DISEASES AND DISORDERS OF THE SKIN, SUBCUTANEOUS TISSUE AND BREAST",2,Moderate,Moderate,Surgical,Medicare,Medicare,Medicaid,,,false,93631.46,18822.39
Long Island,Suffolk,5123000,000885,Long Island Community Hospital,50 to 69,117,F,Black/African American,Not Span/Hispanic,5,Elective,Home w/ Home Health Services,2019,INJ037,"COMPLICATION OF OTHER SURGICAL OR MEDICAL CARE, INJURY, INITIAL ENCOUNTER",GNR005,CONTROL OF BLEEDING (NON-ENDOSCOPIC),363,BREAST PROCEDURES EXCEPT MASTECTOMY,09,"DISEASES AND DISORDERS OF THE SKIN, SUBCUTANEOUS TISSUE AND BREAST",3,Major,Minor,Surgical,Medicare,Medicare,,,,false,109511.37,25263.57
Long Island,Suffolk,5123000,000885,Long Island Community Hospital,30 to 49,117,F,White,Not Span/Hispanic,4,Elective,Home w/ Home Health Services,2019,NEO030,BREAST CANCER - ALL OTHER TYPES,LYM001,LYMPH NODE BIOPSY,363,BREAST PROCEDURES EXCEPT MASTECTOMY,09,"DISEASES AND DISORDERS OF THE SKIN, SUBCUTANEOUS TISSUE AND BREAST",1,Minor,Minor,Surgical,Private Health Insurance,,,,,false,89979.01,19807.17
Long Island,Suffolk,5123000,000885,Long Island Community Hospital,30 to 49,119,F,Black/African American,Not Span/Hispanic,4,Elective,Home or Self Care,2019,FAC004,ENCOUNTER FOR PROPHYLACTIC OR OTHER PROCEDURES,LYM001,LYMPH NODE BIOPSY,363,BREAST PROCEDURES EXCEPT MASTECTOMY,09,"DISEASES AND DISORDERS OF THE SKIN, SUBCUTANEOUS TISSUE AND BREAST",3,Major,Minor,Surgical,Medicare,Medicaid,,,,false,72609.32,18098.9
Long Island,Suffolk,5123000,000885,Long Island Community Hospital,30 to 49,117,F,White,Not Span/Hispanic,1,Emergency,Home or Self Care,2019,INJ037,"COMPLICATION OF OTHER SURGICAL OR MEDICAL CARE, INJURY, INITIAL ENCOUNTER",MST022,"TENDON, MUSCLE, BURSA, AND LIGAMENT REPAIR (EXCLUDING PERINEAL)",363,BREAST PROCEDURES EXCEPT MASTECTOMY,09,"DISEASES AND DISORDERS OF THE SKIN, SUBCUTANEOUS TISSUE AND BREAST",1,Minor,Minor,Surgical,Private Health Insurance,,,,,true,39375.39,8141.91
Long Island,Suffolk,5123000,000885,Long Island Community Hospital,50 to 69,117,F,White,Not Span/Hispanic,2,Elective,Home or Self Care,2019,GEN017,NONMALIGNANT BREAST CONDITIONS,SKB003,MASTECTOMY AND LUMPECTOMY,363,BREAST PROCEDURES EXCEPT MASTECTOMY,09,"DISEASES AND DISORDERS OF THE SKIN, SUBCUTANEOUS TISSUE AND BREAST",2,Moderate,Moderate,Surgical,Medicare,Medicare,Private Health Insurance,,,false,44624.29,10169.84
Long Island,Suffolk,5123000,000885,Long Island Community Hospital,30 to 49,117,F,White,Not Span/Hispanic,6,Elective,Home w/ Home Health Services,2019,GEN017,NONMALIGNANT BREAST CONDITIONS,SKB004,BREAST RECONSTRUCTION,363,BREAST PROCEDURES EXCEPT MASTECTOMY,09,"DISEASES AND DISORDERS OF THE SKIN, SUBCUTANEOUS TISSUE AND BREAST",3,Major,Minor,Surgical,Blue Cross/Blue Shield,,,,,false,82640.62,20795.82
Long Island,Suffolk,5123000,000885,Long Island Community Hospital,50 to 69,117,F,Black/African American,Not Span/Hispanic,1,Elective,Home or Self Care,2019,GEN017,NONMALIGNANT BREAST CONDITIONS,MST020,SUBCUTANEOUS TISSUE AND FASCIA EXCISION,363,BREAST PROCEDURES EXCEPT MASTECTOMY,09,"DISEASES AND DISORDERS OF THE SKIN, SUBCUTANEOUS TISSUE AND BREAST",1,Minor,Minor,Surgical,Medicare,Medicare,,,,false,28139.17,7525.83
Long Island,Suffolk,5123000,000885,Long Island Community Hospital,30 to 49,119,F,White,Not Span/Hispanic,4,Elective,Home w/ Home Health Services,2019,GEN017,NONMALIGNANT BREAST CONDITIONS,LYM001,LYMPH NODE BIOPSY,363,BREAST PROCEDURES EXCEPT MASTECTOMY,09,"DISEASES AND DISORDERS OF THE SKIN, SUBCUTANEOUS TISSUE AND BREAST",2,Moderate,Minor,Surgical,Private Health Insurance,,,,,false,57561.79,14003.75
Long Island,Suffolk,5123000,000885,Long Island Community Hospital,30 to 49,119,F,White,Not Span/Hispanic,3,Elective,Home or Self Care,2019,GEN017,NONMALIGNANT BREAST CONDITIONS,LYM001,LYMPH NODE BIOPSY,363,BREAST PROCEDURES EXCEPT MASTECTOMY,09,"DISEASES AND DISORDERS OF THE SKIN, SUBCUTANEOUS TISSUE AND BREAST",2,Moderate,Minor,Surgical,Private Health Insurance,,,,,false,72179.66,16415.45
