Hospital Service Area,Hospital County,Operating Certificate Number,Permanent Facility Id,Facility Name,Age Group,Zip Code - 3 digits,Gender,Race,Ethnicity,Length of Stay,Type of Admission,Patient Disposition,Discharge Year,CCS Diagnosis Code,CCS Diagnosis Description,CCS Procedure Code,CCS Procedure Description,APR DRG Code,APR DRG Description,APR MDC Code,APR MDC Description,APR Severity of Illness Code,APR Severity of Illness Description,APR Risk of Mortality,APR Medical Surgical Description,Payment Typology 1,Payment Typology 2,Payment Typology 3,Birth Weight,Abortion Edit Indicator,Emergency Department Indicator,Total Charges,Total Costs
New York City,Manhattan,7002053,001463,NYU Langone Hospitals,50 to 69,OOS,F,White,Not Span/Hispanic,3,Elective,Home w/ Home Health Services,2020,NEO029,BREAST CANCER - DUCTAL CARCINOMA IN SITU (DCIS),SKB003,MASTECTOMY AND LUMPECTOMY,363,BREAST PROCEDURES EXCEPT MASTECTOMY,09,"DISEASES AND DISORDERS OF THE SKIN, SUBCUTANEOUS TISSUE AND BREAST",2,Moderate,Minor,Surgical,Private Health Insurance,,,,,N,155292.73,27596.76
New York City,Manhattan,7002053,001463,NYU Langone Hospitals,30 to 49,OOS,F,Other Race,Spanish/Hispanic,5,Elective,Home w/ Home Health Services,2020,FAC004,ENCOUNTER FOR PROPHYLACTIC OR OTHER PROCEDURES,SKB004,BREAST RECONSTRUCTION,363,BREAST PROCEDURES EXCEPT MASTECTOMY,09,"DISEASES AND DISORDERS OF THE SKIN, SUBCUTANEOUS TISSUE AND BREAST",2,Moderate,Minor,Surgical,Private Health Insurance,,,,,N,203715.74,37617.86
New York City,Manhattan,7002053,001463,NYU Langone Hospitals,50 to 69,105,F,White,Not Span/Hispanic,3,Elective,Home w/ Home Health Services,2020,FAC004,ENCOUNTER FOR PROPHYLACTIC OR OTHER PROCEDURES,SKB004,BREAST RECONSTRUCTION,363,BREAST PROCEDURES EXCEPT MASTECTOMY,09,"DISEASES AND DISORDERS OF THE SKIN, SUBCUTANEOUS TISSUE AND BREAST",2,Moderate,Minor,Surgical,Private Health Insurance,,,,,N,256091.63,31499.46
New York City,Manhattan,7002053,001463,NYU Langone Hospitals,30 to 49,112,F,Other Race,Unknown,1,Elective,Home w/ Home Health Services,2020,NEO030,BREAST CANCER - ALL OTHER TYPES,SKB003,MASTECTOMY AND LUMPECTOMY,363,BREAST PROCEDURES EXCEPT MASTECTOMY,09,"DISEASES AND DISORDERS OF THE SKIN, SUBCUTANEOUS TISSUE AND BREAST",1,Minor,Minor,Surgical,Private Health Insurance,,,,,N,261275.2,28019.43
New York City,Manhattan,7002053,001463,NYU Langone Hospitals,50 to 69,OOS,F,White,Not Span/Hispanic,1,Elective,Home or Self Care,2020,GEN017,NONMALIGNANT BREAST CONDITIONS,GNR001,COSMETIC PROCEDURES,363,BREAST PROCEDURES EXCEPT MASTECTOMY,09,"DISEASES AND DISORDERS OF THE SKIN, SUBCUTANEOUS TISSUE AND BREAST",1,Minor,Minor,Surgical,Blue Cross/Blue Shield,,,,,N,79317.44,16068.86
New York City,Manhattan,7002053,001463,NYU Langone Hospitals,50 to 69,113,F,Other Race,Not Span/Hispanic,7,Elective,Home w/ Home Health Services,2020,FAC004,ENCOUNTER FOR PROPHYLACTIC OR OTHER PROCEDURES,SKB004,BREAST RECONSTRUCTION,363,BREAST PROCEDURES EXCEPT MASTECTOMY,09,"DISEASES AND DISORDERS OF THE SKIN, SUBCUTANEOUS TISSUE AND BREAST",3,Major,Minor,Surgical,Private Health Insurance,,,,,N,342237.42,62018.24
New York City,Manhattan,7002053,001463,NYU Langone Hospitals,30 to 49,115,F,White,Not Span/Hispanic,1,Elective,Home or Self Care,2020,GEN017,NONMALIGNANT BREAST CONDITIONS,SKB004,BREAST RECONSTRUCTION,363,BREAST PROCEDURES EXCEPT MASTECTOMY,09,"DISEASES AND DISORDERS OF THE SKIN, SUBCUTANEOUS TISSUE AND BREAST",1,Minor,Minor,Surgical,Private Health Insurance,,,,,N,77391.83,12517.05
New York City,Manhattan,7002053,001463,NYU Langone Hospitals,30 to 49,OOS,F,Other Race,Spanish/Hispanic,3,Elective,Home or Self Care,2020,FAC004,ENCOUNTER FOR PROPHYLACTIC OR OTHER PROCEDURES,SKB004,BREAST RECONSTRUCTION,363,BREAST PROCEDURES EXCEPT MASTECTOMY,09,"DISEASES AND DISORDERS OF THE SKIN, SUBCUTANEOUS TISSUE AND BREAST",2,Moderate,Minor,Surgical,Private Health Insurance,,,,,N,191694.26,27312.23
New York City,Manhattan,7002053,001463,NYU Langone Hospitals,50 to 69,113,F,Other Race,Spanish/Hispanic,3,Elective,Home w/ Home Health Services,2020,FAC004,ENCOUNTER FOR PROPHYLACTIC OR OTHER PROCEDURES,SKB004,BREAST RECONSTRUCTION,363,BREAST PROCEDURES EXCEPT MASTECTOMY,09,"DISEASES AND DISORDERS OF THE SKIN, SUBCUTANEOUS TISSUE AND BREAST",2,Moderate,Minor,Surgical,Private Health Insurance,,,,,N,168523.04,28935.55
New York City,Manhattan,7002053,001463,NYU Langone Hospitals,50 to 69,113,F,White,Not Span/Hispanic,1,Elective,Home or Self Care,2020,NEO030,BREAST CANCER - ALL OTHER TYPES,SKB003,MASTECTOMY AND LUMPECTOMY,363,BREAST PROCEDURES EXCEPT MASTECTOMY,09,"DISEASES AND DISORDERS OF THE SKIN, SUBCUTANEOUS TISSUE AND BREAST",2,Moderate,Minor,Surgical,Private Health Insurance,Private Health Insurance,,,,N,144328.4,21799.8
New York City,Manhattan,7002053,001463,NYU Langone Hospitals,50 to 69,116,F,Black/African American,Not Span/Hispanic,3,Elective,Home w/ Home Health Services,2020,FAC004,ENCOUNTER FOR PROPHYLACTIC OR OTHER PROCEDURES,SKB004,BREAST RECONSTRUCTION,363,BREAST PROCEDURES EXCEPT MASTECTOMY,09,"DISEASES AND DISORDERS OF THE SKIN, SUBCUTANEOUS TISSUE AND BREAST",2,Moderate,Minor,Surgical,Private Health Insurance,,,,,N,176636.53,29249.93
New York City,Manhattan,7002053,001463,NYU Langone Hospitals,50 to 69,103,F,White,Not Span/Hispanic,1,Elective,Home w/ Home Health Services,2020,NEO029,BREAST CANCER - DUCTAL CARCINOMA IN SITU (DCIS),LYM001,LYMPH NODE BIOPSY,363,BREAST PROCEDURES EXCEPT MASTECTOMY,09,"DISEASES AND DISORDERS OF THE SKIN, SUBCUTANEOUS TISSUE AND BREAST",1,Minor,Minor,Surgical,Blue Cross/Blue Shield,,,,,N,128546.7,19248.95
New York City,Manhattan,7002053,001463,NYU Langone Hospitals,30 to 49,112,F,Black/African American,Not Span/Hispanic,1,Elective,Home or Self Care,2020,NEO030,BREAST CANCER - ALL OTHER TYPES,SKB003,MASTECTOMY AND LUMPECTOMY,363,BREAST PROCEDURES EXCEPT MASTECTOMY,09,"DISEASES AND DISORDERS OF THE SKIN, SUBCUTANEOUS TISSUE AND BREAST",2,Moderate,Minor,Surgical,Medicaid,,,,,N,243046.33,25646.73
New York City,Manhattan,7002053,001463,NYU Langone Hospitals,50 to 69,103,F,White,Not Span/Hispanic,3,Elective,Home w/ Home Health Services,2020,NEO029,BREAST CANCER - DUCTAL CARCINOMA IN SITU (DCIS),SKB003,MASTECTOMY AND LUMPECTOMY,363,BREAST PROCEDURES EXCEPT MASTECTOMY,09,"DISEASES AND DISORDERS OF THE SKIN, SUBCUTANEOUS TISSUE AND BREAST",2,Moderate,Minor,Surgical,Private Health Insurance,,,,,N,173434.2,32796.7
New York City,Manhattan,7002053,001463,NYU Langone Hospitals,30 to 49,112,F,Black/African American,Not Span/Hispanic,2,Elective,Home w/ Home Health Services,2020,FAC004,ENCOUNTER FOR PROPHYLACTIC OR OTHER PROCEDURES,SKB004,BREAST RECONSTRUCTION,363,BREAST PROCEDURES EXCEPT MASTECTOMY,09,"DISEASES AND DISORDERS OF THE SKIN, SUBCUTANEOUS TISSUE AND BREAST",2,Moderate,Minor,Surgical,Medicaid,,,,,N,171791.04,29676.38
New York City,Manhattan,7002053,001463,NYU Langone Hospitals,30 to 49,112,F,Black/African American,Not Span/Hispanic,4,Elective,Home w/ Home Health Services,2020,FAC004,ENCOUNTER FOR PROPHYLACTIC OR OTHER PROCEDURES,SKB003,MASTECTOMY AND LUMPECTOMY,363,BREAST PROCEDURES EXCEPT MASTECTOMY,09,"DISEASES AND DISORDERS OF THE SKIN, SUBCUTANEOUS TISSUE AND BREAST",2,Moderate,Minor,Surgical,Medicaid,,,,,N,214699.47,41783.57
New York City,Manhattan,7002053,001463,NYU Langone Hospitals,30 to 49,103,F,Other Race,Not Span/Hispanic,3,Elective,Home w/ Home Health Services,2020,FAC004,ENCOUNTER FOR PROPHYLACTIC OR OTHER PROCEDURES,SKB004,BREAST RECONSTRUCTION,363,BREAST PROCEDURES EXCEPT MASTECTOMY,09,"DISEASES AND DISORDERS OF THE SKIN, SUBCUTANEOUS TISSUE AND BREAST",2,Moderate,Minor,Surgical,Blue Cross/Blue Shield,Private Health Insurance,,,,N,186068.17,34467.7
New York City,Manhattan,7002053,001463,NYU Langone Hospitals,30 to 49,100,F,Other Race,Not Span/Hispanic,3,Elective,Home or Self Care,2020,NEO030,BREAST CANCER - ALL OTHER TYPES,SKB003,MASTECTOMY AND LUMPECTOMY,363,BREAST PROCEDURES EXCEPT MASTECTOMY,09,"DISEASES AND DISORDERS OF THE SKIN, SUBCUTANEOUS TISSUE AND BREAST",3,Major,Minor,Surgical,Blue Cross/Blue Shield,,,,,N,168742.61,32684.02
New York City,Manhattan,7002053,001463,NYU Langone Hospitals,50 to 69,112,F,White,Not Span/Hispanic,3,Elective,Home w/ Home Health Services,2020,FAC004,ENCOUNTER FOR PROPHYLACTIC OR OTHER PROCEDURES,SKB004,BREAST RECONSTRUCTION,363,BREAST PROCEDURES EXCEPT MASTECTOMY,09,"DISEASES AND DISORDERS OF THE SKIN, SUBCUTANEOUS TISSUE AND BREAST",2,Moderate,Minor,Surgical,Private Health Insurance,,,,,N,168144.33,32237.3
New York City,Manhattan,7002053,001463,NYU Langone Hospitals,30 to 49,113,F,Other Race,Not Span/Hispanic,4,Elective,Home w/ Home Health Services,2020,FAC004,ENCOUNTER FOR PROPHYLACTIC OR OTHER PROCEDURES,SKB004,BREAST RECONSTRUCTION,363,BREAST PROCEDURES EXCEPT MASTECTOMY,09,"DISEASES AND DISORDERS OF THE SKIN, SUBCUTANEOUS TISSUE AND BREAST",3,Major,Minor,Surgical,Self-Pay,,,,,N,146365.93,32561.42
New York City,Manhattan,7002053,001463,NYU Langone Hospitals,50 to 69,100,F,Black/African American,Not Span/Hispanic,3,Elective,Home w/ Home Health Services,2020,FAC004,ENCOUNTER FOR PROPHYLACTIC OR OTHER PROCEDURES,SKB004,BREAST RECONSTRUCTION,363,BREAST PROCEDURES EXCEPT MASTECTOMY,09,"DISEASES AND DISORDERS OF THE SKIN, SUBCUTANEOUS TISSUE AND BREAST",2,Moderate,Minor,Surgical,Private Health Insurance,,,,,N,161114.84,30967.81
New York City,Manhattan,7002053,001463,NYU Langone Hospitals,30 to 49,107,F,White,Not Span/Hispanic,1,Elective,Home or Self Care,2020,NEO030,BREAST CANCER - ALL OTHER TYPES,SKB003,MASTECTOMY AND LUMPECTOMY,363,BREAST PROCEDURES EXCEPT MASTECTOMY,09,"DISEASES AND DISORDERS OF THE SKIN, SUBCUTANEOUS TISSUE AND BREAST",1,Minor,Minor,Surgical,Private Health Insurance,,,,,N,133789.7,21214.64
New York City,Manhattan,7002053,001463,NYU Langone Hospitals,30 to 49,100,F,White,Not Span/Hispanic,3,Elective,Home or Self Care,2020,FAC004,ENCOUNTER FOR PROPHYLACTIC OR OTHER PROCEDURES,SKB004,BREAST RECONSTRUCTION,363,BREAST PROCEDURES EXCEPT MASTECTOMY,09,"DISEASES AND DISORDERS OF THE SKIN, SUBCUTANEOUS TISSUE AND BREAST",2,Moderate,Minor,Surgical,Private Health Insurance,Private Health Insurance,,,,N,152580.38,30034.13
New York City,Manhattan,7002053,001463,NYU Langone Hospitals,30 to 49,112,F,White,Not Span/Hispanic,3,Elective,Home w/ Home Health Services,2020,FAC004,ENCOUNTER FOR PROPHYLACTIC OR OTHER PROCEDURES,SKB004,BREAST RECONSTRUCTION,363,BREAST PROCEDURES EXCEPT MASTECTOMY,09,"DISEASES AND DISORDERS OF THE SKIN, SUBCUTANEOUS TISSUE AND BREAST",2,Moderate,Minor,Surgical,Medicaid,,,,,N,166530.68,32108.71
New York City,Manhattan,7002053,001463,NYU Langone Hospitals,30 to 49,100,F,Other Race,Not Span/Hispanic,3,Elective,Home w/ Home Health Services,2020,NEO030,BREAST CANCER - ALL OTHER TYPES,SKB003,MASTECTOMY AND LUMPECTOMY,363,BREAST PROCEDURES EXCEPT MASTECTOMY,09,"DISEASES AND DISORDERS OF THE SKIN, SUBCUTANEOUS TISSUE AND BREAST",2,Moderate,Minor,Surgical,Private Health Insurance,,,,,N,155328.25,30140.51
New York City,Manhattan,7002053,001463,NYU Langone Hospitals,30 to 49,112,F,White,Spanish/Hispanic,1,Elective,Home w/ Home Health Services,2020,GEN017,NONMALIGNANT BREAST CONDITIONS,MST030,"MUSCULOSKELETAL PROCEDURES, NEC",363,BREAST PROCEDURES EXCEPT MASTECTOMY,09,"DISEASES AND DISORDERS OF THE SKIN, SUBCUTANEOUS TISSUE AND BREAST",2,Moderate,Minor,Surgical,Medicaid,,,,,N,136320.79,21772
New York City,Manhattan,7002053,001463,NYU Langone Hospitals,30 to 49,112,F,White,Not Span/Hispanic,4,Elective,Home w/ Home Health Services,2020,NEO030,BREAST CANCER - ALL OTHER TYPES,SKB003,MASTECTOMY AND LUMPECTOMY,363,BREAST PROCEDURES EXCEPT MASTECTOMY,09,"DISEASES AND DISORDERS OF THE SKIN, SUBCUTANEOUS TISSUE AND BREAST",3,Major,Minor,Surgical,Medicaid,,,,,N,202503.65,39733.3
New York City,Manhattan,7002053,001463,NYU Langone Hospitals,30 to 49,112,F,Black/African American,Not Span/Hispanic,10,Elective,Inpatient Rehabilitation Facility,2020,FAC004,ENCOUNTER FOR PROPHYLACTIC OR OTHER PROCEDURES,SKB004,BREAST RECONSTRUCTION,363,BREAST PROCEDURES EXCEPT MASTECTOMY,09,"DISEASES AND DISORDERS OF THE SKIN, SUBCUTANEOUS TISSUE AND BREAST",2,Moderate,Minor,Surgical,Medicare,Medicaid,,,,N,346788.97,77123.35
New York City,Manhattan,7002053,001463,NYU Langone Hospitals,50 to 69,100,F,White,Not Span/Hispanic,4,Elective,Home w/ Home Health Services,2020,NEO030,BREAST CANCER - ALL OTHER TYPES,SKB003,MASTECTOMY AND LUMPECTOMY,363,BREAST PROCEDURES EXCEPT MASTECTOMY,09,"DISEASES AND DISORDERS OF THE SKIN, SUBCUTANEOUS TISSUE AND BREAST",2,Moderate,Minor,Surgical,Private Health Insurance,,,,,N,217981.03,42324.22
New York City,Manhattan,7002053,001463,NYU Langone Hospitals,50 to 69,112,F,Other Race,Not Span/Hispanic,3,Elective,Home w/ Home Health Services,2020,FAC004,ENCOUNTER FOR PROPHYLACTIC OR OTHER PROCEDURES,SKB004,BREAST RECONSTRUCTION,363,BREAST PROCEDURES EXCEPT MASTECTOMY,09,"DISEASES AND DISORDERS OF THE SKIN, SUBCUTANEOUS TISSUE AND BREAST",2,Moderate,Minor,Surgical,Private Health Insurance,,,,,N,143379.88,29126.34
New York City,Manhattan,7002053,001463,NYU Langone Hospitals,50 to 69,OOS,F,White,Not Span/Hispanic,3,Elective,Home or Self Care,2020,FAC004,ENCOUNTER FOR PROPHYLACTIC OR OTHER PROCEDURES,SKB004,BREAST RECONSTRUCTION,363,BREAST PROCEDURES EXCEPT MASTECTOMY,09,"DISEASES AND DISORDERS OF THE SKIN, SUBCUTANEOUS TISSUE AND BREAST",2,Moderate,Minor,Surgical,Blue Cross/Blue Shield,,,,,N,145629.38,29337.89
New York City,Manhattan,7002053,001463,NYU Langone Hospitals,50 to 69,100,F,Other Race,Spanish/Hispanic,5,Elective,Home w/ Home Health Services,2020,INJ037,"COMPLICATION OF OTHER SURGICAL OR MEDICAL CARE, INJURY, INITIAL ENCOUNTER",SKB004,BREAST RECONSTRUCTION,363,BREAST PROCEDURES EXCEPT MASTECTOMY,09,"DISEASES AND DISORDERS OF THE SKIN, SUBCUTANEOUS TISSUE AND BREAST",2,Moderate,Minor,Surgical,Private Health Insurance,,,,,N,214308.33,45016.75
New York City,Manhattan,7002053,001463,NYU Langone Hospitals,50 to 69,104,F,Black/African American,Not Span/Hispanic,3,Elective,Home or Self Care,2020,FAC004,ENCOUNTER FOR PROPHYLACTIC OR OTHER PROCEDURES,SKB004,BREAST RECONSTRUCTION,363,BREAST PROCEDURES EXCEPT MASTECTOMY,09,"DISEASES AND DISORDERS OF THE SKIN, SUBCUTANEOUS TISSUE AND BREAST",2,Moderate,Minor,Surgical,Medicare,,,,,N,150174.5,29615.5
New York City,Manhattan,7002053,001463,NYU Langone Hospitals,50 to 69,104,F,Black/African American,Not Span/Hispanic,2,Elective,Home w/ Home Health Services,2020,FAC004,ENCOUNTER FOR PROPHYLACTIC OR OTHER PROCEDURES,SKB004,BREAST RECONSTRUCTION,363,BREAST PROCEDURES EXCEPT MASTECTOMY,09,"DISEASES AND DISORDERS OF THE SKIN, SUBCUTANEOUS TISSUE AND BREAST",2,Moderate,Minor,Surgical,Blue Cross/Blue Shield,,,,,N,119755.02,22325.67
