Hospital Service Area,Hospital County,Operating Certificate Number,Permanent Facility Id,Facility Name,Age Group,Zip Code - 3 digits,Gender,Race,Ethnicity,Length of Stay,Type of Admission,Patient Disposition,Discharge Year,CCS Diagnosis Code,CCS Diagnosis Description,CCS Procedure Code,CCS Procedure Description,APR DRG Code,APR DRG Description,APR MDC Code,APR MDC Description,APR Severity of Illness Code,APR Severity of Illness Description,APR Risk of Mortality,APR Medical Surgical Description,Payment Typology 1,Payment Typology 2,Payment Typology 3,Birth Weight,Abortion Edit Indicator,Emergency Department Indicator,Total Charges,Total Costs
Long Island,Suffolk,5151001,000245,Stony Brook University Hospital,50 to 69,117,M,Black/African American,Multi-ethnic,2,Emergency,Home or Self Care,2019,INJ013,"OPEN WOUNDS OF TRUNK, INITIAL ENCOUNTER",GNR005,CONTROL OF BLEEDING (NON-ENDOSCOPIC),364,"OTHER SKIN, SUBCUTANEOUS TISSUE & RELATED PROCEDURES",09,"DISEASES AND DISORDERS OF THE SKIN, SUBCUTANEOUS TISSUE AND BREAST",3,Major,Moderate,Surgical,Medicaid,,,,,true,36874.37,7512.07
Long Island,Suffolk,5151001,000245,Stony Brook University Hospital,50 to 69,119,F,White,Not Span/Hispanic,4,Emergency,Home or Self Care,2019,SKN001,SKIN AND SUBCUTANEOUS TISSUE INFECTIONS,MST004,INCISION AND DRAINAGE OF MUSCULOSKELETAL TISSUE AND JOINTS,364,"OTHER SKIN, SUBCUTANEOUS TISSUE & RELATED PROCEDURES",09,"DISEASES AND DISORDERS OF THE SKIN, SUBCUTANEOUS TISSUE AND BREAST",1,Minor,Minor,Surgical,Blue Cross/Blue Shield,,,,,true,44473.2,14358.58
Hudson Valley,Putnam,3950000,000752,Putnam Hospital,70 or Older,105,F,White,Not Span/Hispanic,2,Emergency,Home or Self Care,2019,SKN001,SKIN AND SUBCUTANEOUS TISSUE INFECTIONS,MST018,BONE EXCISION,364,"OTHER SKIN, SUBCUTANEOUS TISSUE & RELATED PROCEDURES",09,"DISEASES AND DISORDERS OF THE SKIN, SUBCUTANEOUS TISSUE AND BREAST",2,Moderate,Minor,Surgical,Medicare,,,,,true,22477.84,7169.57
Central NY,Oneida,3202003,000599,Faxton-St Lukes Healthcare St Lukes Division,18 to 29,135,M,White,Not Span/Hispanic,6,Emergency,Home w/ Home Health Services,2019,SKN001,SKIN AND SUBCUTANEOUS TISSUE INFECTIONS,MST020,SUBCUTANEOUS TISSUE AND FASCIA EXCISION,364,"OTHER SKIN, SUBCUTANEOUS TISSUE & RELATED PROCEDURES",09,"DISEASES AND DISORDERS OF THE SKIN, SUBCUTANEOUS TISSUE AND BREAST",1,Minor,Minor,Surgical,Medicaid,,,,,true,30416.82,9024.08
Central NY,Oneida,3202003,000599,Faxton-St Lukes Healthcare St Lukes Division,50 to 69,135,F,White,Not Span/Hispanic,2,Emergency,Left Against Medical Advice,2019,SKN001,SKIN AND SUBCUTANEOUS TISSUE INFECTIONS,MST005,INCISION AND DRAINAGE OF SUBCUTANEOUS TISSUE AND FASCIA,364,"OTHER SKIN, SUBCUTANEOUS TISSUE & RELATED PROCEDURES",09,"DISEASES AND DISORDERS OF THE SKIN, SUBCUTANEOUS TISSUE AND BREAST",2,Moderate,Moderate,Surgical,Medicaid,,,,,true,26115.72,6321.32
New York City,Manhattan,7002001,001438,Bellevue Hospital Center,30 to 49,112,M,Black/African American,Not Span/Hispanic,4,Emergency,Home or Self Care,2019,SKN001,SKIN AND SUBCUTANEOUS TISSUE INFECTIONS,MST005,INCISION AND DRAINAGE OF SUBCUTANEOUS TISSUE AND FASCIA,364,"OTHER SKIN, SUBCUTANEOUS TISSUE & RELATED PROCEDURES",09,"DISEASES AND DISORDERS OF THE SKIN, SUBCUTANEOUS TISSUE AND BREAST",1,Minor,Minor,Surgical,Medicaid,,,,,true,22606.36,15024.19
Capital/Adirond,Albany,0101004,000005,St. Peter's Hospital,70 or Older,120,F,White,Not Span/Hispanic,3,Elective,Home or Self Care,2019,INJ012,"OPEN WOUNDS TO LIMBS, INITIAL ENCOUNTER",MST030,"MUSCULOSKELETAL PROCEDURES, NEC",364,"OTHER SKIN, SUBCUTANEOUS TISSUE & RELATED PROCEDURES",09,"DISEASES AND DISORDERS OF THE SKIN, SUBCUTANEOUS TISSUE AND BREAST",1,Minor,Minor,Surgical,Medicare,Private Health Insurance,,,,false,22337.6,9550.37
New York City,Manhattan,7002001,001438,Bellevue Hospital Center,18 to 29,OOS,M,Black/African American,Not Span/Hispanic,2,Emergency,Home or Self Care,2019,INJ012,"OPEN WOUNDS TO LIMBS, INITIAL ENCOUNTER",MST028,"SUBCUTANEOUS TISSUE AND FASCIA PROCEDURES, NEC",364,"OTHER SKIN, SUBCUTANEOUS TISSUE & RELATED PROCEDURES",09,"DISEASES AND DISORDERS OF THE SKIN, SUBCUTANEOUS TISSUE AND BREAST",1,Minor,Minor,Surgical,Self-Pay,,,,,true,22792.56,15147.94
Long Island,Suffolk,5151001,000245,Stony Brook University Hospital,70 or Older,119,M,White,Not Span/Hispanic,7,Emergency,Skilled Nursing Home,2019,INJ012,"OPEN WOUNDS TO LIMBS, INITIAL ENCOUNTER",MST020,SUBCUTANEOUS TISSUE AND FASCIA EXCISION,364,"OTHER SKIN, SUBCUTANEOUS TISSUE & RELATED PROCEDURES",09,"DISEASES AND DISORDERS OF THE SKIN, SUBCUTANEOUS TISSUE AND BREAST",3,Major,Major,Surgical,Medicare,Private Health Insurance,,,,true,102157.98,39320.88
New York City,Kings,7001002,001286,Brookdale Hospital Medical Center,30 to 49,112,M,Black/African American,Not Span/Hispanic,4,Trauma,Home or Self Care,2019,INJ013,"OPEN WOUNDS OF TRUNK, INITIAL ENCOUNTER",GIS005,EXPLORATION OF PERITONEAL CAVITY,364,"OTHER SKIN, SUBCUTANEOUS TISSUE & RELATED PROCEDURES",09,"DISEASES AND DISORDERS OF THE SKIN, SUBCUTANEOUS TISSUE AND BREAST",3,Major,Moderate,Surgical,Medicaid,,,,,true,45088.23,22985.89
New York City,Kings,7001002,001286,Brookdale Hospital Medical Center,30 to 49,112,F,Other Race,Not Span/Hispanic,3,Emergency,Home w/ Home Health Services,2019,SKN001,SKIN AND SUBCUTANEOUS TISSUE INFECTIONS,MST005,INCISION AND DRAINAGE OF SUBCUTANEOUS TISSUE AND FASCIA,364,"OTHER SKIN, SUBCUTANEOUS TISSUE & RELATED PROCEDURES",09,"DISEASES AND DISORDERS OF THE SKIN, SUBCUTANEOUS TISSUE AND BREAST",2,Moderate,Minor,Surgical,Medicaid,,,,,true,11124.76,5064.62
Western NY,Erie,1401005,000210,Erie County Medical Center,50 to 69,143,M,White,Not Span/Hispanic,1,Emergency,Home or Self Care,2019,SKN001,SKIN AND SUBCUTANEOUS TISSUE INFECTIONS,MST005,INCISION AND DRAINAGE OF SUBCUTANEOUS TISSUE AND FASCIA,364,"OTHER SKIN, SUBCUTANEOUS TISSUE & RELATED PROCEDURES",09,"DISEASES AND DISORDERS OF THE SKIN, SUBCUTANEOUS TISSUE AND BREAST",2,Moderate,Minor,Surgical,Medicare,Medicare,,,,true,5856.82,2299.65
New York City,Bronx,7000001,001178,BronxCare Hospital Center,0 to 17,104,F,Other Race,Spanish/Hispanic,3,Emergency,Home or Self Care,2019,SKN001,SKIN AND SUBCUTANEOUS TISSUE INFECTIONS,MST005,INCISION AND DRAINAGE OF SUBCUTANEOUS TISSUE AND FASCIA,364,"OTHER SKIN, SUBCUTANEOUS TISSUE & RELATED PROCEDURES",09,"DISEASES AND DISORDERS OF THE SKIN, SUBCUTANEOUS TISSUE AND BREAST",2,Moderate,Minor,Surgical,Medicaid,Medicaid,,,,true,13693.15,13747.67
Long Island,Suffolk,5154001,000925,Good Samaritan Hospital Medical Center,50 to 69,117,F,White,Not Span/Hispanic,2,Emergency,Home or Self Care,2019,SKN001,SKIN AND SUBCUTANEOUS TISSUE INFECTIONS,MST005,INCISION AND DRAINAGE OF SUBCUTANEOUS TISSUE AND FASCIA,364,"OTHER SKIN, SUBCUTANEOUS TISSUE & RELATED PROCEDURES",09,"DISEASES AND DISORDERS OF THE SKIN, SUBCUTANEOUS TISSUE AND BREAST",1,Minor,Minor,Surgical,Miscellaneous/Other,Blue Cross/Blue Shield,,,,true,25779.87,5193.24
New York City,Kings,7001002,001286,Brookdale Hospital Medical Center,30 to 49,112,F,Black/African American,Not Span/Hispanic,2,Trauma,Left Against Medical Advice,2019,INJ011,"OPEN WOUNDS OF HEAD AND NECK, INITIAL ENCOUNTER",MST028,"SUBCUTANEOUS TISSUE AND FASCIA PROCEDURES, NEC",364,"OTHER SKIN, SUBCUTANEOUS TISSUE & RELATED PROCEDURES",09,"DISEASES AND DISORDERS OF THE SKIN, SUBCUTANEOUS TISSUE AND BREAST",3,Major,Moderate,Surgical,Medicaid,,,,,true,15458.99,7307.31
Western NY,Erie,1401014,000208,John R. Oishei Children's Hospital,18 to 29,142,M,Other Race,Spanish/Hispanic,1,Emergency,Home or Self Care,2019,SKN001,SKIN AND SUBCUTANEOUS TISSUE INFECTIONS,MST005,INCISION AND DRAINAGE OF SUBCUTANEOUS TISSUE AND FASCIA,364,"OTHER SKIN, SUBCUTANEOUS TISSUE & RELATED PROCEDURES",09,"DISEASES AND DISORDERS OF THE SKIN, SUBCUTANEOUS TISSUE AND BREAST",2,Moderate,Moderate,Surgical,Medicaid,Self-Pay,,,,true,4528.8,2476.25
Hudson Valley,Orange,3529000,000704,St Anthony Community Hospital,18 to 29,109,M,Other Race,Spanish/Hispanic,1,Emergency,Left Against Medical Advice,2019,SKN001,SKIN AND SUBCUTANEOUS TISSUE INFECTIONS,MST005,INCISION AND DRAINAGE OF SUBCUTANEOUS TISSUE AND FASCIA,364,"OTHER SKIN, SUBCUTANEOUS TISSUE & RELATED PROCEDURES",09,"DISEASES AND DISORDERS OF THE SKIN, SUBCUTANEOUS TISSUE AND BREAST",2,Moderate,Minor,Surgical,Self-Pay,,,,,true,51074.51,5218.35
Capital/Adirond,Montgomery,2801001,000484,St. Mary's Healthcare,70 or Older,120,M,White,Not Span/Hispanic,3,Elective,Home or Self Care,2019,END003,DIABETES MELLITUS WITH COMPLICATION,MST019,"MUSCLE, TENDON, BURSA, AND LIGAMENT EXCISION",364,"OTHER SKIN, SUBCUTANEOUS TISSUE & RELATED PROCEDURES",09,"DISEASES AND DISORDERS OF THE SKIN, SUBCUTANEOUS TISSUE AND BREAST",2,Moderate,Moderate,Surgical,Medicare,Blue Cross/Blue Shield,,,,false,10374.91,4138.58
Capital/Adirond,Montgomery,2801001,000484,St. Mary's Healthcare,50 to 69,120,F,White,Not Span/Hispanic,1,Emergency,Short-term Hospital,2019,INJ012,"OPEN WOUNDS TO LIMBS, INITIAL ENCOUNTER",MST019,"MUSCLE, TENDON, BURSA, AND LIGAMENT EXCISION",364,"OTHER SKIN, SUBCUTANEOUS TISSUE & RELATED PROCEDURES",09,"DISEASES AND DISORDERS OF THE SKIN, SUBCUTANEOUS TISSUE AND BREAST",3,Major,Moderate,Surgical,Medicare,Medicaid,,,,true,9905.52,3550.3
New York City,Bronx,7000002,001165,Jacobi Medical Center,0 to 17,104,M,Other Race,Not Span/Hispanic,11,Emergency,Home or Self Care,2019,INJ013,"OPEN WOUNDS OF TRUNK, INITIAL ENCOUNTER",GIS005,EXPLORATION OF PERITONEAL CAVITY,364,"OTHER SKIN, SUBCUTANEOUS TISSUE & RELATED PROCEDURES",09,"DISEASES AND DISORDERS OF THE SKIN, SUBCUTANEOUS TISSUE AND BREAST",2,Moderate,Minor,Surgical,Medicaid,Medicaid,,,,true,76837,45460.61
Western NY,Erie,1401014,003067,Millard Fillmore Suburban Hospital,70 or Older,140,M,White,Not Span/Hispanic,7,Emergency,Skilled Nursing Home,2019,END003,DIABETES MELLITUS WITH COMPLICATION,MST005,INCISION AND DRAINAGE OF SUBCUTANEOUS TISSUE AND FASCIA,364,"OTHER SKIN, SUBCUTANEOUS TISSUE & RELATED PROCEDURES",09,"DISEASES AND DISORDERS OF THE SKIN, SUBCUTANEOUS TISSUE AND BREAST",3,Major,Major,Surgical,Medicare,Self-Pay,,,,true,20013.46,10034.39
New York City,Manhattan,7002054,001437,New York-Presbyterian/Lower Manhattan Hospital,30 to 49,117,M,White,Not Span/Hispanic,1,Emergency,Home or Self Care,2019,INJ012,"OPEN WOUNDS TO LIMBS, INITIAL ENCOUNTER",MST022,"TENDON, MUSCLE, BURSA, AND LIGAMENT REPAIR (EXCLUDING PERINEAL)",364,"OTHER SKIN, SUBCUTANEOUS TISSUE & RELATED PROCEDURES",09,"DISEASES AND DISORDERS OF THE SKIN, SUBCUTANEOUS TISSUE AND BREAST",1,Minor,Minor,Surgical,"Managed Care, Unspecified",Medicaid,Self-Pay,,,true,26129.86,7586.47
Western NY,Erie,1401005,000210,Erie County Medical Center,18 to 29,141,F,White,Not Span/Hispanic,2,Emergency,Home or Self Care,2019,SKN001,SKIN AND SUBCUTANEOUS TISSUE INFECTIONS,MST005,INCISION AND DRAINAGE OF SUBCUTANEOUS TISSUE AND FASCIA,364,"OTHER SKIN, SUBCUTANEOUS TISSUE & RELATED PROCEDURES",09,"DISEASES AND DISORDERS OF THE SKIN, SUBCUTANEOUS TISSUE AND BREAST",1,Minor,Minor,Surgical,Miscellaneous/Other,,,,,true,6775.39,3685.96
New York City,Bronx,7000006,001169,Montefiore Medical Center - Henry & Lucy Moses Div,0 to 17,104,M,Other Race,Spanish/Hispanic,3,Emergency,Home or Self Care,2019,SKN001,SKIN AND SUBCUTANEOUS TISSUE INFECTIONS,MST005,INCISION AND DRAINAGE OF SUBCUTANEOUS TISSUE AND FASCIA,364,"OTHER SKIN, SUBCUTANEOUS TISSUE & RELATED PROCEDURES",09,"DISEASES AND DISORDERS OF THE SKIN, SUBCUTANEOUS TISSUE AND BREAST",1,Minor,Minor,Surgical,Private Health Insurance,,,,,true,59720.12,12960
New York City,Kings,7001021,001306,New York - Presbyterian Brooklyn Methodist Hospital,50 to 69,112,F,White,Spanish/Hispanic,13,Emergency,Home w/ Home Health Services,2019,MUS025,OTHER SPECIFIED CONNECTIVE TISSUE DISEASE,GNR001,COSMETIC PROCEDURES,364,"OTHER SKIN, SUBCUTANEOUS TISSUE & RELATED PROCEDURES",09,"DISEASES AND DISORDERS OF THE SKIN, SUBCUTANEOUS TISSUE AND BREAST",3,Major,Moderate,Surgical,Blue Cross/Blue Shield,Self-Pay,,,,false,116461.29,36852.27
Southern Tier,Broome,0301001,000043,Our Lady of Lourdes Memorial Hospital,70 or Older,137,M,White,Not Span/Hispanic,8,Emergency,Short-term Hospital,2019,SKN001,SKIN AND SUBCUTANEOUS TISSUE INFECTIONS,MST020,SUBCUTANEOUS TISSUE AND FASCIA EXCISION,364,"OTHER SKIN, SUBCUTANEOUS TISSUE & RELATED PROCEDURES",09,"DISEASES AND DISORDERS OF THE SKIN, SUBCUTANEOUS TISSUE AND BREAST",3,Major,Major,Surgical,Medicare,Self-Pay,Self-Pay,,,true,59633.01,21120.62
New York City,Manhattan,7002053,001463,NYU Langone Hospitals,0 to 17,112,F,White,Unknown,3,Emergency,Home or Self Care,2019,SKN001,SKIN AND SUBCUTANEOUS TISSUE INFECTIONS,MST005,INCISION AND DRAINAGE OF SUBCUTANEOUS TISSUE AND FASCIA,364,"OTHER SKIN, SUBCUTANEOUS TISSUE & RELATED PROCEDURES",09,"DISEASES AND DISORDERS OF THE SKIN, SUBCUTANEOUS TISSUE AND BREAST",1,Minor,Minor,Surgical,Medicaid,,,,,true,43289.87,11282.97
New York City,Kings,7001021,001306,New York - Presbyterian Brooklyn Methodist Hospital,50 to 69,112,M,Black/African American,Not Span/Hispanic,4,Emergency,Home w/ Home Health Services,2019,END003,DIABETES MELLITUS WITH COMPLICATION,MST005,INCISION AND DRAINAGE OF SUBCUTANEOUS TISSUE AND FASCIA,364,"OTHER SKIN, SUBCUTANEOUS TISSUE & RELATED PROCEDURES",09,"DISEASES AND DISORDERS OF THE SKIN, SUBCUTANEOUS TISSUE AND BREAST",2,Moderate,Moderate,Surgical,Private Health Insurance,,,,,true,40641.93,13688.7
New York City,Manhattan,7002054,001464,New York-Presbyterian Hospital - Columbia Presbyterian Center,50 to 69,112,F,Multi-racial,Not Span/Hispanic,5,Urgent,Home w/ Home Health Services,2019,END003,DIABETES MELLITUS WITH COMPLICATION,MST018,BONE EXCISION,364,"OTHER SKIN, SUBCUTANEOUS TISSUE & RELATED PROCEDURES",09,"DISEASES AND DISORDERS OF THE SKIN, SUBCUTANEOUS TISSUE AND BREAST",3,Major,Moderate,Surgical,Medicare,Medicare,Medicaid,,,false,94593.58,26130.79
New York City,Kings,7001021,001306,New York - Presbyterian Brooklyn Methodist Hospital,50 to 69,112,F,Black/African American,Not Span/Hispanic,3,Emergency,Home w/ Home Health Services,2019,END003,DIABETES MELLITUS WITH COMPLICATION,MST020,SUBCUTANEOUS TISSUE AND FASCIA EXCISION,364,"OTHER SKIN, SUBCUTANEOUS TISSUE & RELATED PROCEDURES",09,"DISEASES AND DISORDERS OF THE SKIN, SUBCUTANEOUS TISSUE AND BREAST",2,Moderate,Moderate,Surgical,"Managed Care, Unspecified",Medicaid,Self-Pay,,,true,44305.75,13671.12
New York City,Manhattan,7002054,001464,New York-Presbyterian Hospital - Columbia Presbyterian Center,50 to 69,100,M,Multi-racial,Multi-ethnic,3,Urgent,Home w/ Home Health Services,2019,END003,DIABETES MELLITUS WITH COMPLICATION,MST018,BONE EXCISION,364,"OTHER SKIN, SUBCUTANEOUS TISSUE & RELATED PROCEDURES",09,"DISEASES AND DISORDERS OF THE SKIN, SUBCUTANEOUS TISSUE AND BREAST",2,Moderate,Moderate,Surgical,Medicare,Medicare,Medicaid,,,false,57307.63,15016.05
New York City,Manhattan,7002054,001464,New York-Presbyterian Hospital - Columbia Presbyterian Center,50 to 69,OOS,M,White,Not Span/Hispanic,3,Elective,Home or Self Care,2019,NEO027,SKIN CANCERS - SQUAMOUS CELL CARCINOMA,LYM003,LYMPH NODE DISSECTION,364,"OTHER SKIN, SUBCUTANEOUS TISSUE & RELATED PROCEDURES",09,"DISEASES AND DISORDERS OF THE SKIN, SUBCUTANEOUS TISSUE AND BREAST",2,Moderate,Moderate,Surgical,Blue Cross/Blue Shield,Self-Pay,,,,false,65420.88,17769.49
New York City,Kings,7001021,001306,New York - Presbyterian Brooklyn Methodist Hospital,50 to 69,112,F,Black/African American,Spanish/Hispanic,8,Emergency,Home or Self Care,2019,SKN001,SKIN AND SUBCUTANEOUS TISSUE INFECTIONS,MST018,BONE EXCISION,364,"OTHER SKIN, SUBCUTANEOUS TISSUE & RELATED PROCEDURES",09,"DISEASES AND DISORDERS OF THE SKIN, SUBCUTANEOUS TISSUE AND BREAST",3,Major,Moderate,Surgical,"Managed Care, Unspecified",Medicaid,Self-Pay,,,true,76822.02,22424.43
Central NY,Oneida,3202003,000599,Faxton-St Lukes Healthcare St Lukes Division,70 or Older,135,M,White,Not Span/Hispanic,9,Emergency,Home or Self Care,2019,END003,DIABETES MELLITUS WITH COMPLICATION,CAR008,ANGIOPLASTY AND RELATED VESSEL PROCEDURES (ENDOVASCULAR; EXCLUDING CAROTID),364,"OTHER SKIN, SUBCUTANEOUS TISSUE & RELATED PROCEDURES",09,"DISEASES AND DISORDERS OF THE SKIN, SUBCUTANEOUS TISSUE AND BREAST",2,Moderate,Moderate,Surgical,Medicare,,,,,true,42816.38,26267.94
Hudson Valley,Westchester,5932000,001129,Phelps Hospital,18 to 29,105,F,Other Race,Spanish/Hispanic,5,Emergency,Home or Self Care,2019,SKN001,SKIN AND SUBCUTANEOUS TISSUE INFECTIONS,MST004,INCISION AND DRAINAGE OF MUSCULOSKELETAL TISSUE AND JOINTS,364,"OTHER SKIN, SUBCUTANEOUS TISSUE & RELATED PROCEDURES",09,"DISEASES AND DISORDERS OF THE SKIN, SUBCUTANEOUS TISSUE AND BREAST",1,Minor,Minor,Surgical,Private Health Insurance,,,,,true,48198.9,17801.68
New York City,Bronx,7000001,001178,BronxCare Hospital Center,50 to 69,104,M,Black/African American,Not Span/Hispanic,13,Emergency,Skilled Nursing Home,2019,SKN001,SKIN AND SUBCUTANEOUS TISSUE INFECTIONS,MST020,SUBCUTANEOUS TISSUE AND FASCIA EXCISION,364,"OTHER SKIN, SUBCUTANEOUS TISSUE & RELATED PROCEDURES",09,"DISEASES AND DISORDERS OF THE SKIN, SUBCUTANEOUS TISSUE AND BREAST",2,Moderate,Moderate,Surgical,Medicaid,,,,,true,39506.21,56403.65
New York City,Manhattan,7002021,001454,Metropolitan Hospital Center,0 to 17,104,M,Other Race,Spanish/Hispanic,6,Emergency,Home or Self Care,2019,SKN001,SKIN AND SUBCUTANEOUS TISSUE INFECTIONS,MST005,INCISION AND DRAINAGE OF SUBCUTANEOUS TISSUE AND FASCIA,364,"OTHER SKIN, SUBCUTANEOUS TISSUE & RELATED PROCEDURES",09,"DISEASES AND DISORDERS OF THE SKIN, SUBCUTANEOUS TISSUE AND BREAST",2,Moderate,Minor,Surgical,Self-Pay,,,,,true,33137.12,26773.14
Capital/Adirond,Albany,0101004,000005,St. Peter's Hospital,50 to 69,OOS,M,White,Not Span/Hispanic,5,Urgent,Home or Self Care,2019,END003,DIABETES MELLITUS WITH COMPLICATION,MST019,"MUSCLE, TENDON, BURSA, AND LIGAMENT EXCISION",364,"OTHER SKIN, SUBCUTANEOUS TISSUE & RELATED PROCEDURES",09,"DISEASES AND DISORDERS OF THE SKIN, SUBCUTANEOUS TISSUE AND BREAST",3,Major,Moderate,Surgical,Medicare,,,,,false,24060.94,11578.48
Finger Lakes,Monroe,2701001,000409,Highland Hospital,30 to 49,146,M,White,Not Span/Hispanic,2,Emergency,Left Against Medical Advice,2019,SKN001,SKIN AND SUBCUTANEOUS TISSUE INFECTIONS,MST005,INCISION AND DRAINAGE OF SUBCUTANEOUS TISSUE AND FASCIA,364,"OTHER SKIN, SUBCUTANEOUS TISSUE & RELATED PROCEDURES",09,"DISEASES AND DISORDERS OF THE SKIN, SUBCUTANEOUS TISSUE AND BREAST",1,Minor,Minor,Surgical,Self-Pay,,,,,true,15680.23,5154.36
New York City,Kings,7002053,001304,NYU Langone Hospital-Brooklyn,50 to 69,112,M,Other Race,Not Span/Hispanic,28,Emergency,Skilled Nursing Home,2019,SKN001,SKIN AND SUBCUTANEOUS TISSUE INFECTIONS,MST005,INCISION AND DRAINAGE OF SUBCUTANEOUS TISSUE AND FASCIA,364,"OTHER SKIN, SUBCUTANEOUS TISSUE & RELATED PROCEDURES",09,"DISEASES AND DISORDERS OF THE SKIN, SUBCUTANEOUS TISSUE AND BREAST",4,Extreme,Major,Surgical,Medicaid,,,,,true,460652.41,100567.05
New York City,Manhattan,7002001,001438,Bellevue Hospital Center,30 to 49,104,F,Other Race,Spanish/Hispanic,1,Emergency,Home or Self Care,2019,END016,OTHER SPECIFIED AND UNSPECIFIED NUTRITIONAL AND METABOLIC DISORDERS,GNR008,"ABDOMINAL WALL PROCEDURES, NEC",364,"OTHER SKIN, SUBCUTANEOUS TISSUE & RELATED PROCEDURES",09,"DISEASES AND DISORDERS OF THE SKIN, SUBCUTANEOUS TISSUE AND BREAST",1,Minor,Minor,Surgical,Medicare,Medicare,Medicaid,,,false,6213.89,4129.75
Capital/Adirond,Schenectady,4601001,000829,Ellis Hospital,50 to 69,123,F,White,Not Span/Hispanic,6,Emergency,Home or Self Care,2019,SKN001,SKIN AND SUBCUTANEOUS TISSUE INFECTIONS,MST005,INCISION AND DRAINAGE OF SUBCUTANEOUS TISSUE AND FASCIA,364,"OTHER SKIN, SUBCUTANEOUS TISSUE & RELATED PROCEDURES",09,"DISEASES AND DISORDERS OF THE SKIN, SUBCUTANEOUS TISSUE AND BREAST",2,Moderate,Moderate,Surgical,Medicare,Medicare,Medicaid,,,true,27540.22,8777.9
New York City,Manhattan,7002053,001463,NYU Langone Hospitals,50 to 69,OOS,M,White,Not Span/Hispanic,4,Emergency,Home w/ Home Health Services,2019,SKN001,SKIN AND SUBCUTANEOUS TISSUE INFECTIONS,MST005,INCISION AND DRAINAGE OF SUBCUTANEOUS TISSUE AND FASCIA,364,"OTHER SKIN, SUBCUTANEOUS TISSUE & RELATED PROCEDURES",09,"DISEASES AND DISORDERS OF THE SKIN, SUBCUTANEOUS TISSUE AND BREAST",3,Major,Major,Surgical,Medicare,Blue Cross/Blue Shield,,,,true,42151.46,15287.9
New York City,Manhattan,7002001,001438,Bellevue Hospital Center,18 to 29,104,M,Other Race,Not Span/Hispanic,2,Emergency,Left Against Medical Advice,2019,SKN001,SKIN AND SUBCUTANEOUS TISSUE INFECTIONS,MST005,INCISION AND DRAINAGE OF SUBCUTANEOUS TISSUE AND FASCIA,364,"OTHER SKIN, SUBCUTANEOUS TISSUE & RELATED PROCEDURES",09,"DISEASES AND DISORDERS OF THE SKIN, SUBCUTANEOUS TISSUE AND BREAST",3,Major,Minor,Surgical,Medicaid,Medicaid,,,,true,15515.1,10311.34
New York City,Manhattan,7002020,001453,Memorial Hospital for Cancer and Allied Diseases,50 to 69,114,F,White,Not Span/Hispanic,6,Emergency,Home w/ Home Health Services,2019,SKN001,SKIN AND SUBCUTANEOUS TISSUE INFECTIONS,GNR008,"ABDOMINAL WALL PROCEDURES, NEC",364,"OTHER SKIN, SUBCUTANEOUS TISSUE & RELATED PROCEDURES",09,"DISEASES AND DISORDERS OF THE SKIN, SUBCUTANEOUS TISSUE AND BREAST",4,Extreme,Major,Surgical,Private Health Insurance,,,,,true,73465.11,27273.9
Long Island,Nassau,2951001,000541,North Shore University Hospital,30 to 49,117,M,White,Not Span/Hispanic,2,Emergency,Home or Self Care,2019,INJ011,"OPEN WOUNDS OF HEAD AND NECK, INITIAL ENCOUNTER",MST022,"TENDON, MUSCLE, BURSA, AND LIGAMENT REPAIR (EXCLUDING PERINEAL)",364,"OTHER SKIN, SUBCUTANEOUS TISSUE & RELATED PROCEDURES",09,"DISEASES AND DISORDERS OF THE SKIN, SUBCUTANEOUS TISSUE AND BREAST",2,Moderate,Minor,Surgical,Medicare,,,,,true,32343.96,4677.01
Central NY,Madison,2625700,000401,Community Memorial Hospital Inc,70 or Older,138,F,White,Not Span/Hispanic,6,Emergency,Skilled Nursing Home,2019,INJ017,"SUPERFICIAL INJURY; CONTUSION, INITIAL ENCOUNTER",MST005,INCISION AND DRAINAGE OF SUBCUTANEOUS TISSUE AND FASCIA,364,"OTHER SKIN, SUBCUTANEOUS TISSUE & RELATED PROCEDURES",09,"DISEASES AND DISORDERS OF THE SKIN, SUBCUTANEOUS TISSUE AND BREAST",2,Moderate,Moderate,Surgical,Medicare,,,,,false,13248.87,7383.69
New York City,Bronx,7000008,001172,Lincoln Medical & Mental Health Center,50 to 69,104,F,Other Race,Not Span/Hispanic,12,Emergency,Home or Self Care,2019,SKN001,SKIN AND SUBCUTANEOUS TISSUE INFECTIONS,MST020,SUBCUTANEOUS TISSUE AND FASCIA EXCISION,364,"OTHER SKIN, SUBCUTANEOUS TISSUE & RELATED PROCEDURES",09,"DISEASES AND DISORDERS OF THE SKIN, SUBCUTANEOUS TISSUE AND BREAST",2,Moderate,Minor,Surgical,Medicaid,,,,,true,61167.07,36122.64
Long Island,Nassau,2951001,000541,North Shore University Hospital,30 to 49,113,M,White,Not Span/Hispanic,5,Emergency,Home or Self Care,2019,SKN001,SKIN AND SUBCUTANEOUS TISSUE INFECTIONS,ENT006,ENT DRAINAGE (EXCLUDING MYRINGOTOMY),364,"OTHER SKIN, SUBCUTANEOUS TISSUE & RELATED PROCEDURES",09,"DISEASES AND DISORDERS OF THE SKIN, SUBCUTANEOUS TISSUE AND BREAST",2,Moderate,Moderate,Surgical,Blue Cross/Blue Shield,,,,,true,67123,10960.75
Finger Lakes,Monroe,2701005,000413,Strong Memorial Hospital,50 to 69,146,M,White,Spanish/Hispanic,1,Emergency,Home or Self Care,2019,INJ012,"OPEN WOUNDS TO LIMBS, INITIAL ENCOUNTER",MST026,FINGER AND OTHER UPPER EXTREMITY AMPUTATION,364,"OTHER SKIN, SUBCUTANEOUS TISSUE & RELATED PROCEDURES",09,"DISEASES AND DISORDERS OF THE SKIN, SUBCUTANEOUS TISSUE AND BREAST",2,Moderate,Minor,Surgical,Medicaid,,,,,true,15954.95,7405.78
Long Island,Suffolk,5123000,000885,Long Island Community Hospital,50 to 69,117,F,Black/African American,Not Span/Hispanic,6,Emergency,Home w/ Home Health Services,2019,SKN001,SKIN AND SUBCUTANEOUS TISSUE INFECTIONS,MST020,SUBCUTANEOUS TISSUE AND FASCIA EXCISION,364,"OTHER SKIN, SUBCUTANEOUS TISSUE & RELATED PROCEDURES",09,"DISEASES AND DISORDERS OF THE SKIN, SUBCUTANEOUS TISSUE AND BREAST",2,Moderate,Moderate,Surgical,Private Health Insurance,Medicaid,,,,true,47139.18,11329.31