Hospital Service Area,Hospital County,Operating Certificate Number,Permanent Facility Id,Facility Name,Age Group,Zip Code - 3 digits,Gender,Race,Ethnicity,Length of Stay,Type of Admission,Patient Disposition,Discharge Year,CCS Diagnosis Code,CCS Diagnosis Description,CCS Procedure Code,CCS Procedure Description,APR DRG Code,APR DRG Description,APR MDC Code,APR MDC Description,APR Severity of Illness Code,APR Severity of Illness Description,APR Risk of Mortality,APR Medical Surgical Description,Payment Typology 1,Payment Typology 2,Payment Typology 3,Birth Weight,Abortion Edit Indicator,Emergency Department Indicator,Total Charges,Total Costs
New York City,Manhattan,7002053,001463,NYU Langone Hospitals,0 to 17,112,F,White,Unknown,3,Emergency,Home or Self Care,2019,SKN001,SKIN AND SUBCUTANEOUS TISSUE INFECTIONS,MST005,INCISION AND DRAINAGE OF SUBCUTANEOUS TISSUE AND FASCIA,364,"OTHER SKIN, SUBCUTANEOUS TISSUE & RELATED PROCEDURES",09,"DISEASES AND DISORDERS OF THE SKIN, SUBCUTANEOUS TISSUE AND BREAST",1,Minor,Minor,Surgical,Medicaid,,,,,true,43289.87,11282.97
New York City,Manhattan,7002053,001463,NYU Langone Hospitals,50 to 69,OOS,M,White,Not Span/Hispanic,4,Emergency,Home w/ Home Health Services,2019,SKN001,SKIN AND SUBCUTANEOUS TISSUE INFECTIONS,MST005,INCISION AND DRAINAGE OF SUBCUTANEOUS TISSUE AND FASCIA,364,"OTHER SKIN, SUBCUTANEOUS TISSUE & RELATED PROCEDURES",09,"DISEASES AND DISORDERS OF THE SKIN, SUBCUTANEOUS TISSUE AND BREAST",3,Major,Major,Surgical,Medicare,Blue Cross/Blue Shield,,,,true,42151.46,15287.9
New York City,Manhattan,7002053,001463,NYU Langone Hospitals,0 to 17,112,F,White,Unknown,3,Emergency,Home or Self Care,2019,SKN001,SKIN AND SUBCUTANEOUS TISSUE INFECTIONS,MST003,"SUBCUTANEOUS TISSUE, FASCIA, AND MUSCLE BIOPSY",364,"OTHER SKIN, SUBCUTANEOUS TISSUE & RELATED PROCEDURES",09,"DISEASES AND DISORDERS OF THE SKIN, SUBCUTANEOUS TISSUE AND BREAST",1,Minor,Minor,Surgical,Medicaid,,,,,true,37183.13,12690.87
New York City,Manhattan,7002053,001463,NYU Langone Hospitals,70 or Older,103,M,White,Not Span/Hispanic,1,Elective,Home or Self Care,2019,NEO070,SECONDARY MALIGNANCIES,LYM003,LYMPH NODE DISSECTION,364,"OTHER SKIN, SUBCUTANEOUS TISSUE & RELATED PROCEDURES",09,"DISEASES AND DISORDERS OF THE SKIN, SUBCUTANEOUS TISSUE AND BREAST",1,Minor,Minor,Surgical,Medicare,Medicare,,,,false,89535.15,15126.41
New York City,Manhattan,7002053,001463,NYU Langone Hospitals,50 to 69,111,M,White,Not Span/Hispanic,4,Elective,Home w/ Home Health Services,2019,END016,OTHER SPECIFIED AND UNSPECIFIED NUTRITIONAL AND METABOLIC DISORDERS,GNR001,COSMETIC PROCEDURES,364,"OTHER SKIN, SUBCUTANEOUS TISSUE & RELATED PROCEDURES",09,"DISEASES AND DISORDERS OF THE SKIN, SUBCUTANEOUS TISSUE AND BREAST",2,Moderate,Minor,Surgical,Private Health Insurance,,,,,false,118991.63,26027.24
New York City,Manhattan,7002053,001463,NYU Langone Hospitals,50 to 69,117,F,White,Not Span/Hispanic,2,Elective,Inpatient Rehabilitation Facility,2019,NEO025,SKIN CANCERS - MELANOMA,MST024,BELOW KNEE AMPUTATION,364,"OTHER SKIN, SUBCUTANEOUS TISSUE & RELATED PROCEDURES",09,"DISEASES AND DISORDERS OF THE SKIN, SUBCUTANEOUS TISSUE AND BREAST",2,Moderate,Minor,Surgical,Private Health Insurance,,,,,false,105518.27,19759
New York City,Manhattan,7002053,001463,NYU Langone Hospitals,0 to 17,112,F,White,Not Span/Hispanic,3,Emergency,Home or Self Care,2019,SKN001,SKIN AND SUBCUTANEOUS TISSUE INFECTIONS,MST005,INCISION AND DRAINAGE OF SUBCUTANEOUS TISSUE AND FASCIA,364,"OTHER SKIN, SUBCUTANEOUS TISSUE & RELATED PROCEDURES",09,"DISEASES AND DISORDERS OF THE SKIN, SUBCUTANEOUS TISSUE AND BREAST",2,Moderate,Minor,Surgical,Medicaid,,,,,true,40625.46,10961.43
New York City,Manhattan,7002053,001463,NYU Langone Hospitals,30 to 49,100,M,Other Race,Spanish/Hispanic,4,Emergency,Home or Self Care,2019,SKN001,SKIN AND SUBCUTANEOUS TISSUE INFECTIONS,MST005,INCISION AND DRAINAGE OF SUBCUTANEOUS TISSUE AND FASCIA,364,"OTHER SKIN, SUBCUTANEOUS TISSUE & RELATED PROCEDURES",09,"DISEASES AND DISORDERS OF THE SKIN, SUBCUTANEOUS TISSUE AND BREAST",1,Minor,Minor,Surgical,Blue Cross/Blue Shield,,,,,true,41907.14,16515.65
New York City,Manhattan,7002053,001463,NYU Langone Hospitals,70 or Older,112,M,White,Not Span/Hispanic,1,Elective,Home or Self Care,2019,NEO028,SKIN CANCERS - ALL OTHER TYPES,ENT010,SALIVARY GLAND EXCISION,364,"OTHER SKIN, SUBCUTANEOUS TISSUE & RELATED PROCEDURES",09,"DISEASES AND DISORDERS OF THE SKIN, SUBCUTANEOUS TISSUE AND BREAST",2,Moderate,Major,Surgical,Medicare,Blue Cross/Blue Shield,,,,false,90818.75,15524.71
New York City,Manhattan,7002053,001463,NYU Langone Hospitals,18 to 29,112,M,White,Not Span/Hispanic,1,Emergency,Home or Self Care,2019,SKN001,SKIN AND SUBCUTANEOUS TISSUE INFECTIONS,MST020,SUBCUTANEOUS TISSUE AND FASCIA EXCISION,364,"OTHER SKIN, SUBCUTANEOUS TISSUE & RELATED PROCEDURES",09,"DISEASES AND DISORDERS OF THE SKIN, SUBCUTANEOUS TISSUE AND BREAST",1,Minor,Minor,Surgical,Blue Cross/Blue Shield,,,,,true,40568.55,15300.6
New York City,Manhattan,7002053,001463,NYU Langone Hospitals,70 or Older,100,F,White,Not Span/Hispanic,20,Emergency,Skilled Nursing Home,2019,SKN001,SKIN AND SUBCUTANEOUS TISSUE INFECTIONS,CAR008,ANGIOPLASTY AND RELATED VESSEL PROCEDURES (ENDOVASCULAR; EXCLUDING CAROTID),364,"OTHER SKIN, SUBCUTANEOUS TISSUE & RELATED PROCEDURES",09,"DISEASES AND DISORDERS OF THE SKIN, SUBCUTANEOUS TISSUE AND BREAST",3,Major,Major,Surgical,Medicare,Private Health Insurance,,,,true,355259.69,96170.14
New York City,Manhattan,7002053,001463,NYU Langone Hospitals,30 to 49,112,F,White,Not Span/Hispanic,2,Emergency,Home or Self Care,2019,SKN001,SKIN AND SUBCUTANEOUS TISSUE INFECTIONS,MST005,INCISION AND DRAINAGE OF SUBCUTANEOUS TISSUE AND FASCIA,364,"OTHER SKIN, SUBCUTANEOUS TISSUE & RELATED PROCEDURES",09,"DISEASES AND DISORDERS OF THE SKIN, SUBCUTANEOUS TISSUE AND BREAST",1,Minor,Minor,Surgical,Medicaid,,,,,true,20408.27,7518.4
New York City,Manhattan,7002053,001463,NYU Langone Hospitals,70 or Older,125,M,White,Not Span/Hispanic,5,Elective,Home w/ Home Health Services,2019,NEO027,SKIN CANCERS - SQUAMOUS CELL CARCINOMA,MST018,BONE EXCISION,364,"OTHER SKIN, SUBCUTANEOUS TISSUE & RELATED PROCEDURES",09,"DISEASES AND DISORDERS OF THE SKIN, SUBCUTANEOUS TISSUE AND BREAST",1,Minor,Moderate,Surgical,Medicare,Medicare,,,,false,159008.57,31920.41
New York City,Manhattan,7002053,001463,NYU Langone Hospitals,30 to 49,114,M,Black/African American,Not Span/Hispanic,3,Emergency,Home w/ Home Health Services,2019,SKN007,OTHER SPECIFIED AND UNSPECIFIED SKIN DISORDERS,ENT006,ENT DRAINAGE (EXCLUDING MYRINGOTOMY),364,"OTHER SKIN, SUBCUTANEOUS TISSUE & RELATED PROCEDURES",09,"DISEASES AND DISORDERS OF THE SKIN, SUBCUTANEOUS TISSUE AND BREAST",2,Moderate,Moderate,Surgical,Private Health Insurance,,,,,false,71970.29,13473.49
New York City,Manhattan,7002053,001463,NYU Langone Hospitals,50 to 69,104,F,White,Not Span/Hispanic,1,Elective,Home or Self Care,2019,SKN007,OTHER SPECIFIED AND UNSPECIFIED SKIN DISORDERS,GNR001,COSMETIC PROCEDURES,364,"OTHER SKIN, SUBCUTANEOUS TISSUE & RELATED PROCEDURES",09,"DISEASES AND DISORDERS OF THE SKIN, SUBCUTANEOUS TISSUE AND BREAST",1,Minor,Minor,Surgical,Self-Pay,,,,,false,80681.83,17321.73
New York City,Manhattan,7002053,001463,NYU Langone Hospitals,30 to 49,100,M,White,Not Span/Hispanic,2,Emergency,Home or Self Care,2019,SKN001,SKIN AND SUBCUTANEOUS TISSUE INFECTIONS,MST004,INCISION AND DRAINAGE OF MUSCULOSKELETAL TISSUE AND JOINTS,364,"OTHER SKIN, SUBCUTANEOUS TISSUE & RELATED PROCEDURES",09,"DISEASES AND DISORDERS OF THE SKIN, SUBCUTANEOUS TISSUE AND BREAST",2,Moderate,Minor,Surgical,Medicaid,,,,,true,52995.23,12273.53
New York City,Manhattan,7002053,001463,NYU Langone Hospitals,30 to 49,112,M,White,Not Span/Hispanic,2,Emergency,Home or Self Care,2019,SKN001,SKIN AND SUBCUTANEOUS TISSUE INFECTIONS,MST005,INCISION AND DRAINAGE OF SUBCUTANEOUS TISSUE AND FASCIA,364,"OTHER SKIN, SUBCUTANEOUS TISSUE & RELATED PROCEDURES",09,"DISEASES AND DISORDERS OF THE SKIN, SUBCUTANEOUS TISSUE AND BREAST",2,Moderate,Minor,Surgical,Blue Cross/Blue Shield,,,,,true,38448.24,8422.07
New York City,Manhattan,7002053,001463,NYU Langone Hospitals,50 to 69,OOS,F,White,Not Span/Hispanic,8,Elective,Hospice - Medical Facility,2019,SKN003,PRESSURE ULCER OF SKIN,MST002,BONE AND JOINT BIOPSY,364,"OTHER SKIN, SUBCUTANEOUS TISSUE & RELATED PROCEDURES",09,"DISEASES AND DISORDERS OF THE SKIN, SUBCUTANEOUS TISSUE AND BREAST",3,Major,Moderate,Surgical,Medicare,Private Health Insurance,,,,false,137779.98,34348.78
New York City,Manhattan,7002053,001463,NYU Langone Hospitals,18 to 29,112,M,Black/African American,Not Span/Hispanic,5,Elective,Skilled Nursing Home,2019,SKN003,PRESSURE ULCER OF SKIN,MST018,BONE EXCISION,364,"OTHER SKIN, SUBCUTANEOUS TISSUE & RELATED PROCEDURES",09,"DISEASES AND DISORDERS OF THE SKIN, SUBCUTANEOUS TISSUE AND BREAST",3,Major,Major,Surgical,Medicare,Medicaid,,,,false,91418.4,24693.94
New York City,Manhattan,7002053,001463,NYU Langone Hospitals,30 to 49,,F,Other Race,Spanish/Hispanic,5,Elective,Home or Self Care,2019,NEO073,BENIGN NEOPLASMS,ENP004,ADRENALECTOMY,364,"OTHER SKIN, SUBCUTANEOUS TISSUE & RELATED PROCEDURES",09,"DISEASES AND DISORDERS OF THE SKIN, SUBCUTANEOUS TISSUE AND BREAST",1,Minor,Minor,Surgical,Private Health Insurance,,,,,false,143824.01,30597.01
New York City,Manhattan,7002053,001463,NYU Langone Hospitals,0 to 17,112,F,White,Not Span/Hispanic,3,Emergency,Home or Self Care,2019,SKN001,SKIN AND SUBCUTANEOUS TISSUE INFECTIONS,MST004,INCISION AND DRAINAGE OF MUSCULOSKELETAL TISSUE AND JOINTS,364,"OTHER SKIN, SUBCUTANEOUS TISSUE & RELATED PROCEDURES",09,"DISEASES AND DISORDERS OF THE SKIN, SUBCUTANEOUS TISSUE AND BREAST",2,Moderate,Minor,Surgical,Private Health Insurance,,,,,true,59050.52,13251.24
New York City,Manhattan,7002053,001463,NYU Langone Hospitals,30 to 49,112,M,White,Unknown,2,Elective,Home or Self Care,2019,SKN003,PRESSURE ULCER OF SKIN,MST019,"MUSCLE, TENDON, BURSA, AND LIGAMENT EXCISION",364,"OTHER SKIN, SUBCUTANEOUS TISSUE & RELATED PROCEDURES",09,"DISEASES AND DISORDERS OF THE SKIN, SUBCUTANEOUS TISSUE AND BREAST",2,Moderate,Moderate,Surgical,Medicaid,,,,,false,75117.42,15412.09
New York City,Manhattan,7002053,001463,NYU Langone Hospitals,30 to 49,100,M,Other Race,Unknown,1,Emergency,Home or Self Care,2019,SKN001,SKIN AND SUBCUTANEOUS TISSUE INFECTIONS,MST005,INCISION AND DRAINAGE OF SUBCUTANEOUS TISSUE AND FASCIA,364,"OTHER SKIN, SUBCUTANEOUS TISSUE & RELATED PROCEDURES",09,"DISEASES AND DISORDERS OF THE SKIN, SUBCUTANEOUS TISSUE AND BREAST",1,Minor,Minor,Surgical,Private Health Insurance,,,,,true,20426.37,5185.43
New York City,Manhattan,7002053,001463,NYU Langone Hospitals,18 to 29,104,M,Other Race,Unknown,4,Emergency,Home w/ Home Health Services,2019,SKN003,PRESSURE ULCER OF SKIN,MST018,BONE EXCISION,364,"OTHER SKIN, SUBCUTANEOUS TISSUE & RELATED PROCEDURES",09,"DISEASES AND DISORDERS OF THE SKIN, SUBCUTANEOUS TISSUE AND BREAST",3,Major,Minor,Surgical,Medicaid,,,,,true,79923.98,20902.84
New York City,Manhattan,7002053,001463,NYU Langone Hospitals,18 to 29,100,M,White,Not Span/Hispanic,1,Emergency,Home or Self Care,2019,SKN001,SKIN AND SUBCUTANEOUS TISSUE INFECTIONS,MST020,SUBCUTANEOUS TISSUE AND FASCIA EXCISION,364,"OTHER SKIN, SUBCUTANEOUS TISSUE & RELATED PROCEDURES",09,"DISEASES AND DISORDERS OF THE SKIN, SUBCUTANEOUS TISSUE AND BREAST",1,Minor,Minor,Surgical,Private Health Insurance,,,,,true,24057.57,8563.28
New York City,Manhattan,7002053,001463,NYU Langone Hospitals,70 or Older,113,M,Other Race,Spanish/Hispanic,7,Elective,Inpatient Rehabilitation Facility,2019,NEO027,SKIN CANCERS - SQUAMOUS CELL CARCINOMA,ENT013,ENT REPAIR,364,"OTHER SKIN, SUBCUTANEOUS TISSUE & RELATED PROCEDURES",09,"DISEASES AND DISORDERS OF THE SKIN, SUBCUTANEOUS TISSUE AND BREAST",2,Moderate,Major,Surgical,Medicare,Blue Cross/Blue Shield,,,,false,291640.73,58461.26
New York City,Manhattan,7002053,001463,NYU Langone Hospitals,0 to 17,112,M,White,Not Span/Hispanic,2,Emergency,Home or Self Care,2019,SKN001,SKIN AND SUBCUTANEOUS TISSUE INFECTIONS,MST005,INCISION AND DRAINAGE OF SUBCUTANEOUS TISSUE AND FASCIA,364,"OTHER SKIN, SUBCUTANEOUS TISSUE & RELATED PROCEDURES",09,"DISEASES AND DISORDERS OF THE SKIN, SUBCUTANEOUS TISSUE AND BREAST",1,Minor,Minor,Surgical,Medicaid,,,,,true,37940.66,8918.85
New York City,Manhattan,7002053,001463,NYU Langone Hospitals,70 or Older,112,M,White,Not Span/Hispanic,25,Emergency,Home w/ Home Health Services,2019,SKN001,SKIN AND SUBCUTANEOUS TISSUE INFECTIONS,EYP001,EYE PROCEDURES,364,"OTHER SKIN, SUBCUTANEOUS TISSUE & RELATED PROCEDURES",09,"DISEASES AND DISORDERS OF THE SKIN, SUBCUTANEOUS TISSUE AND BREAST",4,Extreme,Extreme,Surgical,Medicare,Blue Cross/Blue Shield,,,,true,423353.66,104866.71
New York City,Manhattan,7002053,001463,NYU Langone Hospitals,70 or Older,,F,Other Race,Unknown,6,Elective,Medicare Cert Long Term Care Hospital,2019,SKN003,PRESSURE ULCER OF SKIN,MST018,BONE EXCISION,364,"OTHER SKIN, SUBCUTANEOUS TISSUE & RELATED PROCEDURES",09,"DISEASES AND DISORDERS OF THE SKIN, SUBCUTANEOUS TISSUE AND BREAST",2,Moderate,Moderate,Surgical,Medicare,Medicare,,,,false,115196.93,30505.46
New York City,Manhattan,7002053,001463,NYU Langone Hospitals,0 to 17,112,M,Other Race,Not Span/Hispanic,2,Emergency,Home or Self Care,2019,SKN001,SKIN AND SUBCUTANEOUS TISSUE INFECTIONS,MST005,INCISION AND DRAINAGE OF SUBCUTANEOUS TISSUE AND FASCIA,364,"OTHER SKIN, SUBCUTANEOUS TISSUE & RELATED PROCEDURES",09,"DISEASES AND DISORDERS OF THE SKIN, SUBCUTANEOUS TISSUE AND BREAST",1,Minor,Minor,Surgical,Blue Cross/Blue Shield,,,,,true,45131.27,9735.84
New York City,Manhattan,7002053,001463,NYU Langone Hospitals,50 to 69,116,F,Other Race,Not Span/Hispanic,3,Elective,Skilled Nursing Home,2019,NEO073,BENIGN NEOPLASMS,MST019,"MUSCLE, TENDON, BURSA, AND LIGAMENT EXCISION",364,"OTHER SKIN, SUBCUTANEOUS TISSUE & RELATED PROCEDURES",09,"DISEASES AND DISORDERS OF THE SKIN, SUBCUTANEOUS TISSUE AND BREAST",1,Minor,Minor,Surgical,Medicare,Medicaid,,,,false,70024.77,16848.39
New York City,Manhattan,7002053,001463,NYU Langone Hospitals,50 to 69,100,M,White,Not Span/Hispanic,3,Emergency,Home w/ Home Health Services,2019,END003,DIABETES MELLITUS WITH COMPLICATION,MST020,SUBCUTANEOUS TISSUE AND FASCIA EXCISION,364,"OTHER SKIN, SUBCUTANEOUS TISSUE & RELATED PROCEDURES",09,"DISEASES AND DISORDERS OF THE SKIN, SUBCUTANEOUS TISSUE AND BREAST",3,Major,Moderate,Surgical,Private Health Insurance,,,,,true,192584.75,20285.42
New York City,Manhattan,7002053,001463,NYU Langone Hospitals,50 to 69,103,M,Other Race,Unknown,6,Emergency,Home w/ Home Health Services,2019,SKN003,PRESSURE ULCER OF SKIN,MST020,SUBCUTANEOUS TISSUE AND FASCIA EXCISION,364,"OTHER SKIN, SUBCUTANEOUS TISSUE & RELATED PROCEDURES",09,"DISEASES AND DISORDERS OF THE SKIN, SUBCUTANEOUS TISSUE AND BREAST",4,Extreme,Extreme,Surgical,Medicare,,,,,true,125201.23,39451.54
New York City,Manhattan,7002053,001463,NYU Langone Hospitals,30 to 49,100,M,White,Not Span/Hispanic,2,Emergency,Home or Self Care,2019,SKN001,SKIN AND SUBCUTANEOUS TISSUE INFECTIONS,ENT006,ENT DRAINAGE (EXCLUDING MYRINGOTOMY),364,"OTHER SKIN, SUBCUTANEOUS TISSUE & RELATED PROCEDURES",09,"DISEASES AND DISORDERS OF THE SKIN, SUBCUTANEOUS TISSUE AND BREAST",1,Minor,Minor,Surgical,Private Health Insurance,,,,,true,30005.6,8359.11
New York City,Manhattan,7002053,001463,NYU Langone Hospitals,30 to 49,114,M,Other Race,Not Span/Hispanic,1,Emergency,Home w/ Home Health Services,2019,SKN001,SKIN AND SUBCUTANEOUS TISSUE INFECTIONS,MST005,INCISION AND DRAINAGE OF SUBCUTANEOUS TISSUE AND FASCIA,364,"OTHER SKIN, SUBCUTANEOUS TISSUE & RELATED PROCEDURES",09,"DISEASES AND DISORDERS OF THE SKIN, SUBCUTANEOUS TISSUE AND BREAST",1,Minor,Minor,Surgical,Private Health Insurance,,,,,true,31232.29,10912.34
New York City,Manhattan,7002053,001463,NYU Langone Hospitals,0 to 17,112,M,White,Not Span/Hispanic,3,Emergency,Home or Self Care,2019,SKN001,SKIN AND SUBCUTANEOUS TISSUE INFECTIONS,MST005,INCISION AND DRAINAGE OF SUBCUTANEOUS TISSUE AND FASCIA,364,"OTHER SKIN, SUBCUTANEOUS TISSUE & RELATED PROCEDURES",09,"DISEASES AND DISORDERS OF THE SKIN, SUBCUTANEOUS TISSUE AND BREAST",1,Minor,Minor,Surgical,Medicaid,,,,,true,48200.95,11832.58
New York City,Manhattan,7002053,001463,NYU Langone Hospitals,50 to 69,114,M,White,Not Span/Hispanic,8,Elective,Skilled Nursing Home,2019,SKN003,PRESSURE ULCER OF SKIN,MST002,BONE AND JOINT BIOPSY,364,"OTHER SKIN, SUBCUTANEOUS TISSUE & RELATED PROCEDURES",09,"DISEASES AND DISORDERS OF THE SKIN, SUBCUTANEOUS TISSUE AND BREAST",3,Major,Moderate,Surgical,Blue Cross/Blue Shield,Medicare,,,,false,174032.11,40274.93
New York City,Manhattan,7002053,001463,NYU Langone Hospitals,50 to 69,112,M,White,Not Span/Hispanic,7,Emergency,Home w/ Home Health Services,2019,END003,DIABETES MELLITUS WITH COMPLICATION,CAR008,ANGIOPLASTY AND RELATED VESSEL PROCEDURES (ENDOVASCULAR; EXCLUDING CAROTID),364,"OTHER SKIN, SUBCUTANEOUS TISSUE & RELATED PROCEDURES",09,"DISEASES AND DISORDERS OF THE SKIN, SUBCUTANEOUS TISSUE AND BREAST",3,Major,Major,Surgical,Private Health Insurance,,,,,true,281196.98,52655.23
New York City,Manhattan,7002053,001463,NYU Langone Hospitals,50 to 69,117,F,White,Not Span/Hispanic,8,Elective,Skilled Nursing Home,2019,SKN003,PRESSURE ULCER OF SKIN,MST018,BONE EXCISION,364,"OTHER SKIN, SUBCUTANEOUS TISSUE & RELATED PROCEDURES",09,"DISEASES AND DISORDERS OF THE SKIN, SUBCUTANEOUS TISSUE AND BREAST",3,Major,Minor,Surgical,Blue Cross/Blue Shield,,,,,false,150980.78,37158.56
New York City,Manhattan,7002053,001463,NYU Langone Hospitals,0 to 17,112,M,White,Not Span/Hispanic,1,Emergency,Home or Self Care,2019,SKN001,SKIN AND SUBCUTANEOUS TISSUE INFECTIONS,MST004,INCISION AND DRAINAGE OF MUSCULOSKELETAL TISSUE AND JOINTS,364,"OTHER SKIN, SUBCUTANEOUS TISSUE & RELATED PROCEDURES",09,"DISEASES AND DISORDERS OF THE SKIN, SUBCUTANEOUS TISSUE AND BREAST",1,Minor,Minor,Surgical,Medicaid,,,,,true,15562.59,4081.82
New York City,Manhattan,7002053,001463,NYU Langone Hospitals,18 to 29,114,M,Black/African American,Not Span/Hispanic,8,Emergency,Home w/ Home Health Services,2019,SKN001,SKIN AND SUBCUTANEOUS TISSUE INFECTIONS,MST019,"MUSCLE, TENDON, BURSA, AND LIGAMENT EXCISION",364,"OTHER SKIN, SUBCUTANEOUS TISSUE & RELATED PROCEDURES",09,"DISEASES AND DISORDERS OF THE SKIN, SUBCUTANEOUS TISSUE AND BREAST",2,Moderate,Minor,Surgical,Medicaid,,,,,true,125768.39,30926.79
New York City,Manhattan,7002053,001463,NYU Langone Hospitals,50 to 69,,M,Other Race,Spanish/Hispanic,1,Emergency,Home or Self Care,2019,INJ011,"OPEN WOUNDS OF HEAD AND NECK, INITIAL ENCOUNTER",MST028,"SUBCUTANEOUS TISSUE AND FASCIA PROCEDURES, NEC",364,"OTHER SKIN, SUBCUTANEOUS TISSUE & RELATED PROCEDURES",09,"DISEASES AND DISORDERS OF THE SKIN, SUBCUTANEOUS TISSUE AND BREAST",1,Minor,Minor,Surgical,Self-Pay,,,,,true,18146.87,5201.4
New York City,Manhattan,7002053,001463,NYU Langone Hospitals,30 to 49,112,M,White,Unknown,8,Elective,Home w/ Home Health Services,2019,NEO073,BENIGN NEOPLASMS,CNS007,CNS EXCISION PROCEDURES,364,"OTHER SKIN, SUBCUTANEOUS TISSUE & RELATED PROCEDURES",09,"DISEASES AND DISORDERS OF THE SKIN, SUBCUTANEOUS TISSUE AND BREAST",2,Moderate,Minor,Surgical,Blue Cross/Blue Shield,,,,,false,260848.99,55706.19
New York City,Manhattan,7002053,001463,NYU Langone Hospitals,70 or Older,100,F,Other Race,Not Span/Hispanic,1,Emergency,Home or Self Care,2019,INJ012,"OPEN WOUNDS TO LIMBS, INITIAL ENCOUNTER",MST022,"TENDON, MUSCLE, BURSA, AND LIGAMENT REPAIR (EXCLUDING PERINEAL)",364,"OTHER SKIN, SUBCUTANEOUS TISSUE & RELATED PROCEDURES",09,"DISEASES AND DISORDERS OF THE SKIN, SUBCUTANEOUS TISSUE AND BREAST",1,Minor,Minor,Surgical,Private Health Insurance,,,,,true,47033.26,13388.03
New York City,Manhattan,7002053,001463,NYU Langone Hospitals,0 to 17,112,M,Other Race,Unknown,4,Emergency,Home or Self Care,2019,SKN001,SKIN AND SUBCUTANEOUS TISSUE INFECTIONS,MST005,INCISION AND DRAINAGE OF SUBCUTANEOUS TISSUE AND FASCIA,364,"OTHER SKIN, SUBCUTANEOUS TISSUE & RELATED PROCEDURES",09,"DISEASES AND DISORDERS OF THE SKIN, SUBCUTANEOUS TISSUE AND BREAST",1,Minor,Minor,Surgical,Private Health Insurance,,,,,true,61248.08,15347.73
New York City,Manhattan,7002053,001463,NYU Langone Hospitals,30 to 49,113,M,Other Race,Not Span/Hispanic,5,Emergency,Home or Self Care,2019,SKN001,SKIN AND SUBCUTANEOUS TISSUE INFECTIONS,MST020,SUBCUTANEOUS TISSUE AND FASCIA EXCISION,364,"OTHER SKIN, SUBCUTANEOUS TISSUE & RELATED PROCEDURES",09,"DISEASES AND DISORDERS OF THE SKIN, SUBCUTANEOUS TISSUE AND BREAST",3,Major,Moderate,Surgical,Medicare,Medicaid,,,,false,128820.82,26435.69
New York City,Manhattan,7002053,001463,NYU Langone Hospitals,30 to 49,112,F,Black/African American,Not Span/Hispanic,1,Emergency,Home or Self Care,2019,SKN001,SKIN AND SUBCUTANEOUS TISSUE INFECTIONS,MST005,INCISION AND DRAINAGE OF SUBCUTANEOUS TISSUE AND FASCIA,364,"OTHER SKIN, SUBCUTANEOUS TISSUE & RELATED PROCEDURES",09,"DISEASES AND DISORDERS OF THE SKIN, SUBCUTANEOUS TISSUE AND BREAST",2,Moderate,Moderate,Surgical,Medicare,Medicaid,,,,true,17015.96,4806.67
New York City,Manhattan,7002053,001463,NYU Langone Hospitals,70 or Older,100,F,White,Not Span/Hispanic,7,Emergency,Skilled Nursing Home,2019,INJ017,"SUPERFICIAL INJURY; CONTUSION, INITIAL ENCOUNTER",GNR005,CONTROL OF BLEEDING (NON-ENDOSCOPIC),364,"OTHER SKIN, SUBCUTANEOUS TISSUE & RELATED PROCEDURES",09,"DISEASES AND DISORDERS OF THE SKIN, SUBCUTANEOUS TISSUE AND BREAST",4,Extreme,Extreme,Surgical,Medicare,,,,,true,171958.14,34840.75
New York City,Manhattan,7002053,001463,NYU Langone Hospitals,30 to 49,112,M,White,Not Span/Hispanic,6,Emergency,Home or Self Care,2019,SKN001,SKIN AND SUBCUTANEOUS TISSUE INFECTIONS,MST020,SUBCUTANEOUS TISSUE AND FASCIA EXCISION,364,"OTHER SKIN, SUBCUTANEOUS TISSUE & RELATED PROCEDURES",09,"DISEASES AND DISORDERS OF THE SKIN, SUBCUTANEOUS TISSUE AND BREAST",3,Major,Minor,Surgical,Medicaid,,,,,true,145980.52,31993.05
New York City,Manhattan,7002053,001463,NYU Langone Hospitals,30 to 49,100,F,Other Race,Spanish/Hispanic,4,Emergency,Home w/ Home Health Services,2019,END003,DIABETES MELLITUS WITH COMPLICATION,MST018,BONE EXCISION,364,"OTHER SKIN, SUBCUTANEOUS TISSUE & RELATED PROCEDURES",09,"DISEASES AND DISORDERS OF THE SKIN, SUBCUTANEOUS TISSUE AND BREAST",2,Moderate,Minor,Surgical,Medicaid,,,,,true,92126.01,21421.46
New York City,Manhattan,7002053,001463,NYU Langone Hospitals,50 to 69,100,M,White,Not Span/Hispanic,2,Emergency,Home w/ Home Health Services,2019,SKN001,SKIN AND SUBCUTANEOUS TISSUE INFECTIONS,MST005,INCISION AND DRAINAGE OF SUBCUTANEOUS TISSUE AND FASCIA,364,"OTHER SKIN, SUBCUTANEOUS TISSUE & RELATED PROCEDURES",09,"DISEASES AND DISORDERS OF THE SKIN, SUBCUTANEOUS TISSUE AND BREAST",2,Moderate,Moderate,Surgical,Medicare,,,,,true,53022.2,12578.16
