Hospital Service Area,Hospital County,Operating Certificate Number,Permanent Facility Id,Facility Name,Age Group,Zip Code - 3 digits,Gender,Race,Ethnicity,Length of Stay,Type of Admission,Patient Disposition,Discharge Year,CCS Diagnosis Code,CCS Diagnosis Description,CCS Procedure Code,CCS Procedure Description,APR DRG Code,APR DRG Description,APR MDC Code,APR MDC Description,APR Severity of Illness Code,APR Severity of Illness Description,APR Risk of Mortality,APR Medical Surgical Description,Payment Typology 1,Payment Typology 2,Payment Typology 3,Birth Weight,Abortion Edit Indicator,Emergency Department Indicator,Total Charges,Total Costs
Long Island,Nassau,2908000,000511,NYU Langone Hospital-Long Island,0 to 17,115,M,Black/African American,Not Span/Hispanic,1,Trauma,Court/Law Enforcement,2019,INJ012,"OPEN WOUNDS TO LIMBS, INITIAL ENCOUNTER",MST022,"TENDON, MUSCLE, BURSA, AND LIGAMENT REPAIR (EXCLUDING PERINEAL)",364,"OTHER SKIN, SUBCUTANEOUS TISSUE & RELATED PROCEDURES",09,"DISEASES AND DISORDERS OF THE SKIN, SUBCUTANEOUS TISSUE AND BREAST",1,Minor,Minor,Surgical,Medicaid,,,,,true,40272.61,6081.62
Long Island,Nassau,2908000,000511,NYU Langone Hospital-Long Island,18 to 29,,M,Black/African American,Not Span/Hispanic,1,Trauma,Home or Self Care,2019,INJ012,"OPEN WOUNDS TO LIMBS, INITIAL ENCOUNTER",MST028,"SUBCUTANEOUS TISSUE AND FASCIA PROCEDURES, NEC",364,"OTHER SKIN, SUBCUTANEOUS TISSUE & RELATED PROCEDURES",09,"DISEASES AND DISORDERS OF THE SKIN, SUBCUTANEOUS TISSUE AND BREAST",1,Minor,Minor,Surgical,Blue Cross/Blue Shield,,,,,true,30583.61,4288.11
Long Island,Nassau,2908000,000511,NYU Langone Hospital-Long Island,50 to 69,115,F,Black/African American,Not Span/Hispanic,9,Emergency,Skilled Nursing Home,2019,SKN001,SKIN AND SUBCUTANEOUS TISSUE INFECTIONS,MST020,SUBCUTANEOUS TISSUE AND FASCIA EXCISION,364,"OTHER SKIN, SUBCUTANEOUS TISSUE & RELATED PROCEDURES",09,"DISEASES AND DISORDERS OF THE SKIN, SUBCUTANEOUS TISSUE AND BREAST",3,Major,Moderate,Surgical,Medicare,Medicare,Medicaid,,,true,159391.34,28277.95
Long Island,Nassau,2908000,000511,NYU Langone Hospital-Long Island,50 to 69,115,M,Black/African American,Not Span/Hispanic,15,Emergency,Home or Self Care,2019,SKN001,SKIN AND SUBCUTANEOUS TISSUE INFECTIONS,MST020,SUBCUTANEOUS TISSUE AND FASCIA EXCISION,364,"OTHER SKIN, SUBCUTANEOUS TISSUE & RELATED PROCEDURES",09,"DISEASES AND DISORDERS OF THE SKIN, SUBCUTANEOUS TISSUE AND BREAST",2,Moderate,Minor,Surgical,Medicaid,Medicaid,,,,true,121605.7,28960.31
Long Island,Nassau,2908000,000511,NYU Langone Hospital-Long Island,50 to 69,115,M,Other Race,Spanish/Hispanic,13,Emergency,Skilled Nursing Home,2019,END003,DIABETES MELLITUS WITH COMPLICATION,MST020,SUBCUTANEOUS TISSUE AND FASCIA EXCISION,364,"OTHER SKIN, SUBCUTANEOUS TISSUE & RELATED PROCEDURES",09,"DISEASES AND DISORDERS OF THE SKIN, SUBCUTANEOUS TISSUE AND BREAST",2,Moderate,Moderate,Surgical,Private Health Insurance,,,,,true,237491.29,45880.82
Long Island,Nassau,2908000,000511,NYU Langone Hospital-Long Island,50 to 69,117,F,White,Not Span/Hispanic,4,Urgent,Home or Self Care,2019,SKN001,SKIN AND SUBCUTANEOUS TISSUE INFECTIONS,MST005,INCISION AND DRAINAGE OF SUBCUTANEOUS TISSUE AND FASCIA,364,"OTHER SKIN, SUBCUTANEOUS TISSUE & RELATED PROCEDURES",09,"DISEASES AND DISORDERS OF THE SKIN, SUBCUTANEOUS TISSUE AND BREAST",2,Moderate,Moderate,Surgical,Medicare,Medicare,Private Health Insurance,,,true,106797.24,19581.71
Long Island,Nassau,2908000,000511,NYU Langone Hospital-Long Island,50 to 69,112,F,Black/African American,Not Span/Hispanic,8,Emergency,Home w/ Home Health Services,2019,SKN001,SKIN AND SUBCUTANEOUS TISSUE INFECTIONS,MST005,INCISION AND DRAINAGE OF SUBCUTANEOUS TISSUE AND FASCIA,364,"OTHER SKIN, SUBCUTANEOUS TISSUE & RELATED PROCEDURES",09,"DISEASES AND DISORDERS OF THE SKIN, SUBCUTANEOUS TISSUE AND BREAST",2,Moderate,Moderate,Surgical,Medicaid,,,,,true,78666.22,16385.77
Long Island,Nassau,2908000,000511,NYU Langone Hospital-Long Island,50 to 69,110,M,Other Race,Not Span/Hispanic,9,Emergency,Home w/ Home Health Services,2019,INJ012,"OPEN WOUNDS TO LIMBS, INITIAL ENCOUNTER",MST005,INCISION AND DRAINAGE OF SUBCUTANEOUS TISSUE AND FASCIA,364,"OTHER SKIN, SUBCUTANEOUS TISSUE & RELATED PROCEDURES",09,"DISEASES AND DISORDERS OF THE SKIN, SUBCUTANEOUS TISSUE AND BREAST",2,Moderate,Minor,Surgical,Blue Cross/Blue Shield,Medicare,,,,true,114637.86,19911.71
Long Island,Nassau,2908000,000511,NYU Langone Hospital-Long Island,30 to 49,114,F,White,Not Span/Hispanic,1,Emergency,Home or Self Care,2019,SKN001,SKIN AND SUBCUTANEOUS TISSUE INFECTIONS,MST005,INCISION AND DRAINAGE OF SUBCUTANEOUS TISSUE AND FASCIA,364,"OTHER SKIN, SUBCUTANEOUS TISSUE & RELATED PROCEDURES",09,"DISEASES AND DISORDERS OF THE SKIN, SUBCUTANEOUS TISSUE AND BREAST",1,Minor,Minor,Surgical,Medicaid,Medicaid,,,,true,36268.43,4403.78
Long Island,Nassau,2908000,000511,NYU Langone Hospital-Long Island,30 to 49,115,M,White,Not Span/Hispanic,2,Emergency,Home or Self Care,2019,SKN001,SKIN AND SUBCUTANEOUS TISSUE INFECTIONS,MST005,INCISION AND DRAINAGE OF SUBCUTANEOUS TISSUE AND FASCIA,364,"OTHER SKIN, SUBCUTANEOUS TISSUE & RELATED PROCEDURES",09,"DISEASES AND DISORDERS OF THE SKIN, SUBCUTANEOUS TISSUE AND BREAST",1,Minor,Minor,Surgical,Private Health Insurance,,,,,true,52272.42,8186.74
Long Island,Nassau,2908000,000511,NYU Langone Hospital-Long Island,18 to 29,115,M,White,Spanish/Hispanic,3,Emergency,Home or Self Care,2019,SKN001,SKIN AND SUBCUTANEOUS TISSUE INFECTIONS,MST005,INCISION AND DRAINAGE OF SUBCUTANEOUS TISSUE AND FASCIA,364,"OTHER SKIN, SUBCUTANEOUS TISSUE & RELATED PROCEDURES",09,"DISEASES AND DISORDERS OF THE SKIN, SUBCUTANEOUS TISSUE AND BREAST",1,Minor,Minor,Surgical,Medicaid,,,,,true,57368.11,10362.75
Long Island,Nassau,2908000,000511,NYU Langone Hospital-Long Island,18 to 29,,M,Other Race,Spanish/Hispanic,1,Emergency,Home or Self Care,2019,INJ012,"OPEN WOUNDS TO LIMBS, INITIAL ENCOUNTER",MST020,SUBCUTANEOUS TISSUE AND FASCIA EXCISION,364,"OTHER SKIN, SUBCUTANEOUS TISSUE & RELATED PROCEDURES",09,"DISEASES AND DISORDERS OF THE SKIN, SUBCUTANEOUS TISSUE AND BREAST",1,Minor,Minor,Surgical,Private Health Insurance,,,,,true,48970.54,7306.6
Long Island,Nassau,2908000,000511,NYU Langone Hospital-Long Island,70 or Older,117,M,White,Not Span/Hispanic,17,Emergency,Home w/ Home Health Services,2019,SKN003,PRESSURE ULCER OF SKIN,MST018,BONE EXCISION,364,"OTHER SKIN, SUBCUTANEOUS TISSUE & RELATED PROCEDURES",09,"DISEASES AND DISORDERS OF THE SKIN, SUBCUTANEOUS TISSUE AND BREAST",3,Major,Major,Surgical,Medicare,Medicare,Private Health Insurance,,,true,154588.82,35307.56
Long Island,Nassau,2908000,000511,NYU Langone Hospital-Long Island,50 to 69,115,M,White,Unknown,3,Urgent,Skilled Nursing Home,2019,SKN003,PRESSURE ULCER OF SKIN,MST030,"MUSCULOSKELETAL PROCEDURES, NEC",364,"OTHER SKIN, SUBCUTANEOUS TISSUE & RELATED PROCEDURES",09,"DISEASES AND DISORDERS OF THE SKIN, SUBCUTANEOUS TISSUE AND BREAST",2,Moderate,Moderate,Surgical,Medicare,Medicare,Private Health Insurance,,,false,62371.12,16772.35
Long Island,Nassau,2908000,000511,NYU Langone Hospital-Long Island,70 or Older,115,M,White,Not Span/Hispanic,12,Emergency,Home w/ Home Health Services,2019,SKN001,SKIN AND SUBCUTANEOUS TISSUE INFECTIONS,MST004,INCISION AND DRAINAGE OF MUSCULOSKELETAL TISSUE AND JOINTS,364,"OTHER SKIN, SUBCUTANEOUS TISSUE & RELATED PROCEDURES",09,"DISEASES AND DISORDERS OF THE SKIN, SUBCUTANEOUS TISSUE AND BREAST",3,Major,Moderate,Surgical,Medicare,Medicare,Blue Cross/Blue Shield,,,true,206054.7,36509.55
Long Island,Nassau,2908000,000511,NYU Langone Hospital-Long Island,30 to 49,118,M,White,Not Span/Hispanic,5,Emergency,Home w/ Home Health Services,2019,SKN001,SKIN AND SUBCUTANEOUS TISSUE INFECTIONS,MST005,INCISION AND DRAINAGE OF SUBCUTANEOUS TISSUE AND FASCIA,364,"OTHER SKIN, SUBCUTANEOUS TISSUE & RELATED PROCEDURES",09,"DISEASES AND DISORDERS OF THE SKIN, SUBCUTANEOUS TISSUE AND BREAST",2,Moderate,Minor,Surgical,Private Health Insurance,,,,,true,42867.01,9951.41
Long Island,Nassau,2908000,000511,NYU Langone Hospital-Long Island,0 to 17,115,M,White,Not Span/Hispanic,1,Trauma,Home or Self Care,2019,INJ013,"OPEN WOUNDS OF TRUNK, INITIAL ENCOUNTER",MST028,"SUBCUTANEOUS TISSUE AND FASCIA PROCEDURES, NEC",364,"OTHER SKIN, SUBCUTANEOUS TISSUE & RELATED PROCEDURES",09,"DISEASES AND DISORDERS OF THE SKIN, SUBCUTANEOUS TISSUE AND BREAST",1,Minor,Minor,Surgical,Blue Cross/Blue Shield,,,,,true,32244.12,4335.27
Long Island,Nassau,2908000,000511,NYU Langone Hospital-Long Island,50 to 69,114,M,White,Not Span/Hispanic,4,Urgent,Home w/ Home Health Services,2019,SKN003,PRESSURE ULCER OF SKIN,MST018,BONE EXCISION,364,"OTHER SKIN, SUBCUTANEOUS TISSUE & RELATED PROCEDURES",09,"DISEASES AND DISORDERS OF THE SKIN, SUBCUTANEOUS TISSUE AND BREAST",3,Major,Minor,Surgical,Blue Cross/Blue Shield,Medicare,,,,false,74929.57,16941.54
Long Island,Nassau,2908000,000511,NYU Langone Hospital-Long Island,70 or Older,117,F,White,Not Span/Hispanic,15,Emergency,Expired,2019,INJ017,"SUPERFICIAL INJURY; CONTUSION, INITIAL ENCOUNTER",MST005,INCISION AND DRAINAGE OF SUBCUTANEOUS TISSUE AND FASCIA,364,"OTHER SKIN, SUBCUTANEOUS TISSUE & RELATED PROCEDURES",09,"DISEASES AND DISORDERS OF THE SKIN, SUBCUTANEOUS TISSUE AND BREAST",4,Extreme,Extreme,Surgical,Medicare,Medicare,Self-Pay,,,true,360050.05,60385.39
Long Island,Nassau,2908000,000511,NYU Langone Hospital-Long Island,50 to 69,115,M,White,Not Span/Hispanic,2,Emergency,Home w/ Home Health Services,2019,SKN001,SKIN AND SUBCUTANEOUS TISSUE INFECTIONS,MST005,INCISION AND DRAINAGE OF SUBCUTANEOUS TISSUE AND FASCIA,364,"OTHER SKIN, SUBCUTANEOUS TISSUE & RELATED PROCEDURES",09,"DISEASES AND DISORDERS OF THE SKIN, SUBCUTANEOUS TISSUE AND BREAST",2,Moderate,Minor,Surgical,Medicare,Medicare,Blue Cross/Blue Shield,,,true,37256.6,5776.97
Long Island,Nassau,2908000,000511,NYU Langone Hospital-Long Island,18 to 29,115,M,Black/African American,Not Span/Hispanic,2,Trauma,Home or Self Care,2019,INJ011,"OPEN WOUNDS OF HEAD AND NECK, INITIAL ENCOUNTER",MST028,"SUBCUTANEOUS TISSUE AND FASCIA PROCEDURES, NEC",364,"OTHER SKIN, SUBCUTANEOUS TISSUE & RELATED PROCEDURES",09,"DISEASES AND DISORDERS OF THE SKIN, SUBCUTANEOUS TISSUE AND BREAST",4,Extreme,Extreme,Surgical,Medicaid,,,,,true,91032.03,12574.01
Long Island,Nassau,2908000,000511,NYU Langone Hospital-Long Island,50 to 69,115,M,White,Not Span/Hispanic,4,Emergency,Home w/ Home Health Services,2019,SKN001,SKIN AND SUBCUTANEOUS TISSUE INFECTIONS,MST005,INCISION AND DRAINAGE OF SUBCUTANEOUS TISSUE AND FASCIA,364,"OTHER SKIN, SUBCUTANEOUS TISSUE & RELATED PROCEDURES",09,"DISEASES AND DISORDERS OF THE SKIN, SUBCUTANEOUS TISSUE AND BREAST",1,Minor,Minor,Surgical,Medicare,Medicare,,,,true,50673.04,9433.23
Long Island,Nassau,2908000,000511,NYU Langone Hospital-Long Island,70 or Older,115,F,Black/African American,Not Span/Hispanic,3,Elective,Skilled Nursing Home,2019,SKN004,NON-PRESSURE ULCER OF SKIN,CAR014,PERIPHERAL ARTERIAL BYPASS PROCEDURES,364,"OTHER SKIN, SUBCUTANEOUS TISSUE & RELATED PROCEDURES",09,"DISEASES AND DISORDERS OF THE SKIN, SUBCUTANEOUS TISSUE AND BREAST",2,Moderate,Moderate,Surgical,Medicare,Medicare,,,,false,170315.87,27540.3
Long Island,Nassau,2908000,000511,NYU Langone Hospital-Long Island,70 or Older,115,M,White,Not Span/Hispanic,3,Emergency,Home w/ Home Health Services,2019,SKN001,SKIN AND SUBCUTANEOUS TISSUE INFECTIONS,MST005,INCISION AND DRAINAGE OF SUBCUTANEOUS TISSUE AND FASCIA,364,"OTHER SKIN, SUBCUTANEOUS TISSUE & RELATED PROCEDURES",09,"DISEASES AND DISORDERS OF THE SKIN, SUBCUTANEOUS TISSUE AND BREAST",3,Major,Major,Surgical,Medicare,Medicare,Private Health Insurance,,,true,47772.04,7773.55
Long Island,Nassau,2908000,000511,NYU Langone Hospital-Long Island,50 to 69,117,F,White,Not Span/Hispanic,4,Emergency,Home w/ Home Health Services,2019,SKN001,SKIN AND SUBCUTANEOUS TISSUE INFECTIONS,MST005,INCISION AND DRAINAGE OF SUBCUTANEOUS TISSUE AND FASCIA,364,"OTHER SKIN, SUBCUTANEOUS TISSUE & RELATED PROCEDURES",09,"DISEASES AND DISORDERS OF THE SKIN, SUBCUTANEOUS TISSUE AND BREAST",2,Moderate,Minor,Surgical,Blue Cross/Blue Shield,,,,,true,66979.21,10887.84
Long Island,Nassau,2908000,000511,NYU Langone Hospital-Long Island,70 or Older,115,F,White,Spanish/Hispanic,2,Emergency,Home w/ Home Health Services,2019,SKN001,SKIN AND SUBCUTANEOUS TISSUE INFECTIONS,MST005,INCISION AND DRAINAGE OF SUBCUTANEOUS TISSUE AND FASCIA,364,"OTHER SKIN, SUBCUTANEOUS TISSUE & RELATED PROCEDURES",09,"DISEASES AND DISORDERS OF THE SKIN, SUBCUTANEOUS TISSUE AND BREAST",1,Minor,Moderate,Surgical,Medicaid,Medicaid,,,,true,42553.37,6110.68
Long Island,Nassau,2908000,000511,NYU Langone Hospital-Long Island,0 to 17,OOS,M,Black/African American,Not Span/Hispanic,1,Emergency,Home or Self Care,2019,SKN001,SKIN AND SUBCUTANEOUS TISSUE INFECTIONS,MST005,INCISION AND DRAINAGE OF SUBCUTANEOUS TISSUE AND FASCIA,364,"OTHER SKIN, SUBCUTANEOUS TISSUE & RELATED PROCEDURES",09,"DISEASES AND DISORDERS OF THE SKIN, SUBCUTANEOUS TISSUE AND BREAST",2,Moderate,Minor,Surgical,Medicaid,,,,,true,22318.21,3687.98
Long Island,Nassau,2908000,000511,NYU Langone Hospital-Long Island,70 or Older,115,M,Black/African American,Not Span/Hispanic,9,Emergency,Skilled Nursing Home,2019,SKN003,PRESSURE ULCER OF SKIN,MST019,"MUSCLE, TENDON, BURSA, AND LIGAMENT EXCISION",364,"OTHER SKIN, SUBCUTANEOUS TISSUE & RELATED PROCEDURES",09,"DISEASES AND DISORDERS OF THE SKIN, SUBCUTANEOUS TISSUE AND BREAST",3,Major,Major,Surgical,Medicare,Medicare,Blue Cross/Blue Shield,,,true,117715.16,22725.18
Long Island,Nassau,2908000,000511,NYU Langone Hospital-Long Island,50 to 69,110,F,Black/African American,Not Span/Hispanic,28,Emergency,Skilled Nursing Home,2019,SKN003,PRESSURE ULCER OF SKIN,MST020,SUBCUTANEOUS TISSUE AND FASCIA EXCISION,364,"OTHER SKIN, SUBCUTANEOUS TISSUE & RELATED PROCEDURES",09,"DISEASES AND DISORDERS OF THE SKIN, SUBCUTANEOUS TISSUE AND BREAST",3,Major,Major,Surgical,Medicare,Medicare,,,,true,450253.27,78529.92
Long Island,Nassau,2908000,000511,NYU Langone Hospital-Long Island,18 to 29,110,F,Other Race,Not Span/Hispanic,2,Emergency,Home or Self Care,2019,SKN001,SKIN AND SUBCUTANEOUS TISSUE INFECTIONS,MST005,INCISION AND DRAINAGE OF SUBCUTANEOUS TISSUE AND FASCIA,364,"OTHER SKIN, SUBCUTANEOUS TISSUE & RELATED PROCEDURES",09,"DISEASES AND DISORDERS OF THE SKIN, SUBCUTANEOUS TISSUE AND BREAST",1,Minor,Minor,Surgical,Medicaid,Medicaid,,,,true,22845.73,4590.85
Long Island,Nassau,2908000,000511,NYU Langone Hospital-Long Island,70 or Older,115,M,White,Not Span/Hispanic,24,Emergency,Skilled Nursing Home,2019,SKN003,PRESSURE ULCER OF SKIN,MST019,"MUSCLE, TENDON, BURSA, AND LIGAMENT EXCISION",364,"OTHER SKIN, SUBCUTANEOUS TISSUE & RELATED PROCEDURES",09,"DISEASES AND DISORDERS OF THE SKIN, SUBCUTANEOUS TISSUE AND BREAST",4,Extreme,Extreme,Surgical,Medicare,Medicare,Medicaid,,,true,372527.58,69218.92
Long Island,Nassau,2908000,000511,NYU Langone Hospital-Long Island,0 to 17,115,F,White,Spanish/Hispanic,2,Emergency,Home or Self Care,2019,INJ011,"OPEN WOUNDS OF HEAD AND NECK, INITIAL ENCOUNTER",MST005,INCISION AND DRAINAGE OF SUBCUTANEOUS TISSUE AND FASCIA,364,"OTHER SKIN, SUBCUTANEOUS TISSUE & RELATED PROCEDURES",09,"DISEASES AND DISORDERS OF THE SKIN, SUBCUTANEOUS TISSUE AND BREAST",1,Minor,Minor,Surgical,Blue Cross/Blue Shield,,,,,true,20624.74,4427.58
Long Island,Nassau,2908000,000511,NYU Langone Hospital-Long Island,18 to 29,117,M,Other Race,Not Span/Hispanic,5,Emergency,Home or Self Care,2019,SKN001,SKIN AND SUBCUTANEOUS TISSUE INFECTIONS,MST005,INCISION AND DRAINAGE OF SUBCUTANEOUS TISSUE AND FASCIA,364,"OTHER SKIN, SUBCUTANEOUS TISSUE & RELATED PROCEDURES",09,"DISEASES AND DISORDERS OF THE SKIN, SUBCUTANEOUS TISSUE AND BREAST",2,Moderate,Minor,Surgical,Medicaid,Medicaid,,,,true,53379.82,11197.78
Long Island,Nassau,2908000,000511,NYU Langone Hospital-Long Island,50 to 69,115,F,White,Spanish/Hispanic,7,Emergency,Home w/ Home Health Services,2019,SKN003,PRESSURE ULCER OF SKIN,MST019,"MUSCLE, TENDON, BURSA, AND LIGAMENT EXCISION",364,"OTHER SKIN, SUBCUTANEOUS TISSUE & RELATED PROCEDURES",09,"DISEASES AND DISORDERS OF THE SKIN, SUBCUTANEOUS TISSUE AND BREAST",3,Major,Major,Surgical,Medicare,Medicare,Private Health Insurance,,,true,105479.76,21936.34
Long Island,Nassau,2908000,000511,NYU Langone Hospital-Long Island,18 to 29,117,F,White,Not Span/Hispanic,1,Emergency,Home or Self Care,2019,SKN001,SKIN AND SUBCUTANEOUS TISSUE INFECTIONS,MST005,INCISION AND DRAINAGE OF SUBCUTANEOUS TISSUE AND FASCIA,364,"OTHER SKIN, SUBCUTANEOUS TISSUE & RELATED PROCEDURES",09,"DISEASES AND DISORDERS OF THE SKIN, SUBCUTANEOUS TISSUE AND BREAST",1,Minor,Minor,Surgical,Blue Cross/Blue Shield,Private Health Insurance,,,,true,42879.49,5884.48
Long Island,Nassau,2908000,000511,NYU Langone Hospital-Long Island,50 to 69,115,F,Black/African American,Not Span/Hispanic,4,Emergency,Home w/ Home Health Services,2019,SKN001,SKIN AND SUBCUTANEOUS TISSUE INFECTIONS,GNR008,"ABDOMINAL WALL PROCEDURES, NEC",364,"OTHER SKIN, SUBCUTANEOUS TISSUE & RELATED PROCEDURES",09,"DISEASES AND DISORDERS OF THE SKIN, SUBCUTANEOUS TISSUE AND BREAST",1,Minor,Minor,Surgical,Private Health Insurance,Medicare,,,,true,58921.99,12994.03
Long Island,Nassau,2908000,000511,NYU Langone Hospital-Long Island,0 to 17,110,F,Other Race,Not Span/Hispanic,1,Emergency,Home or Self Care,2019,SKN001,SKIN AND SUBCUTANEOUS TISSUE INFECTIONS,MST005,INCISION AND DRAINAGE OF SUBCUTANEOUS TISSUE AND FASCIA,364,"OTHER SKIN, SUBCUTANEOUS TISSUE & RELATED PROCEDURES",09,"DISEASES AND DISORDERS OF THE SKIN, SUBCUTANEOUS TISSUE AND BREAST",1,Minor,Minor,Surgical,Private Health Insurance,,,,,true,17813.25,2982.47
Long Island,Nassau,2908000,000511,NYU Langone Hospital-Long Island,30 to 49,114,M,Black/African American,Not Span/Hispanic,5,Emergency,Home w/ Home Health Services,2019,SKN001,SKIN AND SUBCUTANEOUS TISSUE INFECTIONS,MST005,INCISION AND DRAINAGE OF SUBCUTANEOUS TISSUE AND FASCIA,364,"OTHER SKIN, SUBCUTANEOUS TISSUE & RELATED PROCEDURES",09,"DISEASES AND DISORDERS OF THE SKIN, SUBCUTANEOUS TISSUE AND BREAST",2,Moderate,Minor,Surgical,Private Health Insurance,,,,,true,115072.38,19251.25
Long Island,Nassau,2908000,000511,NYU Langone Hospital-Long Island,50 to 69,117,F,Black/African American,Not Span/Hispanic,10,Emergency,Home w/ Home Health Services,2019,SKN001,SKIN AND SUBCUTANEOUS TISSUE INFECTIONS,MST020,SUBCUTANEOUS TISSUE AND FASCIA EXCISION,364,"OTHER SKIN, SUBCUTANEOUS TISSUE & RELATED PROCEDURES",09,"DISEASES AND DISORDERS OF THE SKIN, SUBCUTANEOUS TISSUE AND BREAST",3,Major,Moderate,Surgical,Medicaid,Medicaid,,,,true,116886.99,23373.51
Long Island,Nassau,2908000,000511,NYU Langone Hospital-Long Island,50 to 69,115,M,White,Not Span/Hispanic,4,Emergency,Home w/ Home Health Services,2019,SKN001,SKIN AND SUBCUTANEOUS TISSUE INFECTIONS,MST005,INCISION AND DRAINAGE OF SUBCUTANEOUS TISSUE AND FASCIA,364,"OTHER SKIN, SUBCUTANEOUS TISSUE & RELATED PROCEDURES",09,"DISEASES AND DISORDERS OF THE SKIN, SUBCUTANEOUS TISSUE AND BREAST",1,Minor,Minor,Surgical,Blue Cross/Blue Shield,,,,,true,38645.97,8426.33
Long Island,Nassau,2908000,000511,NYU Langone Hospital-Long Island,30 to 49,104,F,Black/African American,Not Span/Hispanic,4,Emergency,Home or Self Care,2019,SKN004,NON-PRESSURE ULCER OF SKIN,MST019,"MUSCLE, TENDON, BURSA, AND LIGAMENT EXCISION",364,"OTHER SKIN, SUBCUTANEOUS TISSUE & RELATED PROCEDURES",09,"DISEASES AND DISORDERS OF THE SKIN, SUBCUTANEOUS TISSUE AND BREAST",1,Minor,Minor,Surgical,Medicaid,,,,,true,45274.45,8780.58
Long Island,Nassau,2908000,000511,NYU Langone Hospital-Long Island,70 or Older,115,M,White,Not Span/Hispanic,1,Elective,Home or Self Care,2019,NEO073,BENIGN NEOPLASMS,GNR006,"CHEST WALL PROCEDURES, NEC",364,"OTHER SKIN, SUBCUTANEOUS TISSUE & RELATED PROCEDURES",09,"DISEASES AND DISORDERS OF THE SKIN, SUBCUTANEOUS TISSUE AND BREAST",1,Minor,Minor,Surgical,Medicare,Medicare,Private Health Insurance,,,false,111717.14,16653.54
Long Island,Nassau,2908000,000511,NYU Langone Hospital-Long Island,50 to 69,113,M,White,Not Span/Hispanic,7,Emergency,Home or Self Care,2019,SKN007,OTHER SPECIFIED AND UNSPECIFIED SKIN DISORDERS,SKB001,SKIN BIOPSY AND DIAGNOSTIC DRAINAGE,364,"OTHER SKIN, SUBCUTANEOUS TISSUE & RELATED PROCEDURES",09,"DISEASES AND DISORDERS OF THE SKIN, SUBCUTANEOUS TISSUE AND BREAST",2,Moderate,Moderate,Surgical,Blue Cross/Blue Shield,,,,,true,112444.72,18771.45
Long Island,Nassau,2908000,000511,NYU Langone Hospital-Long Island,30 to 49,115,M,Other Race,Spanish/Hispanic,4,Emergency,Home or Self Care,2019,SKN001,SKIN AND SUBCUTANEOUS TISSUE INFECTIONS,MST005,INCISION AND DRAINAGE OF SUBCUTANEOUS TISSUE AND FASCIA,364,"OTHER SKIN, SUBCUTANEOUS TISSUE & RELATED PROCEDURES",09,"DISEASES AND DISORDERS OF THE SKIN, SUBCUTANEOUS TISSUE AND BREAST",1,Minor,Minor,Surgical,Medicaid,,,,,true,50621.43,9755.71
Long Island,Nassau,2908000,000511,NYU Langone Hospital-Long Island,70 or Older,115,M,White,Not Span/Hispanic,24,Trauma,Skilled Nursing Home,2019,INJ011,"OPEN WOUNDS OF HEAD AND NECK, INITIAL ENCOUNTER",ADM001,TRANSFUSION OF BLOOD AND BLOOD PRODUCTS,364,"OTHER SKIN, SUBCUTANEOUS TISSUE & RELATED PROCEDURES",09,"DISEASES AND DISORDERS OF THE SKIN, SUBCUTANEOUS TISSUE AND BREAST",4,Extreme,Extreme,Surgical,Medicare,Medicare,,,,true,521495.99,78957.02
Long Island,Nassau,2908000,000511,NYU Langone Hospital-Long Island,70 or Older,115,F,Black/African American,Not Span/Hispanic,3,Emergency,Home w/ Home Health Services,2019,SKN001,SKIN AND SUBCUTANEOUS TISSUE INFECTIONS,MST005,INCISION AND DRAINAGE OF SUBCUTANEOUS TISSUE AND FASCIA,364,"OTHER SKIN, SUBCUTANEOUS TISSUE & RELATED PROCEDURES",09,"DISEASES AND DISORDERS OF THE SKIN, SUBCUTANEOUS TISSUE AND BREAST",2,Moderate,Minor,Surgical,Blue Cross/Blue Shield,Medicare,,,,true,53930.48,9551.44
Long Island,Nassau,2908000,000511,NYU Langone Hospital-Long Island,18 to 29,,M,Other Race,Unknown,1,Emergency,Home or Self Care,2019,INJ013,"OPEN WOUNDS OF TRUNK, INITIAL ENCOUNTER",GIS005,EXPLORATION OF PERITONEAL CAVITY,364,"OTHER SKIN, SUBCUTANEOUS TISSUE & RELATED PROCEDURES",09,"DISEASES AND DISORDERS OF THE SKIN, SUBCUTANEOUS TISSUE AND BREAST",1,Minor,Minor,Surgical,Medicaid,Medicaid,,,,true,78913.02,9360.21
Long Island,Nassau,2908000,000511,NYU Langone Hospital-Long Island,30 to 49,115,F,Black/African American,Not Span/Hispanic,1,Emergency,Home or Self Care,2019,SKN001,SKIN AND SUBCUTANEOUS TISSUE INFECTIONS,MST005,INCISION AND DRAINAGE OF SUBCUTANEOUS TISSUE AND FASCIA,364,"OTHER SKIN, SUBCUTANEOUS TISSUE & RELATED PROCEDURES",09,"DISEASES AND DISORDERS OF THE SKIN, SUBCUTANEOUS TISSUE AND BREAST",1,Minor,Minor,Surgical,Blue Cross/Blue Shield,,,,,true,20190.8,2970.18
Long Island,Nassau,2908000,000511,NYU Langone Hospital-Long Island,30 to 49,115,M,Black/African American,Not Span/Hispanic,3,Emergency,Home w/ Home Health Services,2019,SKN001,SKIN AND SUBCUTANEOUS TISSUE INFECTIONS,MST020,SUBCUTANEOUS TISSUE AND FASCIA EXCISION,364,"OTHER SKIN, SUBCUTANEOUS TISSUE & RELATED PROCEDURES",09,"DISEASES AND DISORDERS OF THE SKIN, SUBCUTANEOUS TISSUE AND BREAST",2,Moderate,Minor,Surgical,Medicaid,,,,,true,29245.14,6366.49
Long Island,Nassau,2908000,000511,NYU Langone Hospital-Long Island,18 to 29,115,F,Other Race,Unknown,5,Emergency,Home w/ Home Health Services,2019,SKN001,SKIN AND SUBCUTANEOUS TISSUE INFECTIONS,MST005,INCISION AND DRAINAGE OF SUBCUTANEOUS TISSUE AND FASCIA,364,"OTHER SKIN, SUBCUTANEOUS TISSUE & RELATED PROCEDURES",09,"DISEASES AND DISORDERS OF THE SKIN, SUBCUTANEOUS TISSUE AND BREAST",2,Moderate,Minor,Surgical,Medicaid,,,,,true,47889.88,10638.85