Hospital Service Area,Hospital County,Operating Certificate Number,Permanent Facility Id,Facility Name,Age Group,Zip Code - 3 digits,Gender,Race,Ethnicity,Length of Stay,Type of Admission,Patient Disposition,Discharge Year,CCS Diagnosis Code,CCS Diagnosis Description,CCS Procedure Code,CCS Procedure Description,APR DRG Code,APR DRG Description,APR MDC Code,APR MDC Description,APR Severity of Illness Code,APR Severity of Illness Description,APR Risk of Mortality,APR Medical Surgical Description,Payment Typology 1,Payment Typology 2,Payment Typology 3,Birth Weight,Abortion Edit Indicator,Emergency Department Indicator,Total Charges,Total Costs
New York City,Bronx,7000006,003058,Montefiore Med Center - Jack D Weiler Hosp of A Einstein College Div,30 to 49,104,M,Other Race,Spanish/Hispanic,2,Emergency,Home or Self Care,2020,SKN001,SKIN AND SUBCUTANEOUS TISSUE INFECTIONS,MST005,INCISION AND DRAINAGE OF SUBCUTANEOUS TISSUE AND FASCIA,364,"OTHER SKIN, SUBCUTANEOUS TISSUE & RELATED PROCEDURES",09,"DISEASES AND DISORDERS OF THE SKIN, SUBCUTANEOUS TISSUE AND BREAST",2,Moderate,Minor,Surgical,Private Health Insurance,,,,,Y,31523.98,4727.6
New York City,Bronx,7000006,001169,Montefiore Medical Center - Henry & Lucy Moses Div,0 to 17,105,M,Other Race,Spanish/Hispanic,1,Emergency,Home or Self Care,2020,SKN001,SKIN AND SUBCUTANEOUS TISSUE INFECTIONS,MST005,INCISION AND DRAINAGE OF SUBCUTANEOUS TISSUE AND FASCIA,364,"OTHER SKIN, SUBCUTANEOUS TISSUE & RELATED PROCEDURES",09,"DISEASES AND DISORDERS OF THE SKIN, SUBCUTANEOUS TISSUE AND BREAST",3,Major,Minor,Surgical,Medicaid,,,,,Y,18377.72,4049.38
New York City,Manhattan,7002024,001456,Mount Sinai Hospital,50 to 69,116,M,White,Not Span/Hispanic,21,Urgent,Inpatient Rehabilitation Facility,2020,NEO026,SKIN CANCERS - BASAL CELL CARCINOMA,MST026,FINGER AND OTHER UPPER EXTREMITY AMPUTATION,364,"OTHER SKIN, SUBCUTANEOUS TISSUE & RELATED PROCEDURES",09,"DISEASES AND DISORDERS OF THE SKIN, SUBCUTANEOUS TISSUE AND BREAST",4,Extreme,Extreme,Surgical,Private Health Insurance,Self-Pay,,,,N,302050.15,77631.96
New York City,Manhattan,7002032,001469,Mount Sinai Morningside,30 to 49,100,M,Black/African American,Not Span/Hispanic,1,Emergency,Home or Self Care,2020,SKN001,SKIN AND SUBCUTANEOUS TISSUE INFECTIONS,ADM015,ADMINISTRATION OF ANTIBIOTICS,364,"OTHER SKIN, SUBCUTANEOUS TISSUE & RELATED PROCEDURES",09,"DISEASES AND DISORDERS OF THE SKIN, SUBCUTANEOUS TISSUE AND BREAST",1,Minor,Minor,Surgical,Private Health Insurance,Self-Pay,,,,N,12118.74,2700.48
Hudson Valley,Westchester,5901000,001039,NewYork-Presbyterian/Hudson Valley Hospital,70 or Older,105,F,Other Race,Not Span/Hispanic,16,Emergency,Hospice - Medical Facility,2020,SKN001,SKIN AND SUBCUTANEOUS TISSUE INFECTIONS,MST020,SUBCUTANEOUS TISSUE AND FASCIA EXCISION,364,"OTHER SKIN, SUBCUTANEOUS TISSUE & RELATED PROCEDURES",09,"DISEASES AND DISORDERS OF THE SKIN, SUBCUTANEOUS TISSUE AND BREAST",2,Moderate,Major,Surgical,Medicare,Blue Cross/Blue Shield,,,,Y,144951.11,45698.96
New York City,Manhattan,7002024,001456,Mount Sinai Hospital,70 or Older,114,M,White,Not Span/Hispanic,2,Elective,Home or Self Care,2020,FAC004,ENCOUNTER FOR PROPHYLACTIC OR OTHER PROCEDURES,MST022,"TENDON, MUSCLE, BURSA, AND LIGAMENT REPAIR (EXCLUDING PERINEAL)",364,"OTHER SKIN, SUBCUTANEOUS TISSUE & RELATED PROCEDURES",09,"DISEASES AND DISORDERS OF THE SKIN, SUBCUTANEOUS TISSUE AND BREAST",1,Minor,Minor,Surgical,Medicare,Private Health Insurance,Self-Pay,,,N,62656.42,21439.01
New York City,Bronx,7000006,001168,Montefiore Medical Center-Wakefield Hospital,30 to 49,OOS,M,Black/African American,Not Span/Hispanic,4,Emergency,Home w/ Home Health Services,2020,SKN001,SKIN AND SUBCUTANEOUS TISSUE INFECTIONS,MST005,INCISION AND DRAINAGE OF SUBCUTANEOUS TISSUE AND FASCIA,364,"OTHER SKIN, SUBCUTANEOUS TISSUE & RELATED PROCEDURES",09,"DISEASES AND DISORDERS OF THE SKIN, SUBCUTANEOUS TISSUE AND BREAST",1,Minor,Minor,Surgical,Blue Cross/Blue Shield,,,,,Y,59298.47,9928.1
New York City,Manhattan,7002054,003975,New York Presbyterian Hospital - Allen Hospital,30 to 49,100,M,Multi-racial,Multi-ethnic,1,Emergency,Home or Self Care,2020,SKN002,OTHER SPECIFIED INFLAMMATORY CONDITION OF SKIN,MST005,INCISION AND DRAINAGE OF SUBCUTANEOUS TISSUE AND FASCIA,364,"OTHER SKIN, SUBCUTANEOUS TISSUE & RELATED PROCEDURES",09,"DISEASES AND DISORDERS OF THE SKIN, SUBCUTANEOUS TISSUE AND BREAST",1,Minor,Minor,Surgical,Medicaid,Medicaid,Self-Pay,,,Y,29863.99,8444.93
Long Island,Nassau,2908000,000511,NYU Langone Hospital-Long Island,18 to 29,115,F,Other Race,Not Span/Hispanic,5,Emergency,Home or Self Care,2020,SKN001,SKIN AND SUBCUTANEOUS TISSUE INFECTIONS,MST020,SUBCUTANEOUS TISSUE AND FASCIA EXCISION,364,"OTHER SKIN, SUBCUTANEOUS TISSUE & RELATED PROCEDURES",09,"DISEASES AND DISORDERS OF THE SKIN, SUBCUTANEOUS TISSUE AND BREAST",3,Major,Moderate,Surgical,Blue Cross/Blue Shield,,,,,Y,378159.98,32388.04
New York City,Manhattan,7002054,001464,New York-Presbyterian Hospital - Columbia Presbyterian Center,0 to 17,100,F,White,Spanish/Hispanic,3,Emergency,Home or Self Care,2020,SKN001,SKIN AND SUBCUTANEOUS TISSUE INFECTIONS,MST005,INCISION AND DRAINAGE OF SUBCUTANEOUS TISSUE AND FASCIA,364,"OTHER SKIN, SUBCUTANEOUS TISSUE & RELATED PROCEDURES",09,"DISEASES AND DISORDERS OF THE SKIN, SUBCUTANEOUS TISSUE AND BREAST",1,Minor,Minor,Surgical,Medicaid,Medicaid,Self-Pay,,,Y,52088.2,13367.4
New York City,Manhattan,7002054,001464,New York-Presbyterian Hospital - Columbia Presbyterian Center,0 to 17,104,F,White,Spanish/Hispanic,3,Emergency,Home or Self Care,2020,SKN001,SKIN AND SUBCUTANEOUS TISSUE INFECTIONS,MST005,INCISION AND DRAINAGE OF SUBCUTANEOUS TISSUE AND FASCIA,364,"OTHER SKIN, SUBCUTANEOUS TISSUE & RELATED PROCEDURES",09,"DISEASES AND DISORDERS OF THE SKIN, SUBCUTANEOUS TISSUE AND BREAST",1,Minor,Minor,Surgical,Medicaid,Medicaid,Self-Pay,,,Y,50213.84,14123.78
New York City,Manhattan,7002054,001464,New York-Presbyterian Hospital - Columbia Presbyterian Center,50 to 69,OOS,M,White,Not Span/Hispanic,4,Elective,Home w/ Home Health Services,2020,END003,DIABETES MELLITUS WITH COMPLICATION,MST018,BONE EXCISION,364,"OTHER SKIN, SUBCUTANEOUS TISSUE & RELATED PROCEDURES",09,"DISEASES AND DISORDERS OF THE SKIN, SUBCUTANEOUS TISSUE AND BREAST",1,Minor,Moderate,Surgical,Medicare,Private Health Insurance,Self-Pay,,,N,68354.36,17519.5
New York City,Manhattan,7002054,001464,New York-Presbyterian Hospital - Columbia Presbyterian Center,50 to 69,100,F,Other Race,Spanish/Hispanic,6,Emergency,Skilled Nursing Home,2020,SKN001,SKIN AND SUBCUTANEOUS TISSUE INFECTIONS,MST020,SUBCUTANEOUS TISSUE AND FASCIA EXCISION,364,"OTHER SKIN, SUBCUTANEOUS TISSUE & RELATED PROCEDURES",09,"DISEASES AND DISORDERS OF THE SKIN, SUBCUTANEOUS TISSUE AND BREAST",3,Major,Moderate,Surgical,Medicare,Medicare,Medicaid,,,Y,92832.42,22490.37
New York City,Manhattan,7002054,001464,New York-Presbyterian Hospital - Columbia Presbyterian Center,50 to 69,104,M,Other Race,Multi-ethnic,3,Emergency,Home w/ Home Health Services,2020,SKN001,SKIN AND SUBCUTANEOUS TISSUE INFECTIONS,ADM015,ADMINISTRATION OF ANTIBIOTICS,364,"OTHER SKIN, SUBCUTANEOUS TISSUE & RELATED PROCEDURES",09,"DISEASES AND DISORDERS OF THE SKIN, SUBCUTANEOUS TISSUE AND BREAST",1,Minor,Minor,Surgical,Private Health Insurance,Self-Pay,,,,Y,37974.88,8235.62
New York City,Queens,7003010,001637,New York - Presbyterian/Queens,50 to 69,113,M,Black/African American,Spanish/Hispanic,37,Emergency,Home w/ Home Health Services,2020,SKN001,SKIN AND SUBCUTANEOUS TISSUE INFECTIONS,MST020,SUBCUTANEOUS TISSUE AND FASCIA EXCISION,364,"OTHER SKIN, SUBCUTANEOUS TISSUE & RELATED PROCEDURES",09,"DISEASES AND DISORDERS OF THE SKIN, SUBCUTANEOUS TISSUE AND BREAST",4,Extreme,Extreme,Surgical,Blue Cross/Blue Shield,Self-Pay,,,,Y,309426.43,78581.38
New York City,Manhattan,7002054,001437,New York-Presbyterian/Lower Manhattan Hospital,50 to 69,112,M,White,Not Span/Hispanic,8,Emergency,Home or Self Care,2020,SKN001,SKIN AND SUBCUTANEOUS TISSUE INFECTIONS,ADM015,ADMINISTRATION OF ANTIBIOTICS,364,"OTHER SKIN, SUBCUTANEOUS TISSUE & RELATED PROCEDURES",09,"DISEASES AND DISORDERS OF THE SKIN, SUBCUTANEOUS TISSUE AND BREAST",3,Major,Minor,Surgical,"Managed Care, Unspecified",Medicaid,Self-Pay,,,Y,159044.29,45817.88
New York City,Manhattan,7002053,001463,NYU Langone Hospitals,50 to 69,112,M,Black/African American,Not Span/Hispanic,2,Emergency,Left Against Medical Advice,2020,SKN001,SKIN AND SUBCUTANEOUS TISSUE INFECTIONS,MST005,INCISION AND DRAINAGE OF SUBCUTANEOUS TISSUE AND FASCIA,364,"OTHER SKIN, SUBCUTANEOUS TISSUE & RELATED PROCEDURES",09,"DISEASES AND DISORDERS OF THE SKIN, SUBCUTANEOUS TISSUE AND BREAST",1,Minor,Minor,Surgical,Private Health Insurance,,,,,Y,42638.28,13956.93
New York City,Kings,7001037,001320,University Hospital of Brooklyn,70 or Older,112,F,Black/African American,Not Span/Hispanic,3,Emergency,Left Against Medical Advice,2020,SKN001,SKIN AND SUBCUTANEOUS TISSUE INFECTIONS,MST005,INCISION AND DRAINAGE OF SUBCUTANEOUS TISSUE AND FASCIA,364,"OTHER SKIN, SUBCUTANEOUS TISSUE & RELATED PROCEDURES",09,"DISEASES AND DISORDERS OF THE SKIN, SUBCUTANEOUS TISSUE AND BREAST",2,Moderate,Minor,Surgical,Medicare,Federal/State/Local/VA,Self-Pay,,,Y,17148.2,11140.31
New York City,Kings,7001037,001320,University Hospital of Brooklyn,0 to 17,112,M,Black/African American,Not Span/Hispanic,6,Emergency,Home or Self Care,2020,SKN001,SKIN AND SUBCUTANEOUS TISSUE INFECTIONS,MST005,INCISION AND DRAINAGE OF SUBCUTANEOUS TISSUE AND FASCIA,364,"OTHER SKIN, SUBCUTANEOUS TISSUE & RELATED PROCEDURES",09,"DISEASES AND DISORDERS OF THE SKIN, SUBCUTANEOUS TISSUE AND BREAST",1,Minor,Minor,Surgical,Private Health Insurance,Medicaid,Medicaid,,,Y,34406,25171.6
New York City,Kings,7001021,001306,New York - Presbyterian Brooklyn Methodist Hospital,30 to 49,112,M,White,Spanish/Hispanic,10,Emergency,Home or Self Care,2020,INJ011,"OPEN WOUNDS OF HEAD AND NECK, INITIAL ENCOUNTER",MST022,"TENDON, MUSCLE, BURSA, AND LIGAMENT REPAIR (EXCLUDING PERINEAL)",364,"OTHER SKIN, SUBCUTANEOUS TISSUE & RELATED PROCEDURES",09,"DISEASES AND DISORDERS OF THE SKIN, SUBCUTANEOUS TISSUE AND BREAST",4,Extreme,Extreme,Surgical,Medicaid,Self-Pay,,,,Y,112420.09,27495.29
New York City,Kings,7001021,001306,New York - Presbyterian Brooklyn Methodist Hospital,30 to 49,,M,White,Not Span/Hispanic,5,Emergency,Home or Self Care,2020,SKN001,SKIN AND SUBCUTANEOUS TISSUE INFECTIONS,MST020,SUBCUTANEOUS TISSUE AND FASCIA EXCISION,364,"OTHER SKIN, SUBCUTANEOUS TISSUE & RELATED PROCEDURES",09,"DISEASES AND DISORDERS OF THE SKIN, SUBCUTANEOUS TISSUE AND BREAST",2,Moderate,Minor,Surgical,Medicaid,Self-Pay,,,,Y,44725.75,15780.24
New York City,Kings,7001021,001306,New York - Presbyterian Brooklyn Methodist Hospital,0 to 17,112,M,White,Spanish/Hispanic,3,Emergency,Home or Self Care,2020,INJ012,"OPEN WOUNDS TO LIMBS, INITIAL ENCOUNTER",MST018,BONE EXCISION,364,"OTHER SKIN, SUBCUTANEOUS TISSUE & RELATED PROCEDURES",09,"DISEASES AND DISORDERS OF THE SKIN, SUBCUTANEOUS TISSUE AND BREAST",1,Minor,Minor,Surgical,Blue Cross/Blue Shield,Self-Pay,,,,Y,37385.16,17635.66
New York City,Kings,7001021,001306,New York - Presbyterian Brooklyn Methodist Hospital,30 to 49,112,M,Black/African American,Not Span/Hispanic,1,Emergency,Home or Self Care,2020,SKN001,SKIN AND SUBCUTANEOUS TISSUE INFECTIONS,MST004,INCISION AND DRAINAGE OF MUSCULOSKELETAL TISSUE AND JOINTS,364,"OTHER SKIN, SUBCUTANEOUS TISSUE & RELATED PROCEDURES",09,"DISEASES AND DISORDERS OF THE SKIN, SUBCUTANEOUS TISSUE AND BREAST",1,Minor,Minor,Surgical,Medicaid,Self-Pay,,,,Y,21895.72,9256.35
New York City,Manhattan,7002054,001458,New York-Presbyterian Hospital - New York Weill Cornell Center,30 to 49,OOS,M,Other Race,Not Span/Hispanic,2,Emergency,Home or Self Care,2020,INJ011,"OPEN WOUNDS OF HEAD AND NECK, INITIAL ENCOUNTER",MST028,"SUBCUTANEOUS TISSUE AND FASCIA PROCEDURES, NEC",364,"OTHER SKIN, SUBCUTANEOUS TISSUE & RELATED PROCEDURES",09,"DISEASES AND DISORDERS OF THE SKIN, SUBCUTANEOUS TISSUE AND BREAST",1,Minor,Minor,Surgical,Private Health Insurance,Self-Pay,,,,Y,60011.06,16328.68
New York City,Kings,7001021,001306,New York - Presbyterian Brooklyn Methodist Hospital,50 to 69,112,F,Black/African American,Not Span/Hispanic,3,Emergency,Home or Self Care,2020,MUS025,OTHER SPECIFIED CONNECTIVE TISSUE DISEASE,GNR008,"ABDOMINAL WALL PROCEDURES, NEC",364,"OTHER SKIN, SUBCUTANEOUS TISSUE & RELATED PROCEDURES",09,"DISEASES AND DISORDERS OF THE SKIN, SUBCUTANEOUS TISSUE AND BREAST",2,Moderate,Moderate,Surgical,Blue Cross/Blue Shield,Self-Pay,,,,N,43192.2,20629.97
New York City,Kings,7001021,001306,New York - Presbyterian Brooklyn Methodist Hospital,30 to 49,112,F,White,Not Span/Hispanic,3,Emergency,Psychiatric Hospital or Unit of Hosp,2020,INJ012,"OPEN WOUNDS TO LIMBS, INITIAL ENCOUNTER",MST022,"TENDON, MUSCLE, BURSA, AND LIGAMENT REPAIR (EXCLUDING PERINEAL)",364,"OTHER SKIN, SUBCUTANEOUS TISSUE & RELATED PROCEDURES",09,"DISEASES AND DISORDERS OF THE SKIN, SUBCUTANEOUS TISSUE AND BREAST",3,Major,Major,Surgical,"Managed Care, Unspecified",Medicaid,Self-Pay,,,Y,63128.66,22167.16
New York City,Kings,7001021,001306,New York - Presbyterian Brooklyn Methodist Hospital,70 or Older,112,F,Black/African American,Not Span/Hispanic,6,Emergency,Skilled Nursing Home,2020,SKN001,SKIN AND SUBCUTANEOUS TISSUE INFECTIONS,MST005,INCISION AND DRAINAGE OF SUBCUTANEOUS TISSUE AND FASCIA,364,"OTHER SKIN, SUBCUTANEOUS TISSUE & RELATED PROCEDURES",09,"DISEASES AND DISORDERS OF THE SKIN, SUBCUTANEOUS TISSUE AND BREAST",3,Major,Moderate,Surgical,Medicare,Self-Pay,,,,Y,51858.2,17359.88
New York City,Bronx,7000006,001169,Montefiore Medical Center - Henry & Lucy Moses Div,50 to 69,104,F,Black/African American,Not Span/Hispanic,2,Emergency,Home or Self Care,2020,SYM014,SKIN/SUBCUTANEOUS SIGNS AND SYMPTOMS,LYM003,LYMPH NODE DISSECTION,364,"OTHER SKIN, SUBCUTANEOUS TISSUE & RELATED PROCEDURES",09,"DISEASES AND DISORDERS OF THE SKIN, SUBCUTANEOUS TISSUE AND BREAST",1,Minor,Minor,Surgical,Private Health Insurance,,,,,N,60464.45,11334.19
Long Island,Nassau,2950002,000528,Nassau University Medical Center,30 to 49,115,M,Black/African American,Not Span/Hispanic,1,Trauma,Left Against Medical Advice,2020,INJ013,"OPEN WOUNDS OF TRUNK, INITIAL ENCOUNTER",MST022,"TENDON, MUSCLE, BURSA, AND LIGAMENT REPAIR (EXCLUDING PERINEAL)",364,"OTHER SKIN, SUBCUTANEOUS TISSUE & RELATED PROCEDURES",09,"DISEASES AND DISORDERS OF THE SKIN, SUBCUTANEOUS TISSUE AND BREAST",2,Moderate,Minor,Surgical,Medicaid,Medicaid,Self-Pay,,,N,13620.06,3656.75
Western NY,Erie,1401005,000210,Erie County Medical Center,30 to 49,147,F,Other Race,Not Span/Hispanic,4,Emergency,Home or Self Care,2020,SKN001,SKIN AND SUBCUTANEOUS TISSUE INFECTIONS,ENT006,ENT DRAINAGE (EXCLUDING MYRINGOTOMY),364,"OTHER SKIN, SUBCUTANEOUS TISSUE & RELATED PROCEDURES",09,"DISEASES AND DISORDERS OF THE SKIN, SUBCUTANEOUS TISSUE AND BREAST",2,Moderate,Minor,Surgical,Medicaid,Medicaid,,,,Y,18608.01,11046.36
Western NY,Erie,1401005,000210,Erie County Medical Center,30 to 49,142,M,Other Race,Not Span/Hispanic,2,Emergency,Home or Self Care,2020,SKN001,SKIN AND SUBCUTANEOUS TISSUE INFECTIONS,MST005,INCISION AND DRAINAGE OF SUBCUTANEOUS TISSUE AND FASCIA,364,"OTHER SKIN, SUBCUTANEOUS TISSUE & RELATED PROCEDURES",09,"DISEASES AND DISORDERS OF THE SKIN, SUBCUTANEOUS TISSUE AND BREAST",2,Moderate,Minor,Surgical,Medicaid,Medicaid,,,,Y,11318.58,5103.83
Western NY,Erie,1401005,000210,Erie County Medical Center,30 to 49,142,F,White,Not Span/Hispanic,4,Elective,Home w/ Home Health Services,2020,SKN004,NON-PRESSURE ULCER OF SKIN,MST019,"MUSCLE, TENDON, BURSA, AND LIGAMENT EXCISION",364,"OTHER SKIN, SUBCUTANEOUS TISSUE & RELATED PROCEDURES",09,"DISEASES AND DISORDERS OF THE SKIN, SUBCUTANEOUS TISSUE AND BREAST",2,Moderate,Moderate,Surgical,Private Health Insurance,,,,,N,14865.09,10119.37
Western NY,Erie,1401005,000210,Erie County Medical Center,50 to 69,142,M,Black/African American,Not Span/Hispanic,4,Emergency,Home or Self Care,2020,INJ011,"OPEN WOUNDS OF HEAD AND NECK, INITIAL ENCOUNTER",MST022,"TENDON, MUSCLE, BURSA, AND LIGAMENT REPAIR (EXCLUDING PERINEAL)",364,"OTHER SKIN, SUBCUTANEOUS TISSUE & RELATED PROCEDURES",09,"DISEASES AND DISORDERS OF THE SKIN, SUBCUTANEOUS TISSUE AND BREAST",3,Major,Moderate,Surgical,Medicaid,Medicaid,,,,Y,39621.3,17458.28
Western NY,Erie,1401005,000210,Erie County Medical Center,30 to 49,137,M,White,Not Span/Hispanic,2,Emergency,Psychiatric Hospital or Unit of Hosp,2020,INJ011,"OPEN WOUNDS OF HEAD AND NECK, INITIAL ENCOUNTER",RES007,AIRWAY INTUBATION,364,"OTHER SKIN, SUBCUTANEOUS TISSUE & RELATED PROCEDURES",09,"DISEASES AND DISORDERS OF THE SKIN, SUBCUTANEOUS TISSUE AND BREAST",3,Major,Major,Surgical,Medicaid,,,,,Y,33331.3,14134.01
New York City,Manhattan,7002032,001466,Mount Sinai West,70 or Older,OOS,M,White,Not Span/Hispanic,4,Elective,Home w/ Home Health Services,2020,NEO027,SKIN CANCERS - SQUAMOUS CELL CARCINOMA,MST019,"MUSCLE, TENDON, BURSA, AND LIGAMENT EXCISION",364,"OTHER SKIN, SUBCUTANEOUS TISSUE & RELATED PROCEDURES",09,"DISEASES AND DISORDERS OF THE SKIN, SUBCUTANEOUS TISSUE AND BREAST",2,Moderate,Moderate,Surgical,Medicare,Private Health Insurance,Self-Pay,,,N,140692.21,33122.03
New York City,Bronx,7000006,001168,Montefiore Medical Center-Wakefield Hospital,50 to 69,104,M,Black/African American,Not Span/Hispanic,1,Emergency,Home or Self Care,2020,SKN001,SKIN AND SUBCUTANEOUS TISSUE INFECTIONS,MST005,INCISION AND DRAINAGE OF SUBCUTANEOUS TISSUE AND FASCIA,364,"OTHER SKIN, SUBCUTANEOUS TISSUE & RELATED PROCEDURES",09,"DISEASES AND DISORDERS OF THE SKIN, SUBCUTANEOUS TISSUE AND BREAST",2,Moderate,Moderate,Surgical,Medicaid,,,,,Y,21252.32,3242.79
New York City,Manhattan,7002032,001469,Mount Sinai Morningside,30 to 49,100,M,Other Race,Spanish/Hispanic,3,Emergency,Home or Self Care,2020,SKN001,SKIN AND SUBCUTANEOUS TISSUE INFECTIONS,MST028,"SUBCUTANEOUS TISSUE AND FASCIA PROCEDURES, NEC",364,"OTHER SKIN, SUBCUTANEOUS TISSUE & RELATED PROCEDURES",09,"DISEASES AND DISORDERS OF THE SKIN, SUBCUTANEOUS TISSUE AND BREAST",3,Major,Moderate,Surgical,Medicaid,Medicaid,Self-Pay,,,Y,51366.41,12150.39
New York City,Bronx,7000006,003058,Montefiore Med Center - Jack D Weiler Hosp of A Einstein College Div,70 or Older,104,F,Black/African American,Spanish/Hispanic,3,Emergency,Skilled Nursing Home,2020,NEO025,SKIN CANCERS - MELANOMA,MST020,SUBCUTANEOUS TISSUE AND FASCIA EXCISION,364,"OTHER SKIN, SUBCUTANEOUS TISSUE & RELATED PROCEDURES",09,"DISEASES AND DISORDERS OF THE SKIN, SUBCUTANEOUS TISSUE AND BREAST",1,Minor,Minor,Surgical,Medicare,Medicaid,,,,N,62895.45,12504.4
Capital/Adirond,Otsego,3824000,000746,Mary Imogene Bassett Hospital,50 to 69,132,M,Black/African American,Not Span/Hispanic,37,Urgent,Skilled Nursing Home,2020,SKN003,PRESSURE ULCER OF SKIN,MST018,BONE EXCISION,364,"OTHER SKIN, SUBCUTANEOUS TISSUE & RELATED PROCEDURES",09,"DISEASES AND DISORDERS OF THE SKIN, SUBCUTANEOUS TISSUE AND BREAST",3,Major,Major,Surgical,Medicare,Medicaid,,,,N,105862.99,66669.6
New York City,Manhattan,7002053,001463,NYU Langone Hospitals,50 to 69,100,F,White,Not Span/Hispanic,10,Emergency,Home w/ Home Health Services,2020,SKN001,SKIN AND SUBCUTANEOUS TISSUE INFECTIONS,MST028,"SUBCUTANEOUS TISSUE AND FASCIA PROCEDURES, NEC",364,"OTHER SKIN, SUBCUTANEOUS TISSUE & RELATED PROCEDURES",09,"DISEASES AND DISORDERS OF THE SKIN, SUBCUTANEOUS TISSUE AND BREAST",3,Major,Major,Surgical,Medicare,Medicaid,,,,Y,226018.72,45934.23
New York City,Manhattan,7002053,001463,NYU Langone Hospitals,50 to 69,112,F,White,Not Span/Hispanic,5,Emergency,Home w/ Home Health Services,2020,SKN001,SKIN AND SUBCUTANEOUS TISSUE INFECTIONS,MST005,INCISION AND DRAINAGE OF SUBCUTANEOUS TISSUE AND FASCIA,364,"OTHER SKIN, SUBCUTANEOUS TISSUE & RELATED PROCEDURES",09,"DISEASES AND DISORDERS OF THE SKIN, SUBCUTANEOUS TISSUE AND BREAST",2,Moderate,Moderate,Surgical,Private Health Insurance,,,,,Y,62391.77,20378.22
Capital/Adirond,Otsego,3824000,000746,Mary Imogene Bassett Hospital,50 to 69,,M,Other Race,Not Span/Hispanic,2,Emergency,Home or Self Care,2020,INJ012,"OPEN WOUNDS TO LIMBS, INITIAL ENCOUNTER",MST018,BONE EXCISION,364,"OTHER SKIN, SUBCUTANEOUS TISSUE & RELATED PROCEDURES",09,"DISEASES AND DISORDERS OF THE SKIN, SUBCUTANEOUS TISSUE AND BREAST",1,Minor,Minor,Surgical,Self-Pay,,,,,Y,19534.26,8993.01
New York City,Bronx,7000006,001168,Montefiore Medical Center-Wakefield Hospital,30 to 49,114,M,Black/African American,Not Span/Hispanic,1,Emergency,Home or Self Care,2020,SKN001,SKIN AND SUBCUTANEOUS TISSUE INFECTIONS,MST005,INCISION AND DRAINAGE OF SUBCUTANEOUS TISSUE AND FASCIA,364,"OTHER SKIN, SUBCUTANEOUS TISSUE & RELATED PROCEDURES",09,"DISEASES AND DISORDERS OF THE SKIN, SUBCUTANEOUS TISSUE AND BREAST",1,Minor,Minor,Surgical,Self-Pay,,,,,Y,21372,3298.54
New York City,Kings,7002053,001304,NYU Langone Hospital-Brooklyn,50 to 69,112,M,White,Not Span/Hispanic,1,Elective,Home or Self Care,2020,SKN001,SKIN AND SUBCUTANEOUS TISSUE INFECTIONS,MST030,"MUSCULOSKELETAL PROCEDURES, NEC",364,"OTHER SKIN, SUBCUTANEOUS TISSUE & RELATED PROCEDURES",09,"DISEASES AND DISORDERS OF THE SKIN, SUBCUTANEOUS TISSUE AND BREAST",1,Minor,Minor,Surgical,Blue Cross/Blue Shield,,,,,N,27452.67,5826.37
Capital/Adirond,Columbia,1001000,000146,Columbia Memorial Hospital,50 to 69,120,M,White,Not Span/Hispanic,4,Elective,Short-term Hospital,2020,END003,DIABETES MELLITUS WITH COMPLICATION,MST019,"MUSCLE, TENDON, BURSA, AND LIGAMENT EXCISION",364,"OTHER SKIN, SUBCUTANEOUS TISSUE & RELATED PROCEDURES",09,"DISEASES AND DISORDERS OF THE SKIN, SUBCUTANEOUS TISSUE AND BREAST",3,Major,Moderate,Surgical,Medicaid,,,,,Y,32168.9,10257.5
New York City,Bronx,7000006,001168,Montefiore Medical Center-Wakefield Hospital,30 to 49,104,F,Black/African American,Not Span/Hispanic,1,Emergency,Home or Self Care,2020,SKN001,SKIN AND SUBCUTANEOUS TISSUE INFECTIONS,MST005,INCISION AND DRAINAGE OF SUBCUTANEOUS TISSUE AND FASCIA,364,"OTHER SKIN, SUBCUTANEOUS TISSUE & RELATED PROCEDURES",09,"DISEASES AND DISORDERS OF THE SKIN, SUBCUTANEOUS TISSUE AND BREAST",1,Minor,Minor,Surgical,Medicare,Medicaid,,,,Y,24398.03,3440.52
Hudson Valley,Rockland,4329000,000779,Good Samaritan Hospital of Suffern,18 to 29,109,M,Other Race,Not Span/Hispanic,8,Emergency,Home or Self Care,2020,SKN001,SKIN AND SUBCUTANEOUS TISSUE INFECTIONS,MST005,INCISION AND DRAINAGE OF SUBCUTANEOUS TISSUE AND FASCIA,364,"OTHER SKIN, SUBCUTANEOUS TISSUE & RELATED PROCEDURES",09,"DISEASES AND DISORDERS OF THE SKIN, SUBCUTANEOUS TISSUE AND BREAST",2,Moderate,Moderate,Surgical,Medicaid,,,,,Y,76939.46,11332.59
New York City,Bronx,7000006,001169,Montefiore Medical Center - Henry & Lucy Moses Div,50 to 69,104,M,Black/African American,Not Span/Hispanic,5,Emergency,Home w/ Home Health Services,2020,END003,DIABETES MELLITUS WITH COMPLICATION,MST018,BONE EXCISION,364,"OTHER SKIN, SUBCUTANEOUS TISSUE & RELATED PROCEDURES",09,"DISEASES AND DISORDERS OF THE SKIN, SUBCUTANEOUS TISSUE AND BREAST",2,Moderate,Moderate,Surgical,Medicaid,,,,,Y,91114.84,16700.67
Hudson Valley,Westchester,5904001,001072,Montefiore New Rochelle Hospital,50 to 69,105,F,Black/African American,Unknown,9,Emergency,Home w/ Home Health Services,2020,SKN001,SKIN AND SUBCUTANEOUS TISSUE INFECTIONS,MST005,INCISION AND DRAINAGE OF SUBCUTANEOUS TISSUE AND FASCIA,364,"OTHER SKIN, SUBCUTANEOUS TISSUE & RELATED PROCEDURES",09,"DISEASES AND DISORDERS OF THE SKIN, SUBCUTANEOUS TISSUE AND BREAST",3,Major,Minor,Surgical,Medicaid,Medicaid,Self-Pay,,,Y,81231.33,23911.45
New York City,Kings,7002053,001304,NYU Langone Hospital-Brooklyn,18 to 29,112,M,White,Spanish/Hispanic,4,Emergency,Home or Self Care,2020,SKN001,SKIN AND SUBCUTANEOUS TISSUE INFECTIONS,MST005,INCISION AND DRAINAGE OF SUBCUTANEOUS TISSUE AND FASCIA,364,"OTHER SKIN, SUBCUTANEOUS TISSUE & RELATED PROCEDURES",09,"DISEASES AND DISORDERS OF THE SKIN, SUBCUTANEOUS TISSUE AND BREAST",1,Minor,Minor,Surgical,Medicaid,,,,,Y,53113.04,18372.87