Hospital Service Area,Hospital County,Operating Certificate Number,Permanent Facility Id,Facility Name,Age Group,Zip Code - 3 digits,Gender,Race,Ethnicity,Length of Stay,Type of Admission,Patient Disposition,Discharge Year,CCS Diagnosis Code,CCS Diagnosis Description,CCS Procedure Code,CCS Procedure Description,APR DRG Code,APR DRG Description,APR MDC Code,APR MDC Description,APR Severity of Illness Code,APR Severity of Illness Description,APR Risk of Mortality,APR Medical Surgical Description,Payment Typology 1,Payment Typology 2,Payment Typology 3,Birth Weight,Abortion Edit Indicator,Emergency Department Indicator,Total Charges,Total Costs
Long Island,Nassau,2908000,000511,NYU Langone Hospital-Long Island,50 to 69,115,M,Black/African American,Not Span/Hispanic,10,Emergency,Home w/ Home Health Services,2019,END003,DIABETES MELLITUS WITH COMPLICATION,,,380,SKIN ULCERS,09,"DISEASES AND DISORDERS OF THE SKIN, SUBCUTANEOUS TISSUE AND BREAST",2,Moderate,Minor,Medical,Blue Cross/Blue Shield,Medicare,,,,true,107610.48,21628.59
Long Island,Nassau,2908000,000511,NYU Langone Hospital-Long Island,50 to 69,110,F,Black/African American,Not Span/Hispanic,10,Emergency,Skilled Nursing Home,2019,SKN004,NON-PRESSURE ULCER OF SKIN,ADM001,TRANSFUSION OF BLOOD AND BLOOD PRODUCTS,380,SKIN ULCERS,09,"DISEASES AND DISORDERS OF THE SKIN, SUBCUTANEOUS TISSUE AND BREAST",4,Extreme,Major,Medical,Medicare,Medicare,Private Health Insurance,,,true,109600.07,22377.78
Long Island,Nassau,2908000,000511,NYU Langone Hospital-Long Island,70 or Older,110,M,White,Not Span/Hispanic,2,Emergency,Home w/ Home Health Services,2019,SKN004,NON-PRESSURE ULCER OF SKIN,,,380,SKIN ULCERS,09,"DISEASES AND DISORDERS OF THE SKIN, SUBCUTANEOUS TISSUE AND BREAST",3,Major,Major,Medical,Medicare,Medicare,Private Health Insurance,,,true,33440.73,5858.72
Long Island,Nassau,2908000,000511,NYU Langone Hospital-Long Island,50 to 69,117,F,White,Spanish/Hispanic,7,Emergency,Home or Self Care,2019,END003,DIABETES MELLITUS WITH COMPLICATION,MST020,SUBCUTANEOUS TISSUE AND FASCIA EXCISION,380,SKIN ULCERS,09,"DISEASES AND DISORDERS OF THE SKIN, SUBCUTANEOUS TISSUE AND BREAST",2,Moderate,Moderate,Medical,Medicaid,Medicaid,Medicare,,,true,86173.03,16482.73
Long Island,Nassau,2908000,000511,NYU Langone Hospital-Long Island,70 or Older,110,M,White,Not Span/Hispanic,5,Emergency,Home w/ Home Health Services,2019,END003,DIABETES MELLITUS WITH COMPLICATION,MST020,SUBCUTANEOUS TISSUE AND FASCIA EXCISION,380,SKIN ULCERS,09,"DISEASES AND DISORDERS OF THE SKIN, SUBCUTANEOUS TISSUE AND BREAST",2,Moderate,Moderate,Medical,Medicare,Medicare,,,,true,63673.21,12695.87
Long Island,Nassau,2908000,000511,NYU Langone Hospital-Long Island,50 to 69,115,M,Black/African American,Not Span/Hispanic,4,Urgent,Home w/ Home Health Services,2019,END003,DIABETES MELLITUS WITH COMPLICATION,MST020,SUBCUTANEOUS TISSUE AND FASCIA EXCISION,380,SKIN ULCERS,09,"DISEASES AND DISORDERS OF THE SKIN, SUBCUTANEOUS TISSUE AND BREAST",2,Moderate,Moderate,Medical,Medicare,Medicare,,,,false,73162.76,15882.94
Long Island,Nassau,2908000,000511,NYU Langone Hospital-Long Island,50 to 69,117,M,White,Spanish/Hispanic,3,Emergency,Home or Self Care,2019,SKN003,PRESSURE ULCER OF SKIN,MAM004,CARDIAC STRESS TESTS,380,SKIN ULCERS,09,"DISEASES AND DISORDERS OF THE SKIN, SUBCUTANEOUS TISSUE AND BREAST",3,Major,Moderate,Medical,Medicare,Medicare,,,,true,53117.84,9756.58
Long Island,Nassau,2908000,000511,NYU Langone Hospital-Long Island,70 or Older,115,F,White,Not Span/Hispanic,4,Emergency,Home w/ Home Health Services,2019,SKN003,PRESSURE ULCER OF SKIN,MST020,SUBCUTANEOUS TISSUE AND FASCIA EXCISION,380,SKIN ULCERS,09,"DISEASES AND DISORDERS OF THE SKIN, SUBCUTANEOUS TISSUE AND BREAST",2,Moderate,Moderate,Medical,Medicare,Medicare,Medicaid,,,true,47616.76,8869.32
Long Island,Nassau,2908000,000511,NYU Langone Hospital-Long Island,50 to 69,115,M,White,Not Span/Hispanic,6,Emergency,Home or Self Care,2019,SKN004,NON-PRESSURE ULCER OF SKIN,,,380,SKIN ULCERS,09,"DISEASES AND DISORDERS OF THE SKIN, SUBCUTANEOUS TISSUE AND BREAST",3,Major,Major,Medical,Private Health Insurance,,,,,true,74779.36,14430.02
Long Island,Nassau,2908000,000511,NYU Langone Hospital-Long Island,50 to 69,115,M,Black/African American,Not Span/Hispanic,5,Emergency,Home w/ Home Health Services,2019,SKN004,NON-PRESSURE ULCER OF SKIN,MST020,SUBCUTANEOUS TISSUE AND FASCIA EXCISION,380,SKIN ULCERS,09,"DISEASES AND DISORDERS OF THE SKIN, SUBCUTANEOUS TISSUE AND BREAST",3,Major,Minor,Medical,Medicare,Medicare,Medicaid,,,true,105695.15,20412.39
Long Island,Nassau,2908000,000511,NYU Langone Hospital-Long Island,70 or Older,117,M,White,Not Span/Hispanic,6,Emergency,Home w/ Home Health Services,2019,END003,DIABETES MELLITUS WITH COMPLICATION,,,380,SKIN ULCERS,09,"DISEASES AND DISORDERS OF THE SKIN, SUBCUTANEOUS TISSUE AND BREAST",2,Moderate,Moderate,Medical,Medicare,Medicare,Blue Cross/Blue Shield,,,true,54360.71,12225.28
Long Island,Nassau,2908000,000511,NYU Langone Hospital-Long Island,50 to 69,115,M,White,Not Span/Hispanic,3,Emergency,Home or Self Care,2019,END003,DIABETES MELLITUS WITH COMPLICATION,,,380,SKIN ULCERS,09,"DISEASES AND DISORDERS OF THE SKIN, SUBCUTANEOUS TISSUE AND BREAST",2,Moderate,Moderate,Medical,Blue Cross/Blue Shield,,,,,true,44391.52,7488.05
Long Island,Nassau,2908000,000511,NYU Langone Hospital-Long Island,70 or Older,115,M,Other Race,Not Span/Hispanic,9,Emergency,Home w/ Home Health Services,2019,SKN003,PRESSURE ULCER OF SKIN,,,380,SKIN ULCERS,09,"DISEASES AND DISORDERS OF THE SKIN, SUBCUTANEOUS TISSUE AND BREAST",3,Major,Major,Medical,Medicare,Medicare,Medicaid,,,true,70733.35,16933.21
Long Island,Nassau,2908000,000511,NYU Langone Hospital-Long Island,50 to 69,115,F,Black/African American,Not Span/Hispanic,4,Emergency,Home or Self Care,2019,END003,DIABETES MELLITUS WITH COMPLICATION,,,380,SKIN ULCERS,09,"DISEASES AND DISORDERS OF THE SKIN, SUBCUTANEOUS TISSUE AND BREAST",2,Moderate,Minor,Medical,Private Health Insurance,,,,,true,72739.64,11716.33
Long Island,Nassau,2908000,000511,NYU Langone Hospital-Long Island,30 to 49,110,F,White,Not Span/Hispanic,10,Emergency,Home w/ Home Health Services,2019,END003,DIABETES MELLITUS WITH COMPLICATION,MST020,SUBCUTANEOUS TISSUE AND FASCIA EXCISION,380,SKIN ULCERS,09,"DISEASES AND DISORDERS OF THE SKIN, SUBCUTANEOUS TISSUE AND BREAST",2,Moderate,Moderate,Medical,Medicaid,Medicaid,,,,true,119821.06,23797.32
Long Island,Nassau,2908000,000511,NYU Langone Hospital-Long Island,70 or Older,115,F,White,Not Span/Hispanic,2,Emergency,Home w/ Home Health Services,2019,END003,DIABETES MELLITUS WITH COMPLICATION,,,380,SKIN ULCERS,09,"DISEASES AND DISORDERS OF THE SKIN, SUBCUTANEOUS TISSUE AND BREAST",2,Moderate,Moderate,Medical,Medicare,Medicare,Private Health Insurance,,,true,43922.73,7110.77
Long Island,Nassau,2908000,000511,NYU Langone Hospital-Long Island,70 or Older,110,M,Other Race,Spanish/Hispanic,5,Emergency,Home w/ Home Health Services,2019,END003,DIABETES MELLITUS WITH COMPLICATION,,,380,SKIN ULCERS,09,"DISEASES AND DISORDERS OF THE SKIN, SUBCUTANEOUS TISSUE AND BREAST",2,Moderate,Moderate,Medical,Medicare,Medicare,Medicaid,,,true,57589.14,10985.09
Long Island,Nassau,2908000,000511,NYU Langone Hospital-Long Island,50 to 69,116,F,White,Not Span/Hispanic,8,Emergency,Home w/ Home Health Services,2019,SKN004,NON-PRESSURE ULCER OF SKIN,MST020,SUBCUTANEOUS TISSUE AND FASCIA EXCISION,380,SKIN ULCERS,09,"DISEASES AND DISORDERS OF THE SKIN, SUBCUTANEOUS TISSUE AND BREAST",3,Major,Minor,Medical,Private Health Insurance,,,,,true,115059.51,24986.49
Long Island,Nassau,2908000,000511,NYU Langone Hospital-Long Island,50 to 69,117,M,White,Not Span/Hispanic,5,Emergency,Home or Self Care,2019,END003,DIABETES MELLITUS WITH COMPLICATION,ESA001,HEMODIALYSIS,380,SKIN ULCERS,09,"DISEASES AND DISORDERS OF THE SKIN, SUBCUTANEOUS TISSUE AND BREAST",3,Major,Major,Medical,Medicare,Medicare,Blue Cross/Blue Shield,,,true,98303.47,15466.86
Long Island,Nassau,2908000,000511,NYU Langone Hospital-Long Island,70 or Older,118,F,White,Not Span/Hispanic,8,Emergency,Skilled Nursing Home,2019,SKN004,NON-PRESSURE ULCER OF SKIN,MST020,SUBCUTANEOUS TISSUE AND FASCIA EXCISION,380,SKIN ULCERS,09,"DISEASES AND DISORDERS OF THE SKIN, SUBCUTANEOUS TISSUE AND BREAST",2,Moderate,Minor,Medical,Medicare,Medicare,Private Health Insurance,,,true,97482.03,22584.85
Long Island,Nassau,2908000,000511,NYU Langone Hospital-Long Island,50 to 69,115,M,White,Not Span/Hispanic,7,Emergency,Home or Self Care,2019,END003,DIABETES MELLITUS WITH COMPLICATION,,,380,SKIN ULCERS,09,"DISEASES AND DISORDERS OF THE SKIN, SUBCUTANEOUS TISSUE AND BREAST",2,Moderate,Moderate,Medical,Private Health Insurance,,,,,true,71934.39,14659.37
Long Island,Nassau,2908000,000511,NYU Langone Hospital-Long Island,50 to 69,115,F,White,Not Span/Hispanic,4,Emergency,Skilled Nursing Home,2019,END003,DIABETES MELLITUS WITH COMPLICATION,,,380,SKIN ULCERS,09,"DISEASES AND DISORDERS OF THE SKIN, SUBCUTANEOUS TISSUE AND BREAST",3,Major,Major,Medical,Medicare,Medicare,Private Health Insurance,,,true,51082.85,9028.28
Long Island,Nassau,2908000,000511,NYU Langone Hospital-Long Island,70 or Older,115,M,White,Not Span/Hispanic,4,Emergency,Skilled Nursing Home,2019,SKN003,PRESSURE ULCER OF SKIN,,,380,SKIN ULCERS,09,"DISEASES AND DISORDERS OF THE SKIN, SUBCUTANEOUS TISSUE AND BREAST",3,Major,Major,Medical,Medicare,Medicare,Blue Cross/Blue Shield,,,true,76791.63,10505.29
Long Island,Nassau,2908000,000511,NYU Langone Hospital-Long Island,70 or Older,115,M,White,Not Span/Hispanic,1,Emergency,Home w/ Home Health Services,2019,END003,DIABETES MELLITUS WITH COMPLICATION,,,380,SKIN ULCERS,09,"DISEASES AND DISORDERS OF THE SKIN, SUBCUTANEOUS TISSUE AND BREAST",3,Major,Major,Medical,Medicare,Medicare,Private Health Insurance,,,true,56205.06,5780.64
Long Island,Nassau,2908000,000511,NYU Langone Hospital-Long Island,70 or Older,117,M,White,Not Span/Hispanic,4,Emergency,Home w/ Home Health Services,2019,SKN003,PRESSURE ULCER OF SKIN,ESA003,MECHANICAL VENTILATION,380,SKIN ULCERS,09,"DISEASES AND DISORDERS OF THE SKIN, SUBCUTANEOUS TISSUE AND BREAST",3,Major,Major,Medical,Medicare,Medicare,Blue Cross/Blue Shield,,,true,35134.67,7836.14
Long Island,Nassau,2908000,000511,NYU Langone Hospital-Long Island,50 to 69,117,F,White,Not Span/Hispanic,1,Emergency,Home or Self Care,2019,END003,DIABETES MELLITUS WITH COMPLICATION,,,380,SKIN ULCERS,09,"DISEASES AND DISORDERS OF THE SKIN, SUBCUTANEOUS TISSUE AND BREAST",2,Moderate,Minor,Medical,Medicaid,,,,,true,24286.16,3689.55
Long Island,Nassau,2908000,000511,NYU Langone Hospital-Long Island,30 to 49,115,M,White,Unknown,2,Emergency,Home w/ Home Health Services,2019,SKN003,PRESSURE ULCER OF SKIN,ESA001,HEMODIALYSIS,380,SKIN ULCERS,09,"DISEASES AND DISORDERS OF THE SKIN, SUBCUTANEOUS TISSUE AND BREAST",3,Major,Major,Medical,Medicaid,,,,,true,47092.27,6879.45
Long Island,Nassau,2908000,000511,NYU Langone Hospital-Long Island,50 to 69,110,M,White,Not Span/Hispanic,4,Emergency,Home w/ Home Health Services,2019,SKN003,PRESSURE ULCER OF SKIN,ADM001,TRANSFUSION OF BLOOD AND BLOOD PRODUCTS,380,SKIN ULCERS,09,"DISEASES AND DISORDERS OF THE SKIN, SUBCUTANEOUS TISSUE AND BREAST",3,Major,Major,Medical,Blue Cross/Blue Shield,,,,,true,40012.16,8539.75
Long Island,Nassau,2908000,000511,NYU Langone Hospital-Long Island,50 to 69,115,M,Other Race,Spanish/Hispanic,5,Emergency,Home or Self Care,2019,END003,DIABETES MELLITUS WITH COMPLICATION,,,380,SKIN ULCERS,09,"DISEASES AND DISORDERS OF THE SKIN, SUBCUTANEOUS TISSUE AND BREAST",2,Moderate,Moderate,Medical,Medicaid,,,,,true,82268.98,14030.96
Long Island,Nassau,2908000,000511,NYU Langone Hospital-Long Island,50 to 69,110,M,Other Race,Spanish/Hispanic,3,Emergency,Home or Self Care,2019,END003,DIABETES MELLITUS WITH COMPLICATION,SKB002,INCISION AND DRAINAGE OF SKIN,380,SKIN ULCERS,09,"DISEASES AND DISORDERS OF THE SKIN, SUBCUTANEOUS TISSUE AND BREAST",2,Moderate,Minor,Medical,Medicaid,,,,,true,68424.18,10059.68
Long Island,Nassau,2908000,000511,NYU Langone Hospital-Long Island,70 or Older,115,M,White,Unknown,5,Emergency,Skilled Nursing Home,2019,END003,DIABETES MELLITUS WITH COMPLICATION,CAR024,VENOUS AND ARTERIAL CATHETER PLACEMENT,380,SKIN ULCERS,09,"DISEASES AND DISORDERS OF THE SKIN, SUBCUTANEOUS TISSUE AND BREAST",3,Major,Major,Medical,Medicaid,,,,,true,92347.15,15551.06
