Hospital Service Area,Hospital County,Operating Certificate Number,Permanent Facility Id,Facility Name,Age Group,Zip Code - 3 digits,Gender,Race,Ethnicity,Length of Stay,Type of Admission,Patient Disposition,Discharge Year,CCS Diagnosis Code,CCS Diagnosis Description,CCS Procedure Code,CCS Procedure Description,APR DRG Code,APR DRG Description,APR MDC Code,APR MDC Description,APR Severity of Illness Code,APR Severity of Illness Description,APR Risk of Mortality,APR Medical Surgical Description,Payment Typology 1,Payment Typology 2,Payment Typology 3,Birth Weight,Abortion Edit Indicator,Emergency Department Indicator,Total Charges,Total Costs
New York City,Bronx,7000011,001175,Calvary Hospital Inc,70 or Older,104,M,White,Not Span/Hispanic,1,Elective,Expired,2017,023,Other non-epithelial cancer of skin,000,NO PROC,381,Major skin disorders,09,"Diseases and Disorders of the Skin, Subcutaneous Tissue and Breast",2,Moderate,Major,Medical,Private Health Insurance,,,,N,N,2193.92,1189.25
New York City,Manhattan,7002024,001456,Mount Sinai Hospital,50 to 69,115,M,White,Not Span/Hispanic,3,Emergency,Home or Self Care,2017,198,Other inflammatory condition of skin,000,NO PROC,381,Major skin disorders,09,"Diseases and Disorders of the Skin, Subcutaneous Tissue and Breast",2,Moderate,Minor,Medical,Blue Cross/Blue Shield,Private Health Insurance,Self-Pay,,N,Y,35160.99,12717.80
New York City,Kings,7001037,001320,University Hospital of Brooklyn,0 to 17,112,M,Black/African American,Not Span/Hispanic,2,Emergency,Home or Self Care,2017,198,Other inflammatory condition of skin,231,OTHER THERAPEUTIC PRCS,381,Major skin disorders,09,"Diseases and Disorders of the Skin, Subcutaneous Tissue and Breast",1,Minor,Minor,Medical,Federal/State/Local/VA,Private Health Insurance,Self-Pay,,N,Y,10446.00,14260.15
New York City,Manhattan,7002024,001456,Mount Sinai Hospital,0 to 17,112,F,Black/African American,Not Span/Hispanic,4,Urgent,Home or Self Care,2017,198,Other inflammatory condition of skin,000,NO PROC,381,Major skin disorders,09,"Diseases and Disorders of the Skin, Subcutaneous Tissue and Breast",1,Minor,Minor,Medical,Medicaid,Medicaid,Self-Pay,,N,N,26686.21,21549.21
Long Island,Nassau,2950002,000528,Nassau University Medical Center,18 to 29,115,M,Black/African American,Not Span/Hispanic,3,Emergency,Home or Self Care,2017,198,Other inflammatory condition of skin,000,NO PROC,381,Major skin disorders,09,"Diseases and Disorders of the Skin, Subcutaneous Tissue and Breast",2,Moderate,Minor,Medical,Medicaid,Medicaid,Self-Pay,,N,N,17226.84,6280.30
New York City,Kings,7001008,001293,"New York Community Hospital of Brooklyn, Inc",70 or Older,112,F,White,Not Span/Hispanic,9,Emergency,Home or Self Care,2017,042,Secondary malignancies,061,OT OR PRCS VES NOT HEAD,381,Major skin disorders,09,"Diseases and Disorders of the Skin, Subcutaneous Tissue and Breast",3,Major,Major,Medical,Medicare,Blue Cross/Blue Shield,Self-Pay,,N,Y,27824.81,17595.71
New York City,Kings,7001021,001306,New York - Presbyterian Brooklyn Methodist Hospital,70 or Older,112,M,Other Race,Not Span/Hispanic,3,Emergency,Home or Self Care,2017,198,Other inflammatory condition of skin,000,NO PROC,381,Major skin disorders,09,"Diseases and Disorders of the Skin, Subcutaneous Tissue and Breast",2,Moderate,Moderate,Medical,Medicare,Medicaid,Self-Pay,,N,Y,16918.46,5341.30
New York City,Kings,7001021,001306,New York - Presbyterian Brooklyn Methodist Hospital,50 to 69,112,M,White,Not Span/Hispanic,12,Emergency,Home or Self Care,2017,198,Other inflammatory condition of skin,173,OT DX PRC SKIN/SUBCUTAN,381,Major skin disorders,09,"Diseases and Disorders of the Skin, Subcutaneous Tissue and Breast",2,Moderate,Moderate,Medical,Medicaid,Self-Pay,,,N,Y,158888.10,63844.75
New York City,Kings,7001021,001306,New York - Presbyterian Brooklyn Methodist Hospital,70 or Older,112,F,White,Not Span/Hispanic,8,Emergency,Home or Self Care,2017,198,Other inflammatory condition of skin,000,NO PROC,381,Major skin disorders,09,"Diseases and Disorders of the Skin, Subcutaneous Tissue and Breast",2,Moderate,Moderate,Medical,Medicare,Private Health Insurance,Self-Pay,,N,Y,51434.61,16976.71
New York City,Manhattan,7002054,001458,New York Presbyterian Hospital - New York Weill Cornell Center,0 to 17,113,F,Other Race,Not Span/Hispanic,8,Emergency,Home or Self Care,2017,198,Other inflammatory condition of skin,173,OT DX PRC SKIN/SUBCUTAN,381,Major skin disorders,09,"Diseases and Disorders of the Skin, Subcutaneous Tissue and Breast",2,Moderate,Minor,Medical,Blue Cross/Blue Shield,Self-Pay,,,N,N,149271.93,89840.00
New York City,Manhattan,7002054,001464,New York Presbyterian Hospital - Columbia Presbyterian Center,30 to 49,100,M,Other Race,Not Span/Hispanic,6,Urgent,Home or Self Care,2017,198,Other inflammatory condition of skin,173,OT DX PRC SKIN/SUBCUTAN,381,Major skin disorders,09,"Diseases and Disorders of the Skin, Subcutaneous Tissue and Breast",3,Major,Major,Medical,Private Health Insurance,Self-Pay,,,N,N,58159.25,13927.92
New York City,Manhattan,7002054,001464,New York Presbyterian Hospital - Columbia Presbyterian Center,50 to 69,104,F,White,Not Span/Hispanic,4,Urgent,Hospice - Medical Facility,2017,022,Melanomas of skin,000,NO PROC,381,Major skin disorders,09,"Diseases and Disorders of the Skin, Subcutaneous Tissue and Breast",3,Major,Major,Medical,Blue Cross/Blue Shield,Self-Pay,,,N,N,35884.17,8721.81
New York City,Manhattan,7002054,001464,New York Presbyterian Hospital - Columbia Presbyterian Center,50 to 69,104,M,White,Spanish/Hispanic,4,Emergency,Home or Self Care,2017,041,Cancer; other and unspecified primary,004,DIAGNOSTIC SPINAL TAP,381,Major skin disorders,09,"Diseases and Disorders of the Skin, Subcutaneous Tissue and Breast",3,Major,Moderate,Medical,Medicaid,Medicaid,Self-Pay,,N,Y,66809.70,18006.61
New York City,Manhattan,7002054,001464,New York Presbyterian Hospital - Columbia Presbyterian Center,0 to 17,100,F,Multi-racial,Not Span/Hispanic,1,Emergency,Home or Self Care,2017,007,Viral infection,222,BLOOD TRANSFUSION,381,Major skin disorders,09,"Diseases and Disorders of the Skin, Subcutaneous Tissue and Breast",1,Minor,Minor,Medical,Medicaid,Medicaid,Self-Pay,,N,Y,15040.65,3705.71
New York City,Manhattan,7002054,003975,New York Presbyterian Hospital - Allen Hospital,50 to 69,104,M,White,Not Span/Hispanic,6,Emergency,Home w/ Home Health Services,2017,198,Other inflammatory condition of skin,173,OT DX PRC SKIN/SUBCUTAN,381,Major skin disorders,09,"Diseases and Disorders of the Skin, Subcutaneous Tissue and Breast",2,Moderate,Minor,Medical,Medicare,Private Health Insurance,Medicaid,,N,Y,61906.57,15070.23
New York City,Bronx,7000011,001175,Calvary Hospital Inc,70 or Older,100,M,White,Not Span/Hispanic,73,Elective,Skilled Nursing Home,2017,022,Melanomas of skin,000,NO PROC,381,Major skin disorders,09,"Diseases and Disorders of the Skin, Subcutaneous Tissue and Breast",3,Major,Major,Medical,Medicare,,,,N,N,146288.98,79298.28
New York City,Bronx,7000011,001175,Calvary Hospital Inc,70 or Older,100,F,White,Not Span/Hispanic,20,Elective,Expired,2017,022,Melanomas of skin,041,OT NON-OR THER PRC RESP,381,Major skin disorders,09,"Diseases and Disorders of the Skin, Subcutaneous Tissue and Breast",2,Moderate,Major,Medical,Medicare,,,,N,N,39312.36,21309.89
New York City,Bronx,7000011,001175,Calvary Hospital Inc,30 to 49,,M,White,Not Span/Hispanic,17,Elective,Expired,2017,022,Melanomas of skin,000,NO PROC,381,Major skin disorders,09,"Diseases and Disorders of the Skin, Subcutaneous Tissue and Breast",2,Moderate,Major,Medical,Private Health Insurance,Blue Cross/Blue Shield,,,N,N,35266.79,19116.93
New York City,Bronx,7000011,001175,Calvary Hospital Inc,70 or Older,113,F,White,Not Span/Hispanic,4,Elective,Expired,2017,022,Melanomas of skin,000,NO PROC,381,Major skin disorders,09,"Diseases and Disorders of the Skin, Subcutaneous Tissue and Breast",2,Moderate,Major,Medical,Medicare,Medicaid,,,N,N,8295.70,4496.82
New York City,Manhattan,7002024,001456,Mount Sinai Hospital,0 to 17,100,F,White,Not Span/Hispanic,7,Emergency,Home or Self Care,2017,007,Viral infection,000,NO PROC,381,Major skin disorders,09,"Diseases and Disorders of the Skin, Subcutaneous Tissue and Breast",2,Moderate,Minor,Medical,Private Health Insurance,Self-Pay,,,N,Y,49134.15,38642.26
Western NY,Erie,1401014,000208,Women And Children's Hospital Of Buffalo,0 to 17,142,F,White,Not Span/Hispanic,6,Emergency,Home or Self Care,2017,198,Other inflammatory condition of skin,000,NO PROC,381,Major skin disorders,09,"Diseases and Disorders of the Skin, Subcutaneous Tissue and Breast",3,Major,Minor,Medical,Blue Cross/Blue Shield,Self-Pay,,,N,Y,21877.73,11495.46
Western NY,Erie,1401014,000208,Women And Children's Hospital Of Buffalo,0 to 17,142,F,Black/African American,Not Span/Hispanic,2,Emergency,Home or Self Care,2017,198,Other inflammatory condition of skin,000,NO PROC,381,Major skin disorders,09,"Diseases and Disorders of the Skin, Subcutaneous Tissue and Breast",1,Minor,Minor,Medical,Medicaid,Self-Pay,,,N,Y,6954.00,3909.72
Western NY,Erie,1401014,000208,Women And Children's Hospital Of Buffalo,18 to 29,142,F,Black/African American,Not Span/Hispanic,3,Urgent,Home or Self Care,2017,007,Viral infection,000,NO PROC,381,Major skin disorders,09,"Diseases and Disorders of the Skin, Subcutaneous Tissue and Breast",1,Minor,Minor,Medical,Medicaid,Self-Pay,,,N,Y,9115.17,5426.24
Western NY,Erie,1401014,000208,Women And Children's Hospital Of Buffalo,0 to 17,140,M,White,Not Span/Hispanic,3,Emergency,Home w/ Home Health Services,2017,198,Other inflammatory condition of skin,231,OTHER THERAPEUTIC PRCS,381,Major skin disorders,09,"Diseases and Disorders of the Skin, Subcutaneous Tissue and Breast",2,Moderate,Minor,Medical,Medicaid,Self-Pay,,,N,Y,9493.80,5518.61
Western NY,Erie,1401005,000210,Erie County Medical Center,30 to 49,147,F,White,Unknown,14,Elective,Expired,2017,198,Other inflammatory condition of skin,216,RESP INTUB/MECH VENTIL,381,Major skin disorders,09,"Diseases and Disorders of the Skin, Subcutaneous Tissue and Breast",4,Extreme,Extreme,Medical,Blue Cross/Blue Shield,,,,N,N,68710.98,45796.44
Western NY,Erie,1401005,000210,Erie County Medical Center,50 to 69,142,F,Black/African American,Not Span/Hispanic,9,Emergency,Expired,2017,042,Secondary malignancies,063,OT NON-OR THER CARDIO,381,Major skin disorders,09,"Diseases and Disorders of the Skin, Subcutaneous Tissue and Breast",3,Major,Major,Medical,Medicaid,Medicaid,,,N,Y,15974.49,10515.90
New York City,Bronx,7000006,001169,Montefiore Medical Center - Henry & Lucy Moses Div,0 to 17,OOS,M,White,Spanish/Hispanic,4,Emergency,Home or Self Care,2017,007,Viral infection,231,OTHER THERAPEUTIC PRCS,381,Major skin disorders,09,"Diseases and Disorders of the Skin, Subcutaneous Tissue and Breast",3,Major,Moderate,Medical,Medicaid,,,,N,Y,42048.65,11684.60
Central NY,Jefferson,2201000,000367,Samaritan Medical Center,50 to 69,136,F,White,Not Span/Hispanic,5,Emergency,Home w/ Home Health Services,2017,198,Other inflammatory condition of skin,000,NO PROC,381,Major skin disorders,09,"Diseases and Disorders of the Skin, Subcutaneous Tissue and Breast",2,Moderate,Minor,Medical,Medicare,Medicaid,Self-Pay,,N,Y,42606.49,10394.95
Capital/Adirond,Otsego,3824000,000746,Mary Imogene Bassett Hospital,30 to 49,134,F,White,Not Span/Hispanic,4,Emergency,Short-term Hospital,2017,198,Other inflammatory condition of skin,000,NO PROC,381,Major skin disorders,09,"Diseases and Disorders of the Skin, Subcutaneous Tissue and Breast",2,Moderate,Minor,Medical,Blue Cross/Blue Shield,Self-Pay,,,N,Y,7275.04,4292.83
New York City,Kings,7001037,001320,University Hospital of Brooklyn,0 to 17,112,M,Black/African American,Not Span/Hispanic,4,Urgent,Home or Self Care,2017,007,Viral infection,000,NO PROC,381,Major skin disorders,09,"Diseases and Disorders of the Skin, Subcutaneous Tissue and Breast",1,Minor,Minor,Medical,Medicaid,Medicaid,Self-Pay,,N,N,15577.00,26334.28
New York City,Kings,7001021,001306,New York - Presbyterian Brooklyn Methodist Hospital,70 or Older,112,M,Other Race,Not Span/Hispanic,6,Emergency,Home w/ Home Health Services,2017,198,Other inflammatory condition of skin,173,OT DX PRC SKIN/SUBCUTAN,381,Major skin disorders,09,"Diseases and Disorders of the Skin, Subcutaneous Tissue and Breast",4,Extreme,Major,Medical,Medicare,Medicare,Self-Pay,,N,Y,45745.58,13726.51
New York City,Manhattan,7002024,001456,Mount Sinai Hospital,0 to 17,104,F,Black/African American,Not Span/Hispanic,3,Emergency,Home or Self Care,2017,007,Viral infection,000,NO PROC,381,Major skin disorders,09,"Diseases and Disorders of the Skin, Subcutaneous Tissue and Breast",1,Minor,Minor,Medical,Private Health Insurance,Medicaid,Self-Pay,,N,Y,22493.48,17072.57
New York City,Manhattan,7002054,001458,New York Presbyterian Hospital - New York Weill Cornell Center,18 to 29,104,M,Multi-racial,Not Span/Hispanic,6,Urgent,Home w/ Home Health Services,2017,198,Other inflammatory condition of skin,231,OTHER THERAPEUTIC PRCS,381,Major skin disorders,09,"Diseases and Disorders of the Skin, Subcutaneous Tissue and Breast",2,Moderate,Minor,Medical,Medicaid,Medicaid,Self-Pay,,N,N,113749.48,41666.47
New York City,Manhattan,7002054,001464,New York Presbyterian Hospital - Columbia Presbyterian Center,50 to 69,100,F,Other Race,Not Span/Hispanic,3,Emergency,Home or Self Care,2017,022,Melanomas of skin,000,NO PROC,381,Major skin disorders,09,"Diseases and Disorders of the Skin, Subcutaneous Tissue and Breast",2,Moderate,Moderate,Medical,Medicaid,Medicaid,Self-Pay,,N,Y,34075.48,8779.31
New York City,Manhattan,7002054,001464,New York Presbyterian Hospital - Columbia Presbyterian Center,0 to 17,OOS,M,Black/African American,Not Span/Hispanic,1,Emergency,Home or Self Care,2017,007,Viral infection,000,NO PROC,381,Major skin disorders,09,"Diseases and Disorders of the Skin, Subcutaneous Tissue and Breast",1,Minor,Minor,Medical,Private Health Insurance,Self-Pay,,,N,Y,11167.95,4267.75
New York City,Manhattan,7002054,001464,New York Presbyterian Hospital - Columbia Presbyterian Center,0 to 17,100,F,Multi-racial,Spanish/Hispanic,1,Emergency,Home or Self Care,2017,007,Viral infection,222,BLOOD TRANSFUSION,381,Major skin disorders,09,"Diseases and Disorders of the Skin, Subcutaneous Tissue and Breast",1,Minor,Minor,Medical,Blue Cross/Blue Shield,Self-Pay,,,N,Y,15168.11,3958.40
New York City,Manhattan,7002054,003975,New York Presbyterian Hospital - Allen Hospital,30 to 49,100,F,Multi-racial,Multi-ethnic,6,Emergency,Home or Self Care,2017,198,Other inflammatory condition of skin,173,OT DX PRC SKIN/SUBCUTAN,381,Major skin disorders,09,"Diseases and Disorders of the Skin, Subcutaneous Tissue and Breast",3,Major,Minor,Medical,Medicaid,Self-Pay,,,N,Y,66941.32,16226.82
New York City,Manhattan,7002054,003975,New York Presbyterian Hospital - Allen Hospital,50 to 69,100,M,Other Race,Multi-ethnic,1,Emergency,Home or Self Care,2017,198,Other inflammatory condition of skin,000,NO PROC,381,Major skin disorders,09,"Diseases and Disorders of the Skin, Subcutaneous Tissue and Breast",2,Moderate,Moderate,Medical,Medicare,Medicare,Medicaid,,N,Y,12329.21,3259.24
New York City,Queens,7003010,001637,New York - Presbyterian/Queens,0 to 17,113,M,Other Race,Spanish/Hispanic,3,Emergency,Home or Self Care,2017,007,Viral infection,231,OTHER THERAPEUTIC PRCS,381,Major skin disorders,09,"Diseases and Disorders of the Skin, Subcutaneous Tissue and Breast",1,Minor,Minor,Medical,Medicaid,Medicaid,Self-Pay,,N,Y,18379.50,13588.74
New York City,Bronx,7000006,001168,Montefiore Medical Center-Wakefield Hospital,50 to 69,104,F,White,Not Span/Hispanic,3,Emergency,Home or Self Care,2017,198,Other inflammatory condition of skin,173,OT DX PRC SKIN/SUBCUTAN,381,Major skin disorders,09,"Diseases and Disorders of the Skin, Subcutaneous Tissue and Breast",3,Major,Minor,Medical,Medicare,,,,N,Y,35012.15,6348.63
New York City,Bronx,7000006,001168,Montefiore Medical Center-Wakefield Hospital,70 or Older,104,F,White,Not Span/Hispanic,1,Emergency,Home or Self Care,2017,042,Secondary malignancies,000,NO PROC,381,Major skin disorders,09,"Diseases and Disorders of the Skin, Subcutaneous Tissue and Breast",2,Moderate,Major,Medical,Medicare,Medicaid,,,N,Y,42777.85,6218.03
New York City,Kings,7001016,001301,Kings County Hospital Center,0 to 17,112,F,Black/African American,Not Span/Hispanic,2,Emergency,Home or Self Care,2017,198,Other inflammatory condition of skin,000,NO PROC,381,Major skin disorders,09,"Diseases and Disorders of the Skin, Subcutaneous Tissue and Breast",1,Minor,Minor,Medical,Medicaid,Medicaid,,,N,Y,12953.47,7786.03
New York City,Manhattan,7002001,001438,Bellevue Hospital Center,30 to 49,112,M,Other Race,Not Span/Hispanic,2,Emergency,Home or Self Care,2017,198,Other inflammatory condition of skin,173,OT DX PRC SKIN/SUBCUTAN,381,Major skin disorders,09,"Diseases and Disorders of the Skin, Subcutaneous Tissue and Breast",1,Minor,Minor,Medical,Medicaid,,,,N,Y,13899.59,8961.73
New York City,Manhattan,7002001,001438,Bellevue Hospital Center,50 to 69,100,M,Other Race,Not Span/Hispanic,4,Emergency,Home or Self Care,2017,198,Other inflammatory condition of skin,173,OT DX PRC SKIN/SUBCUTAN,381,Major skin disorders,09,"Diseases and Disorders of the Skin, Subcutaneous Tissue and Breast",1,Minor,Minor,Medical,Private Health Insurance,,,,N,Y,24677.32,15910.65
New York City,Manhattan,7002009,001445,Harlem Hospital Center,18 to 29,100,F,Black/African American,Not Span/Hispanic,2,Emergency,Home or Self Care,2017,198,Other inflammatory condition of skin,000,NO PROC,381,Major skin disorders,09,"Diseases and Disorders of the Skin, Subcutaneous Tissue and Breast",2,Moderate,Minor,Medical,Blue Cross/Blue Shield,,,,N,N,13230.37,10287.87
New York City,Manhattan,7002017,001450,Lenox Hill Hospital,70 or Older,112,M,White,Not Span/Hispanic,5,Emergency,Home or Self Care,2017,198,Other inflammatory condition of skin,093,OT NON-OR UP GI THER PR,381,Major skin disorders,09,"Diseases and Disorders of the Skin, Subcutaneous Tissue and Breast",2,Moderate,Moderate,Medical,Medicare,Medicaid,,,N,Y,44923.00,7273.06
New York City,Manhattan,7002053,001463,NYU Langone Hospitals,50 to 69,114,F,White,Not Span/Hispanic,2,Emergency,Home or Self Care,2017,198,Other inflammatory condition of skin,000,NO PROC,381,Major skin disorders,09,"Diseases and Disorders of the Skin, Subcutaneous Tissue and Breast",1,Minor,Minor,Medical,Blue Cross/Blue Shield,,,,N,Y,19370.51,8765.75
New York City,Queens,7003000,001626,Elmhurst Hospital Center,0 to 17,111,M,Other Race,Not Span/Hispanic,1,Urgent,Short-term Hospital,2017,007,Viral infection,000,NO PROC,381,Major skin disorders,09,"Diseases and Disorders of the Skin, Subcutaneous Tissue and Breast",1,Minor,Minor,Medical,Federal/State/Local/VA,,,,N,N,5546.95,2780.09
New York City,Queens,7003000,001626,Elmhurst Hospital Center,0 to 17,113,M,Other Race,Not Span/Hispanic,1,Emergency,Home or Self Care,2017,007,Viral infection,000,NO PROC,381,Major skin disorders,09,"Diseases and Disorders of the Skin, Subcutaneous Tissue and Breast",1,Minor,Minor,Medical,Medicaid,Medicaid,,,N,N,6111.50,3063.03
New York City,Queens,7003004,001638,Long Island Jewish Forest Hills,70 or Older,113,F,White,Not Span/Hispanic,2,Emergency,Home or Self Care,2017,022,Melanomas of skin,088,ABDOMINAL PARACENTESIS,381,Major skin disorders,09,"Diseases and Disorders of the Skin, Subcutaneous Tissue and Breast",3,Major,Major,Medical,Medicare,Medicaid,,,N,Y,36215.57,6066.19
Long Island,Suffolk,5151001,000245,University Hospital,50 to 69,,F,Other Race,Unknown,13,Urgent,Home or Self Care,2017,198,Other inflammatory condition of skin,173,OT DX PRC SKIN/SUBCUTAN,381,Major skin disorders,09,"Diseases and Disorders of the Skin, Subcutaneous Tissue and Breast",2,Moderate,Minor,Medical,Medicaid,Medicaid,,,N,N,169496.87,96093.95
Long Island,Suffolk,5151001,000245,University Hospital,30 to 49,117,F,White,Not Span/Hispanic,8,Emergency,Home w/ Home Health Services,2017,198,Other inflammatory condition of skin,173,OT DX PRC SKIN/SUBCUTAN,381,Major skin disorders,09,"Diseases and Disorders of the Skin, Subcutaneous Tissue and Breast",2,Moderate,Minor,Medical,Medicaid,,,,N,Y,61107.24,18485.23
Long Island,Nassau,2951001,000541,North Shore University Hospital,50 to 69,113,M,Black/African American,Unknown,3,Emergency,Home or Self Care,2017,198,Other inflammatory condition of skin,000,NO PROC,381,Major skin disorders,09,"Diseases and Disorders of the Skin, Subcutaneous Tissue and Breast",2,Moderate,Minor,Medical,Medicare,,,,N,Y,30804.99,5778.45
Finger Lakes,Monroe,2701005,000413,Strong Memorial Hospital,18 to 29,145,M,White,Not Span/Hispanic,4,Emergency,Home or Self Care,2017,198,Other inflammatory condition of skin,223,ENTERAL/PARENTERAL NUTR,381,Major skin disorders,09,"Diseases and Disorders of the Skin, Subcutaneous Tissue and Breast",1,Minor,Minor,Medical,Blue Cross/Blue Shield,Self-Pay,,,N,Y,10729.49,6327.11
Finger Lakes,Monroe,2701005,000413,Strong Memorial Hospital,70 or Older,144,M,White,Not Span/Hispanic,10,Emergency,Home w/ Home Health Services,2017,198,Other inflammatory condition of skin,174,OT NON-OR THER PRC SKIN,381,Major skin disorders,09,"Diseases and Disorders of the Skin, Subcutaneous Tissue and Breast",3,Major,Major,Medical,Medicare,Medicare,Self-Pay,,N,Y,53659.00,34038.06
Finger Lakes,Monroe,2701005,000413,Strong Memorial Hospital,70 or Older,146,M,Other Race,Spanish/Hispanic,2,Emergency,Home or Self Care,2017,198,Other inflammatory condition of skin,000,NO PROC,381,Major skin disorders,09,"Diseases and Disorders of the Skin, Subcutaneous Tissue and Breast",1,Minor,Minor,Medical,Medicare,Medicaid,Self-Pay,,N,Y,9004.07,4714.36
Capital/Adirond,Albany,0101000,000001,Albany Medical Center Hospital,0 to 17,124,M,White,Not Span/Hispanic,11,Emergency,Home or Self Care,2017,198,Other inflammatory condition of skin,070,UP GASTRO ENDOSC/BIOPSY,381,Major skin disorders,09,"Diseases and Disorders of the Skin, Subcutaneous Tissue and Breast",3,Major,Minor,Medical,Blue Cross/Blue Shield,,,,N,Y,59671.74,24122.18
New York City,Kings,7001033,001315,Kingsbrook Jewish Medical Center,50 to 69,112,F,Black/African American,Not Span/Hispanic,9,Emergency,Home or Self Care,2017,198,Other inflammatory condition of skin,049,OTHER OR HEART PRCS,381,Major skin disorders,09,"Diseases and Disorders of the Skin, Subcutaneous Tissue and Breast",2,Moderate,Moderate,Medical,Medicaid,Medicaid,Self-Pay,,N,Y,67679.00,23637.08
New York City,Kings,7001033,001315,Kingsbrook Jewish Medical Center,50 to 69,112,F,Black/African American,Not Span/Hispanic,4,Emergency,Home or Self Care,2017,198,Other inflammatory condition of skin,058,HEMODIALYSIS,381,Major skin disorders,09,"Diseases and Disorders of the Skin, Subcutaneous Tissue and Breast",2,Moderate,Moderate,Medical,Medicaid,Medicaid,Self-Pay,,N,Y,28442.00,9808.94
New York City,Manhattan,7002020,001453,Memorial Sloan Kettering Memorial Hospital,70 or Older,114,M,Black/African American,Not Span/Hispanic,7,Emergency,Home or Self Care,2017,198,Other inflammatory condition of skin,173,OT DX PRC SKIN/SUBCUTAN,381,Major skin disorders,09,"Diseases and Disorders of the Skin, Subcutaneous Tissue and Breast",2,Moderate,Moderate,Medical,Medicare,Medicare,,,N,Y,66775.58,27934.02
New York City,Manhattan,7002020,001453,Memorial Sloan Kettering Memorial Hospital,50 to 69,OOS,F,Other Race,Spanish/Hispanic,15,Emergency,Home w/ Home Health Services,2017,198,Other inflammatory condition of skin,000,NO PROC,381,Major skin disorders,09,"Diseases and Disorders of the Skin, Subcutaneous Tissue and Breast",2,Moderate,Moderate,Medical,Medicare,Medicaid,Medicare,,N,Y,107043.88,48211.50