Hospital Service Area,Hospital County,Operating Certificate Number,Permanent Facility Id,Facility Name,Age Group,Zip Code - 3 digits,Gender,Race,Ethnicity,Length of Stay,Type of Admission,Patient Disposition,Discharge Year,CCS Diagnosis Code,CCS Diagnosis Description,CCS Procedure Code,CCS Procedure Description,APR DRG Code,APR DRG Description,APR MDC Code,APR MDC Description,APR Severity of Illness Code,APR Severity of Illness Description,APR Risk of Mortality,APR Medical Surgical Description,Payment Typology 1,Payment Typology 2,Payment Typology 3,Birth Weight,Abortion Edit Indicator,Emergency Department Indicator,Total Charges,Total Costs
Long Island,Nassau,2908000,000511,NYU Langone Hospital-Long Island,30 to 49,115,F,Other Race,Not Span/Hispanic,4,Emergency,Home or Self Care,2020,SKN007,OTHER SPECIFIED AND UNSPECIFIED SKIN DISORDERS,,,381,MAJOR SKIN DISORDERS,09,"DISEASES AND DISORDERS OF THE SKIN, SUBCUTANEOUS TISSUE AND BREAST",2,Moderate,Minor,Medical,Medicaid,,,,,Y,35162.91,13386.29
Long Island,Nassau,2908000,000511,NYU Langone Hospital-Long Island,0 to 17,115,M,Black/African American,Not Span/Hispanic,3,Emergency,Home or Self Care,2020,SKN001,SKIN AND SUBCUTANEOUS TISSUE INFECTIONS,OTR004,ISOLATION PROCEDURES,381,MAJOR SKIN DISORDERS,09,"DISEASES AND DISORDERS OF THE SKIN, SUBCUTANEOUS TISSUE AND BREAST",1,Minor,Minor,Medical,Medicaid,,,,,Y,26987.24,7424.58
Long Island,Nassau,2908000,000511,NYU Langone Hospital-Long Island,70 or Older,110,M,White,Not Span/Hispanic,3,Emergency,Home or Self Care,2020,SKN002,OTHER SPECIFIED INFLAMMATORY CONDITION OF SKIN,,,381,MAJOR SKIN DISORDERS,09,"DISEASES AND DISORDERS OF THE SKIN, SUBCUTANEOUS TISSUE AND BREAST",2,Moderate,Minor,Medical,Medicare,,,,,Y,42195.21,11174.49
Long Island,Nassau,2908000,000511,NYU Langone Hospital-Long Island,70 or Older,115,F,White,Not Span/Hispanic,6,Emergency,Hospice - Medical Facility,2020,SKN002,OTHER SPECIFIED INFLAMMATORY CONDITION OF SKIN,,,381,MAJOR SKIN DISORDERS,09,"DISEASES AND DISORDERS OF THE SKIN, SUBCUTANEOUS TISSUE AND BREAST",3,Major,Moderate,Medical,Medicare,Medicare,,,,Y,83743.72,29675.98
Long Island,Nassau,2908000,000511,NYU Langone Hospital-Long Island,70 or Older,115,F,Black/African American,Spanish/Hispanic,3,Emergency,Home w/ Home Health Services,2020,SKN002,OTHER SPECIFIED INFLAMMATORY CONDITION OF SKIN,SKB001,SKIN BIOPSY AND DIAGNOSTIC DRAINAGE,381,MAJOR SKIN DISORDERS,09,"DISEASES AND DISORDERS OF THE SKIN, SUBCUTANEOUS TISSUE AND BREAST",2,Moderate,Moderate,Medical,Medicare,Private Health Insurance,,,,Y,58100.42,20500.59
Long Island,Nassau,2908000,000511,NYU Langone Hospital-Long Island,70 or Older,110,M,White,Not Span/Hispanic,3,Emergency,Home or Self Care,2020,SKN002,OTHER SPECIFIED INFLAMMATORY CONDITION OF SKIN,OTR004,ISOLATION PROCEDURES,381,MAJOR SKIN DISORDERS,09,"DISEASES AND DISORDERS OF THE SKIN, SUBCUTANEOUS TISSUE AND BREAST",3,Major,Major,Medical,Medicare,Medicare,,,,Y,51206.91,15615.47
Long Island,Nassau,2908000,000511,NYU Langone Hospital-Long Island,0 to 17,115,F,White,Not Span/Hispanic,1,Emergency,Home or Self Care,2020,SKN007,OTHER SPECIFIED AND UNSPECIFIED SKIN DISORDERS,OTR004,ISOLATION PROCEDURES,381,MAJOR SKIN DISORDERS,09,"DISEASES AND DISORDERS OF THE SKIN, SUBCUTANEOUS TISSUE AND BREAST",1,Minor,Minor,Medical,Blue Cross/Blue Shield,,,,,Y,15819.88,3821.63
Long Island,Nassau,2908000,000511,NYU Langone Hospital-Long Island,0 to 17,115,M,Other Race,Spanish/Hispanic,2,Emergency,Home or Self Care,2020,SKN007,OTHER SPECIFIED AND UNSPECIFIED SKIN DISORDERS,,,381,MAJOR SKIN DISORDERS,09,"DISEASES AND DISORDERS OF THE SKIN, SUBCUTANEOUS TISSUE AND BREAST",1,Minor,Minor,Medical,Medicaid,,,,,Y,23051.54,6501.07
Long Island,Nassau,2908000,000511,NYU Langone Hospital-Long Island,70 or Older,117,F,White,Not Span/Hispanic,2,Emergency,Home w/ Home Health Services,2020,SKN002,OTHER SPECIFIED INFLAMMATORY CONDITION OF SKIN,SKB001,SKIN BIOPSY AND DIAGNOSTIC DRAINAGE,381,MAJOR SKIN DISORDERS,09,"DISEASES AND DISORDERS OF THE SKIN, SUBCUTANEOUS TISSUE AND BREAST",2,Moderate,Minor,Medical,Medicare,Private Health Insurance,,,,Y,39669.58,11219.05
Long Island,Nassau,2908000,000511,NYU Langone Hospital-Long Island,50 to 69,115,M,Other Race,Not Span/Hispanic,4,Emergency,Home w/ Home Health Services,2020,SKN002,OTHER SPECIFIED INFLAMMATORY CONDITION OF SKIN,ESA001,HEMODIALYSIS,381,MAJOR SKIN DISORDERS,09,"DISEASES AND DISORDERS OF THE SKIN, SUBCUTANEOUS TISSUE AND BREAST",3,Major,Major,Medical,Medicare,Medicare,,,,Y,67762.3,20733.21
