Hospital Service Area,Hospital County,Operating Certificate Number,Permanent Facility Id,Facility Name,Age Group,Zip Code - 3 digits,Gender,Race,Ethnicity,Length of Stay,Type of Admission,Patient Disposition,Discharge Year,CCS Diagnosis Code,CCS Diagnosis Description,CCS Procedure Code,CCS Procedure Description,APR DRG Code,APR DRG Description,APR MDC Code,APR MDC Description,APR Severity of Illness Code,APR Severity of Illness Description,APR Risk of Mortality,APR Medical Surgical Description,Payment Typology 1,Payment Typology 2,Payment Typology 3,Birth Weight,Abortion Edit Indicator,Emergency Department Indicator,Total Charges,Total Costs
New York City,Bronx,7000011,001175,Calvary Hospital Inc,50 to 69,OOS,F,White,Not Span/Hispanic,66,Elective,Expired,2017,024,Cancer of breast,000,NO PROC,382,Malignant breast disorders,09,"Diseases and Disorders of the Skin, Subcutaneous Tissue and Breast",3,Major,Major,Medical,Blue Cross/Blue Shield,,,,N,N,133290.77,72252.39
New York City,Bronx,7000011,001175,Calvary Hospital Inc,70 or Older,105,F,White,Not Span/Hispanic,29,Elective,Expired,2017,024,Cancer of breast,221,NASOGASTRIC TUBE,382,Malignant breast disorders,09,"Diseases and Disorders of the Skin, Subcutaneous Tissue and Breast",3,Major,Major,Medical,Medicare,Private Health Insurance,,,N,N,62281.35,33760.60
New York City,Bronx,7000011,001175,Calvary Hospital Inc,50 to 69,104,F,Black/African American,Not Span/Hispanic,15,Elective,Expired,2017,024,Cancer of breast,000,NO PROC,382,Malignant breast disorders,09,"Diseases and Disorders of the Skin, Subcutaneous Tissue and Breast",3,Major,Major,Medical,Blue Cross/Blue Shield,,,,N,N,29776.45,16140.80
New York City,Bronx,7000011,001175,Calvary Hospital Inc,70 or Older,112,F,White,Not Span/Hispanic,15,Elective,Expired,2017,024,Cancer of breast,000,NO PROC,382,Malignant breast disorders,09,"Diseases and Disorders of the Skin, Subcutaneous Tissue and Breast",3,Major,Major,Medical,Medicare,Blue Cross/Blue Shield,,,N,N,30430.01,16495.07
New York City,Bronx,7000011,001175,Calvary Hospital Inc,70 or Older,104,F,White,Not Span/Hispanic,9,Elective,Expired,2017,024,Cancer of breast,000,NO PROC,382,Malignant breast disorders,09,"Diseases and Disorders of the Skin, Subcutaneous Tissue and Breast",3,Major,Major,Medical,Private Health Insurance,Medicare,,,N,N,17682.87,9585.28
New York City,Bronx,7000011,001175,Calvary Hospital Inc,50 to 69,108,F,White,Not Span/Hispanic,8,Elective,Expired,2017,024,Cancer of breast,000,NO PROC,382,Malignant breast disorders,09,"Diseases and Disorders of the Skin, Subcutaneous Tissue and Breast",3,Major,Major,Medical,Private Health Insurance,,,,N,N,16220.27,8792.46
New York City,Bronx,7000006,003058,Montefiore Med Center - Jack D Weiler Hosp of A Einstein College Div,70 or Older,104,F,White,Not Span/Hispanic,6,Emergency,Home w/ Home Health Services,2017,024,Cancer of breast,165,BREAST BIOPSY & DX PRCS,382,Malignant breast disorders,09,"Diseases and Disorders of the Skin, Subcutaneous Tissue and Breast",2,Moderate,Moderate,Medical,Medicare,Medicaid,,,N,Y,70646.84,13560.01
New York City,Manhattan,7002032,001469,Mount Sinai St. Luke's,70 or Older,100,F,White,Spanish/Hispanic,9,Emergency,Home w/ Home Health Services,2017,024,Cancer of breast,183,ROUTINE CHEST X-RAY,382,Malignant breast disorders,09,"Diseases and Disorders of the Skin, Subcutaneous Tissue and Breast",3,Major,Major,Medical,Medicare,Medicare,Medicaid,,N,Y,63414.60,17687.58
New York City,Bronx,7000006,001169,Montefiore Medical Center - Henry & Lucy Moses Div,30 to 49,104,F,White,Not Span/Hispanic,6,Emergency,Home w/ Home Health Services,2017,024,Cancer of breast,039,INCISION OF PLEURA,382,Malignant breast disorders,09,"Diseases and Disorders of the Skin, Subcutaneous Tissue and Breast",3,Major,Major,Medical,Private Health Insurance,,,,N,N,64327.14,14221.75
New York City,Kings,7001021,001306,New York - Presbyterian Brooklyn Methodist Hospital,50 to 69,112,F,Black/African American,Not Span/Hispanic,4,Emergency,Home or Self Care,2017,024,Cancer of breast,000,NO PROC,382,Malignant breast disorders,09,"Diseases and Disorders of the Skin, Subcutaneous Tissue and Breast",3,Major,Major,Medical,Private Health Insurance,Medicaid,Self-Pay,,N,Y,27112.59,7571.48
New York City,Manhattan,7002054,001437,New York-Presbyterian/Lower Manhattan Hospital,18 to 29,100,F,White,Not Span/Hispanic,6,Emergency,Home or Self Care,2017,024,Cancer of breast,222,BLOOD TRANSFUSION,382,Malignant breast disorders,09,"Diseases and Disorders of the Skin, Subcutaneous Tissue and Breast",2,Moderate,Moderate,Medical,Unknown,Self-Pay,,,N,Y,54984.34,13463.86
New York City,Manhattan,7002024,001456,Mount Sinai Hospital,50 to 69,100,F,Other Race,Not Span/Hispanic,6,Urgent,Home or Self Care,2017,024,Cancer of breast,223,ENTERAL/PARENTERAL NUTR,382,Malignant breast disorders,09,"Diseases and Disorders of the Skin, Subcutaneous Tissue and Breast",3,Major,Major,Medical,Self-Pay,Self-Pay,,,N,N,67092.76,22178.70
New York City,Queens,7003010,001637,New York - Presbyterian/Queens,70 or Older,113,F,White,Not Span/Hispanic,1,Emergency,Expired,2017,024,Cancer of breast,041,OT NON-OR THER PRC RESP,382,Malignant breast disorders,09,"Diseases and Disorders of the Skin, Subcutaneous Tissue and Breast",4,Extreme,Extreme,Medical,Medicare,Medicaid,Self-Pay,,N,Y,14136.74,3789.82
New York City,Bronx,7000011,001175,Calvary Hospital Inc,70 or Older,107,F,White,Not Span/Hispanic,47,Elective,Expired,2017,024,Cancer of breast,231,OTHER THERAPEUTIC PRCS,382,Malignant breast disorders,09,"Diseases and Disorders of the Skin, Subcutaneous Tissue and Breast",3,Major,Major,Medical,Medicare,Blue Cross/Blue Shield,,,N,N,94871.23,51426.47
New York City,Bronx,7000011,001175,Calvary Hospital Inc,70 or Older,107,F,White,Not Span/Hispanic,49,Elective,Expired,2017,024,Cancer of breast,041,OT NON-OR THER PRC RESP,382,Malignant breast disorders,09,"Diseases and Disorders of the Skin, Subcutaneous Tissue and Breast",3,Major,Major,Medical,Medicare,Private Health Insurance,,,N,N,103329.66,56011.50
New York City,Bronx,7000011,001175,Calvary Hospital Inc,50 to 69,112,F,Other Race,Not Span/Hispanic,31,Elective,Expired,2017,024,Cancer of breast,000,NO PROC,382,Malignant breast disorders,09,"Diseases and Disorders of the Skin, Subcutaneous Tissue and Breast",2,Moderate,Moderate,Medical,Private Health Insurance,,,,N,N,66088.53,35824.35
New York City,Bronx,7000011,001175,Calvary Hospital Inc,70 or Older,107,F,White,Not Span/Hispanic,22,Elective,Expired,2017,024,Cancer of breast,000,NO PROC,382,Malignant breast disorders,09,"Diseases and Disorders of the Skin, Subcutaneous Tissue and Breast",2,Moderate,Moderate,Medical,Medicare,Private Health Insurance,,,N,N,44190.74,23954.30
New York City,Bronx,7000011,001175,Calvary Hospital Inc,50 to 69,108,F,White,Not Span/Hispanic,8,Elective,Expired,2017,024,Cancer of breast,000,NO PROC,382,Malignant breast disorders,09,"Diseases and Disorders of the Skin, Subcutaneous Tissue and Breast",2,Moderate,Moderate,Medical,Medicare,Private Health Insurance,,,N,N,18261.84,9899.12
New York City,Bronx,7000011,001175,Calvary Hospital Inc,70 or Older,105,F,Black/African American,Not Span/Hispanic,26,Elective,Expired,2017,024,Cancer of breast,041,OT NON-OR THER PRC RESP,382,Malignant breast disorders,09,"Diseases and Disorders of the Skin, Subcutaneous Tissue and Breast",4,Extreme,Extreme,Medical,Medicare,,,,N,N,53372.66,28931.50
New York City,Bronx,7000011,001175,Calvary Hospital Inc,50 to 69,107,F,Black/African American,Unknown,8,Elective,Expired,2017,024,Cancer of breast,000,NO PROC,382,Malignant breast disorders,09,"Diseases and Disorders of the Skin, Subcutaneous Tissue and Breast",2,Moderate,Moderate,Medical,Medicare,Medicaid,,,N,N,17741.63,9617.13
New York City,Bronx,7000011,001175,Calvary Hospital Inc,50 to 69,,F,White,Unknown,15,Elective,Expired,2017,024,Cancer of breast,000,NO PROC,382,Malignant breast disorders,09,"Diseases and Disorders of the Skin, Subcutaneous Tissue and Breast",2,Moderate,Moderate,Medical,Medicare,,,,N,N,29318.87,15892.76
,,,,Redacted for Confidentiality,30 to 49,,F,Black/African American,Unknown,19,Elective,Expired,2017,024,Cancer of breast,000,NO PROC,382,Malignant breast disorders,09,"Diseases and Disorders of the Skin, Subcutaneous Tissue and Breast",2,Moderate,Moderate,Medical,Medicaid,,,,N,N,42510.92,23043.72
New York City,Bronx,7000011,001175,Calvary Hospital Inc,70 or Older,105,F,White,Unknown,17,Elective,Expired,2017,024,Cancer of breast,041,OT NON-OR THER PRC RESP,382,Malignant breast disorders,09,"Diseases and Disorders of the Skin, Subcutaneous Tissue and Breast",3,Major,Major,Medical,Medicare,Private Health Insurance,,,N,N,34634.48,18774.17
New York City,Bronx,7000011,001175,Calvary Hospital Inc,70 or Older,,F,Black/African American,Unknown,2,Elective,Expired,2017,024,Cancer of breast,000,NO PROC,382,Malignant breast disorders,09,"Diseases and Disorders of the Skin, Subcutaneous Tissue and Breast",3,Major,Major,Medical,Private Health Insurance,Medicare,,,N,N,4187.92,2270.13
New York City,Bronx,7000011,001175,Calvary Hospital Inc,70 or Older,100,F,White,Not Span/Hispanic,13,Elective,Expired,2017,024,Cancer of breast,041,OT NON-OR THER PRC RESP,382,Malignant breast disorders,09,"Diseases and Disorders of the Skin, Subcutaneous Tissue and Breast",3,Major,Major,Medical,Medicare,Private Health Insurance,,,N,N,26105.79,14151.06
New York City,Bronx,7000011,001175,Calvary Hospital Inc,50 to 69,105,F,White,Not Span/Hispanic,2,Elective,Expired,2017,024,Cancer of breast,000,NO PROC,382,Malignant breast disorders,09,"Diseases and Disorders of the Skin, Subcutaneous Tissue and Breast",2,Moderate,Moderate,Medical,Blue Cross/Blue Shield,,,,N,N,3937.00,2134.11
New York City,Bronx,7000011,001175,Calvary Hospital Inc,50 to 69,100,F,White,Not Span/Hispanic,4,Elective,Expired,2017,024,Cancer of breast,041,OT NON-OR THER PRC RESP,382,Malignant breast disorders,09,"Diseases and Disorders of the Skin, Subcutaneous Tissue and Breast",3,Major,Major,Medical,Blue Cross/Blue Shield,,,,N,N,7968.00,4319.18
New York City,Bronx,7000011,001175,Calvary Hospital Inc,70 or Older,113,F,White,Not Span/Hispanic,4,Elective,Expired,2017,024,Cancer of breast,041,OT NON-OR THER PRC RESP,382,Malignant breast disorders,09,"Diseases and Disorders of the Skin, Subcutaneous Tissue and Breast",3,Major,Major,Medical,Medicare,Private Health Insurance,,,N,N,8092.92,4386.90
New York City,Manhattan,7002032,001466,Mount Sinai West,50 to 69,114,F,Other Race,Not Span/Hispanic,9,Emergency,Home or Self Care,2017,024,Cancer of breast,222,BLOOD TRANSFUSION,382,Malignant breast disorders,09,"Diseases and Disorders of the Skin, Subcutaneous Tissue and Breast",3,Major,Major,Medical,Private Health Insurance,Medicaid,Self-Pay,,N,Y,78797.09,21100.61
Western NY,Erie,1401014,003067,Millard Fillmore Suburban Hospital,50 to 69,140,F,White,Not Span/Hispanic,2,Emergency,Hospice - Medical Facility,2017,024,Cancer of breast,039,INCISION OF PLEURA,382,Malignant breast disorders,09,"Diseases and Disorders of the Skin, Subcutaneous Tissue and Breast",4,Extreme,Major,Medical,Private Health Insurance,Self-Pay,,,N,Y,9717.44,4059.80
New York City,Bronx,7000006,001169,Montefiore Medical Center - Henry & Lucy Moses Div,50 to 69,104,F,Other Race,Not Span/Hispanic,5,Emergency,Skilled Nursing Home,2017,024,Cancer of breast,211,THERAPEUTIC RADIOLOGY,382,Malignant breast disorders,09,"Diseases and Disorders of the Skin, Subcutaneous Tissue and Breast",3,Major,Major,Medical,Medicaid,,,,N,Y,88832.92,17725.81
New York City,Bronx,7000006,001169,Montefiore Medical Center - Henry & Lucy Moses Div,50 to 69,104,F,Black/African American,Not Span/Hispanic,9,Emergency,Home or Self Care,2017,024,Cancer of breast,224,CANCER CHEMOTHERAPY,382,Malignant breast disorders,09,"Diseases and Disorders of the Skin, Subcutaneous Tissue and Breast",3,Major,Moderate,Medical,Medicare,Medicaid,,,N,Y,88907.01,19243.51
New York City,Bronx,7000006,003058,Montefiore Med Center - Jack D Weiler Hosp of A Einstein College Div,70 or Older,104,F,Other Race,Spanish/Hispanic,3,Emergency,Home w/ Home Health Services,2017,024,Cancer of breast,000,NO PROC,382,Malignant breast disorders,09,"Diseases and Disorders of the Skin, Subcutaneous Tissue and Breast",3,Major,Moderate,Medical,Medicare,,,,N,Y,39632.95,6615.73
New York City,Manhattan,7002024,001456,Mount Sinai Hospital,50 to 69,100,F,Black/African American,Not Span/Hispanic,4,Emergency,Expired,2017,024,Cancer of breast,000,NO PROC,382,Malignant breast disorders,09,"Diseases and Disorders of the Skin, Subcutaneous Tissue and Breast",4,Extreme,Major,Medical,Medicare,Blue Cross/Blue Shield,Self-Pay,,N,Y,48066.13,16239.73
New York City,Richmond,7004003,001737,Staten Island University Hosp-South,70 or Older,103,F,White,Not Span/Hispanic,2,Emergency,Expired,2017,024,Cancer of breast,231,OTHER THERAPEUTIC PRCS,382,Malignant breast disorders,09,"Diseases and Disorders of the Skin, Subcutaneous Tissue and Breast",3,Major,Extreme,Medical,Medicare,Medicare,,,N,Y,27536.51,5707.66
Capital/Adirond,Schenectady,4601001,000829,Ellis Hospital,70 or Older,123,F,White,Not Span/Hispanic,1,Emergency,Expired,2017,024,Cancer of breast,000,NO PROC,382,Malignant breast disorders,09,"Diseases and Disorders of the Skin, Subcutaneous Tissue and Breast",3,Major,Moderate,Medical,Miscellaneous/Other,,,,N,N,3779.75,1192.44
New York City,Kings,7002053,001304,NYU Langone Hospital-Brooklyn,70 or Older,112,F,White,Not Span/Hispanic,12,Emergency,Hospice - Medical Facility,2017,024,Cancer of breast,039,INCISION OF PLEURA,382,Malignant breast disorders,09,"Diseases and Disorders of the Skin, Subcutaneous Tissue and Breast",4,Extreme,Extreme,Medical,Medicare,,,,N,Y,113111.87,27973.52
New York City,Kings,7001037,001320,University Hospital of Brooklyn,50 to 69,112,F,Black/African American,Not Span/Hispanic,4,Emergency,Expired,2017,024,Cancer of breast,039,INCISION OF PLEURA,382,Malignant breast disorders,09,"Diseases and Disorders of the Skin, Subcutaneous Tissue and Breast",3,Major,Major,Medical,Blue Cross/Blue Shield,Medicaid,Self-Pay,,N,Y,27758.18,19009.53
New York City,Manhattan,7002002,001439,Mount Sinai Beth Israel,50 to 69,100,F,Black/African American,Spanish/Hispanic,4,Emergency,Skilled Nursing Home,2017,024,Cancer of breast,039,INCISION OF PLEURA,382,Malignant breast disorders,09,"Diseases and Disorders of the Skin, Subcutaneous Tissue and Breast",3,Major,Major,Medical,Medicaid,Medicaid,Self-Pay,,N,Y,43782.03,12692.32
Hudson Valley,Rockland,4324000,000776,Nyack Hospital,50 to 69,109,F,White,Not Span/Hispanic,4,Emergency,Home w/ Home Health Services,2017,024,Cancer of breast,039,INCISION OF PLEURA,382,Malignant breast disorders,09,"Diseases and Disorders of the Skin, Subcutaneous Tissue and Breast",3,Major,Major,Medical,Medicaid,,,,N,Y,77477.81,15309.09
New York City,Kings,7001021,001306,New York - Presbyterian Brooklyn Methodist Hospital,70 or Older,112,F,Black/African American,Not Span/Hispanic,26,Emergency,Hospice - Home,2017,024,Cancer of breast,041,OT NON-OR THER PRC RESP,382,Malignant breast disorders,09,"Diseases and Disorders of the Skin, Subcutaneous Tissue and Breast",4,Extreme,Extreme,Medical,Medicare,Medicare,Self-Pay,,N,Y,175005.82,57629.58
New York City,Manhattan,7002054,001437,New York-Presbyterian/Lower Manhattan Hospital,70 or Older,100,F,Black/African American,Not Span/Hispanic,17,Emergency,Skilled Nursing Home,2017,024,Cancer of breast,165,BREAST BIOPSY & DX PRCS,382,Malignant breast disorders,09,"Diseases and Disorders of the Skin, Subcutaneous Tissue and Breast",3,Major,Major,Medical,Medicare,Medicare,Medicaid,,N,Y,173314.58,43466.63
New York City,Manhattan,7002002,001439,Mount Sinai Beth Israel,70 or Older,100,F,Other Race,Unknown,17,Emergency,Skilled Nursing Home,2017,042,Secondary malignancies,174,OT NON-OR THER PRC SKIN,382,Malignant breast disorders,09,"Diseases and Disorders of the Skin, Subcutaneous Tissue and Breast",3,Major,Major,Medical,Medicare,Miscellaneous/Other,Medicaid,,N,Y,144100.12,44295.72
New York City,Manhattan,7002024,001456,Mount Sinai Hospital,50 to 69,112,F,Black/African American,Not Span/Hispanic,2,Emergency,Home or Self Care,2017,024,Cancer of breast,039,INCISION OF PLEURA,382,Malignant breast disorders,09,"Diseases and Disorders of the Skin, Subcutaneous Tissue and Breast",3,Major,Major,Medical,Medicaid,Medicaid,Self-Pay,,N,Y,20702.39,7167.53
New York City,Manhattan,7002054,001464,New York Presbyterian Hospital - Columbia Presbyterian Center,30 to 49,100,F,White,Not Span/Hispanic,39,Emergency,Expired,2017,024,Cancer of breast,211,THERAPEUTIC RADIOLOGY,382,Malignant breast disorders,09,"Diseases and Disorders of the Skin, Subcutaneous Tissue and Breast",4,Extreme,Extreme,Medical,Medicaid,Medicaid,Self-Pay,,N,Y,495685.09,128498.93
New York City,Queens,7003010,001637,New York - Presbyterian/Queens,50 to 69,114,F,Other Race,Not Span/Hispanic,15,Emergency,Expired,2017,024,Cancer of breast,054,OT VASC CATH; NOT HEART,382,Malignant breast disorders,09,"Diseases and Disorders of the Skin, Subcutaneous Tissue and Breast",4,Extreme,Major,Medical,Private Health Insurance,Self-Pay,,,N,Y,171911.18,49352.78
Hudson Valley,Ulster,5501001,000990,HealthAlliance Hospital Broadway Campus,50 to 69,124,F,White,Spanish/Hispanic,3,Emergency,Home w/ Home Health Services,2017,024,Cancer of breast,000,NO PROC,382,Malignant breast disorders,09,"Diseases and Disorders of the Skin, Subcutaneous Tissue and Breast",2,Moderate,Moderate,Medical,Medicare,Medicaid,,,N,Y,33759.62,8634.46
New York City,Bronx,7000002,001165,Jacobi Medical Center,50 to 69,104,F,Black/African American,Not Span/Hispanic,4,Emergency,Home or Self Care,2017,024,Cancer of breast,039,INCISION OF PLEURA,382,Malignant breast disorders,09,"Diseases and Disorders of the Skin, Subcutaneous Tissue and Breast",3,Major,Moderate,Medical,Medicare,Medicare,Medicaid,,N,Y,26996.38,15940.80
New York City,Bronx,7000006,001169,Montefiore Medical Center - Henry & Lucy Moses Div,50 to 69,104,F,Other Race,Spanish/Hispanic,4,Emergency,Home or Self Care,2017,024,Cancer of breast,039,INCISION OF PLEURA,382,Malignant breast disorders,09,"Diseases and Disorders of the Skin, Subcutaneous Tissue and Breast",3,Major,Moderate,Medical,Medicare,Medicaid,,,N,Y,33979.31,6782.83
New York City,Bronx,7000008,001172,Lincoln Medical & Mental Health Center,30 to 49,104,F,Black/African American,Not Span/Hispanic,3,Emergency,Home or Self Care,2017,024,Cancer of breast,165,BREAST BIOPSY & DX PRCS,382,Malignant breast disorders,09,"Diseases and Disorders of the Skin, Subcutaneous Tissue and Breast",2,Moderate,Moderate,Medical,Medicaid,Medicaid,,,N,Y,24492.26,12726.96
New York City,Bronx,7000008,001172,Lincoln Medical & Mental Health Center,50 to 69,104,F,Black/African American,Not Span/Hispanic,1,Emergency,Home or Self Care,2017,024,Cancer of breast,000,NO PROC,382,Malignant breast disorders,09,"Diseases and Disorders of the Skin, Subcutaneous Tissue and Breast",3,Major,Major,Medical,Medicaid,,,,N,Y,7818.79,4062.89
New York City,Bronx,7000011,001175,Calvary Hospital Inc,50 to 69,112,F,Black/African American,Not Span/Hispanic,94,Elective,Expired,2017,024,Cancer of breast,041,OT NON-OR THER PRC RESP,382,Malignant breast disorders,09,"Diseases and Disorders of the Skin, Subcutaneous Tissue and Breast",3,Major,Major,Medical,Blue Cross/Blue Shield,,,,N,N,176329.49,95582.22
New York City,Bronx,7000011,001175,Calvary Hospital Inc,70 or Older,100,F,White,Not Span/Hispanic,82,Elective,Expired,2017,024,Cancer of breast,000,NO PROC,382,Malignant breast disorders,09,"Diseases and Disorders of the Skin, Subcutaneous Tissue and Breast",3,Major,Major,Medical,Medicare,,,,N,N,171636.73,93038.44
New York City,Bronx,7000011,001175,Calvary Hospital Inc,50 to 69,108,F,White,Not Span/Hispanic,33,Elective,Home or Self Care,2017,024,Cancer of breast,000,NO PROC,382,Malignant breast disorders,09,"Diseases and Disorders of the Skin, Subcutaneous Tissue and Breast",4,Extreme,Major,Medical,Medicare,Blue Cross/Blue Shield,,,N,N,75827.11,41103.30
New York City,Bronx,7000011,001175,Calvary Hospital Inc,70 or Older,105,F,White,Not Span/Hispanic,50,Elective,Skilled Nursing Home,2017,024,Cancer of breast,000,NO PROC,382,Malignant breast disorders,09,"Diseases and Disorders of the Skin, Subcutaneous Tissue and Breast",2,Moderate,Major,Medical,Medicare,Private Health Insurance,,,N,N,100904.27,54696.77
New York City,Bronx,7000011,001175,Calvary Hospital Inc,50 to 69,106,F,White,Not Span/Hispanic,57,Elective,Expired,2017,024,Cancer of breast,000,NO PROC,382,Malignant breast disorders,09,"Diseases and Disorders of the Skin, Subcutaneous Tissue and Breast",2,Moderate,Moderate,Medical,Private Health Insurance,Private Health Insurance,,,N,N,117156.93,63506.79
New York City,Bronx,7000011,001175,Calvary Hospital Inc,70 or Older,112,F,Black/African American,Not Span/Hispanic,39,Elective,Expired,2017,024,Cancer of breast,088,ABDOMINAL PARACENTESIS,382,Malignant breast disorders,09,"Diseases and Disorders of the Skin, Subcutaneous Tissue and Breast",2,Moderate,Major,Medical,Medicare,Blue Cross/Blue Shield,,,N,N,78861.44,42748.11
New York City,Bronx,7000011,001175,Calvary Hospital Inc,70 or Older,OOS,F,White,Not Span/Hispanic,33,Elective,Expired,2017,024,Cancer of breast,222,BLOOD TRANSFUSION,382,Malignant breast disorders,09,"Diseases and Disorders of the Skin, Subcutaneous Tissue and Breast",3,Major,Major,Medical,Medicare,Private Health Insurance,,,N,N,68492.23,37127.31
New York City,Bronx,7000011,001175,Calvary Hospital Inc,50 to 69,100,F,Other Race,Not Span/Hispanic,11,Elective,Expired,2017,024,Cancer of breast,041,OT NON-OR THER PRC RESP,382,Malignant breast disorders,09,"Diseases and Disorders of the Skin, Subcutaneous Tissue and Breast",2,Moderate,Moderate,Medical,Medicare,Medicaid,,,N,N,22407.40,12146.29
New York City,Bronx,7000011,001175,Calvary Hospital Inc,50 to 69,116,F,Black/African American,Not Span/Hispanic,24,Elective,Expired,2017,024,Cancer of breast,000,NO PROC,382,Malignant breast disorders,09,"Diseases and Disorders of the Skin, Subcutaneous Tissue and Breast",3,Major,Major,Medical,Medicare,,,,N,N,49949.23,27075.78
New York City,Bronx,7000011,001175,Calvary Hospital Inc,50 to 69,113,F,White,Not Span/Hispanic,11,Elective,Expired,2017,024,Cancer of breast,000,NO PROC,382,Malignant breast disorders,09,"Diseases and Disorders of the Skin, Subcutaneous Tissue and Breast",3,Major,Major,Medical,Medicare,Private Health Insurance,,,N,N,22953.97,12442.57
New York City,Bronx,7000011,001175,Calvary Hospital Inc,70 or Older,107,F,White,Not Span/Hispanic,9,Elective,Expired,2017,024,Cancer of breast,000,NO PROC,382,Malignant breast disorders,09,"Diseases and Disorders of the Skin, Subcutaneous Tissue and Breast",2,Moderate,Moderate,Medical,Medicare,Blue Cross/Blue Shield,,,N,N,19537.97,10590.87
New York City,Bronx,7000011,001175,Calvary Hospital Inc,50 to 69,104,F,Black/African American,Not Span/Hispanic,17,Elective,Expired,2017,024,Cancer of breast,000,NO PROC,382,Malignant breast disorders,09,"Diseases and Disorders of the Skin, Subcutaneous Tissue and Breast",3,Major,Major,Medical,Private Health Insurance,Medicare,,,N,N,34365.60,18628.42
New York City,Bronx,7000011,001175,Calvary Hospital Inc,50 to 69,105,F,Black/African American,Not Span/Hispanic,6,Elective,Expired,2017,024,Cancer of breast,041,OT NON-OR THER PRC RESP,382,Malignant breast disorders,09,"Diseases and Disorders of the Skin, Subcutaneous Tissue and Breast",2,Moderate,Major,Medical,Medicaid,,,,N,N,12182.00,6603.45
New York City,Bronx,7000011,001175,Calvary Hospital Inc,70 or Older,104,F,Other Race,Unknown,8,Elective,Expired,2017,024,Cancer of breast,000,NO PROC,382,Malignant breast disorders,09,"Diseases and Disorders of the Skin, Subcutaneous Tissue and Breast",2,Moderate,Moderate,Medical,Medicare,Medicaid,,,N,N,15708.87,8515.24