Hospital Service Area,Hospital County,Operating Certificate Number,Permanent Facility Id,Facility Name,Age Group,Zip Code - 3 digits,Gender,Race,Ethnicity,Length of Stay,Type of Admission,Patient Disposition,Discharge Year,CCS Diagnosis Code,CCS Diagnosis Description,CCS Procedure Code,CCS Procedure Description,APR DRG Code,APR DRG Description,APR MDC Code,APR MDC Description,APR Severity of Illness Code,APR Severity of Illness Description,APR Risk of Mortality,APR Medical Surgical Description,Payment Typology 1,Payment Typology 2,Payment Typology 3,Birth Weight,Abortion Edit Indicator,Emergency Department Indicator,Total Charges,Total Costs
New York City,Manhattan,7002001,001438,Bellevue Hospital Center,30 to 49,112,F,Other Race,Not Span/Hispanic,3,Emergency,Home or Self Care,2017,024,Cancer of breast,193,DX ULTRASOUND HEART,382,Malignant breast disorders,09,"Diseases and Disorders of the Skin, Subcutaneous Tissue and Breast",3,Major,Major,Medical,Medicaid,,,,N,Y,46051.00,29691.29
New York City,Manhattan,7002001,001438,Bellevue Hospital Center,50 to 69,101,F,Other Race,Not Span/Hispanic,13,Emergency,Hospice - Medical Facility,2017,024,Cancer of breast,218,PSYCHO/PSYCHI EVAL/THER,382,Malignant breast disorders,09,"Diseases and Disorders of the Skin, Subcutaneous Tissue and Breast",2,Moderate,Moderate,Medical,Medicaid,Medicaid,,,N,Y,65214.09,42046.65
New York City,Manhattan,7002001,001438,Bellevue Hospital Center,50 to 69,113,F,Other Race,Not Span/Hispanic,1,Emergency,Home or Self Care,2017,024,Cancer of breast,000,NO PROC,382,Malignant breast disorders,09,"Diseases and Disorders of the Skin, Subcutaneous Tissue and Breast",3,Major,Moderate,Medical,Medicaid,,,,N,Y,8966.25,5780.97
New York City,Manhattan,7002001,001438,Bellevue Hospital Center,50 to 69,113,F,Other Race,Not Span/Hispanic,1,Emergency,Home or Self Care,2017,024,Cancer of breast,222,BLOOD TRANSFUSION,382,Malignant breast disorders,09,"Diseases and Disorders of the Skin, Subcutaneous Tissue and Breast",2,Moderate,Moderate,Medical,Private Health Insurance,Medicaid,,,N,Y,7279.10,4693.19
New York City,Manhattan,7002001,001438,Bellevue Hospital Center,50 to 69,112,F,Black/African American,Not Span/Hispanic,9,Emergency,Expired,2017,024,Cancer of breast,216,RESP INTUB/MECH VENTIL,382,Malignant breast disorders,09,"Diseases and Disorders of the Skin, Subcutaneous Tissue and Breast",4,Extreme,Extreme,Medical,Medicaid,,,,N,N,82073.41,52916.67
New York City,Manhattan,7002001,001438,Bellevue Hospital Center,30 to 49,111,F,Other Race,Not Span/Hispanic,1,Emergency,Home or Self Care,2017,024,Cancer of breast,180,OTHER CT SCAN,382,Malignant breast disorders,09,"Diseases and Disorders of the Skin, Subcutaneous Tissue and Breast",2,Moderate,Minor,Medical,Medicaid,,,,N,Y,11586.28,7470.23
New York City,Manhattan,7002001,001438,Bellevue Hospital Center,50 to 69,114,F,Black/African American,Not Span/Hispanic,1,Emergency,Home or Self Care,2017,024,Cancer of breast,231,OTHER THERAPEUTIC PRCS,382,Malignant breast disorders,09,"Diseases and Disorders of the Skin, Subcutaneous Tissue and Breast",2,Moderate,Moderate,Medical,Medicaid,,,,N,Y,10720.96,6912.32
New York City,Manhattan,7002001,001438,Bellevue Hospital Center,50 to 69,100,F,White,Not Span/Hispanic,21,Emergency,Skilled Nursing Home,2017,024,Cancer of breast,165,BREAST BIOPSY & DX PRCS,382,Malignant breast disorders,09,"Diseases and Disorders of the Skin, Subcutaneous Tissue and Breast",2,Moderate,Moderate,Medical,Medicaid,Medicaid,,,N,Y,106463.77,68642.30
New York City,Manhattan,7002001,001438,Bellevue Hospital Center,70 or Older,100,F,Other Race,Not Span/Hispanic,12,Emergency,Left Against Medical Advice,2017,024,Cancer of breast,039,INCISION OF PLEURA,382,Malignant breast disorders,09,"Diseases and Disorders of the Skin, Subcutaneous Tissue and Breast",3,Major,Major,Medical,Medicare,Medicare,Medicaid,,N,Y,69183.07,44605.65
New York City,Manhattan,7002001,001438,Bellevue Hospital Center,50 to 69,100,F,Black/African American,Not Span/Hispanic,4,Emergency,Home or Self Care,2017,024,Cancer of breast,193,DX ULTRASOUND HEART,382,Malignant breast disorders,09,"Diseases and Disorders of the Skin, Subcutaneous Tissue and Breast",3,Major,Moderate,Medical,Medicaid,,,,N,Y,34786.07,22428.25
