Hospital Service Area,Hospital County,Operating Certificate Number,Permanent Facility Id,Facility Name,Age Group,Zip Code - 3 digits,Gender,Race,Ethnicity,Length of Stay,Type of Admission,Patient Disposition,Discharge Year,CCS Diagnosis Code,CCS Diagnosis Description,CCS Procedure Code,CCS Procedure Description,APR DRG Code,APR DRG Description,APR MDC Code,APR MDC Description,APR Severity of Illness Code,APR Severity of Illness Description,APR Risk of Mortality,APR Medical Surgical Description,Payment Typology 1,Payment Typology 2,Payment Typology 3,Birth Weight,Abortion Edit Indicator,Emergency Department Indicator,Total Charges,Total Costs
Capital/Adirond,Albany,0101000,000001,Albany Medical Center Hospital,50 to 69,123,F,White,Not Span/Hispanic,2,Emergency,Home w/ Home Health Services,2018,NEO030,BREAST CANCER - ALL OTHER TYPES,RES005,CHEST TUBE PLACEMENT AND THERAPEUTIC THORACENTESIS,382,MALIGNANT BREAST DISORDERS,09,"DISEASES AND DISORDERS OF THE SKIN, SUBCUTANEOUS TISSUE AND BREAST",3,Major,Moderate,Medical,Blue Cross/Blue Shield,,,,,true,26489.71,9285.27
Long Island,Nassau,2909000,000513,Mercy Hospital,50 to 69,114,F,Black/African American,Not Span/Hispanic,8,Emergency,Home w/ Home Health Services,2018,NEO030,BREAST CANCER - ALL OTHER TYPES,RES005,CHEST TUBE PLACEMENT AND THERAPEUTIC THORACENTESIS,382,MALIGNANT BREAST DISORDERS,09,"DISEASES AND DISORDERS OF THE SKIN, SUBCUTANEOUS TISSUE AND BREAST",3,Major,Moderate,Medical,Blue Cross/Blue Shield,Medicare,,,,true,66187,16253.54
Capital/Adirond,Albany,0101004,000005,St. Peter's Hospital,30 to 49,121,F,Black/African American,Not Span/Hispanic,4,Emergency,Home or Self Care,2018,NEO030,BREAST CANCER - ALL OTHER TYPES,SKB001,SKIN BIOPSY AND DIAGNOSTIC DRAINAGE,382,MALIGNANT BREAST DISORDERS,09,"DISEASES AND DISORDERS OF THE SKIN, SUBCUTANEOUS TISSUE AND BREAST",2,Moderate,Moderate,Medical,Medicaid,Medicaid,,,,true,38678.03,11279.96
Capital/Adirond,Albany,0101000,000001,Albany Medical Center Hospital,30 to 49,122,F,Black/African American,Not Span/Hispanic,4,Emergency,Home or Self Care,2018,NEO030,BREAST CANCER - ALL OTHER TYPES,RES005,CHEST TUBE PLACEMENT AND THERAPEUTIC THORACENTESIS,382,MALIGNANT BREAST DISORDERS,09,"DISEASES AND DISORDERS OF THE SKIN, SUBCUTANEOUS TISSUE AND BREAST",3,Major,Major,Medical,Blue Cross/Blue Shield,,,,,true,26563.8,7549.56
New York City,Manhattan,7002021,001454,Metropolitan Hospital Center,30 to 49,100,F,Black/African American,Not Span/Hispanic,5,Emergency,Home w/ Home Health Services,2018,NEO030,BREAST CANCER - ALL OTHER TYPES,IMG005,MAGNETIC RESONANCE IMAGING (MRI),382,MALIGNANT BREAST DISORDERS,09,"DISEASES AND DISORDERS OF THE SKIN, SUBCUTANEOUS TISSUE AND BREAST",2,Moderate,Moderate,Medical,Medicaid,Medicaid,,,,true,31992.06,25847.98
Long Island,Nassau,2909000,000513,Mercy Hospital,50 to 69,114,F,Black/African American,Not Span/Hispanic,2,Emergency,Home w/ Home Health Services,2018,NEO030,BREAST CANCER - ALL OTHER TYPES,,,382,MALIGNANT BREAST DISORDERS,09,"DISEASES AND DISORDERS OF THE SKIN, SUBCUTANEOUS TISSUE AND BREAST",3,Major,Major,Medical,Blue Cross/Blue Shield,Medicare,,,,true,22059,4750.23
New York City,Kings,7001016,001301,Kings County Hospital Center,70 or Older,112,F,Black/African American,Not Span/Hispanic,9,Emergency,Hospice - Home,2018,NEO030,BREAST CANCER - ALL OTHER TYPES,ADM021,"ADMINISTRATION OF THERAPEUTIC SUBSTANCES, NEC",382,MALIGNANT BREAST DISORDERS,09,"DISEASES AND DISORDERS OF THE SKIN, SUBCUTANEOUS TISSUE AND BREAST",4,Extreme,Extreme,Medical,Medicare,Medicare,,,,true,55384.86,39343.24
New York City,Queens,7003004,001638,Long Island Jewish Forest Hills,50 to 69,114,F,Black/African American,Not Span/Hispanic,15,Emergency,Hospice - Medical Facility,2018,NEO030,BREAST CANCER - ALL OTHER TYPES,RES003,THORACENTESIS (DIAGNOSTIC),382,MALIGNANT BREAST DISORDERS,09,"DISEASES AND DISORDERS OF THE SKIN, SUBCUTANEOUS TISSUE AND BREAST",4,Extreme,Major,Medical,Blue Cross/Blue Shield,,,,,true,167409.99,31631.38
New York City,Manhattan,7002017,001450,Lenox Hill Hospital,70 or Older,100,F,Other Race,Not Span/Hispanic,5,Emergency,Home or Self Care,2018,NEO030,BREAST CANCER - ALL OTHER TYPES,,,382,MALIGNANT BREAST DISORDERS,09,"DISEASES AND DISORDERS OF THE SKIN, SUBCUTANEOUS TISSUE AND BREAST",2,Moderate,Major,Medical,Self-Pay,Self-Pay,,,,true,58869.32,8102.35
Long Island,Nassau,2952005,000552,Plainview Hospital,70 or Older,117,F,White,Not Span/Hispanic,3,Urgent,Home or Self Care,2018,NEO030,BREAST CANCER - ALL OTHER TYPES,CAR025,PLACEMENT OF TUNNELED OR IMPLANTABLE PORTION OF A VASCULAR ACCESS DEVICE,382,MALIGNANT BREAST DISORDERS,09,"DISEASES AND DISORDERS OF THE SKIN, SUBCUTANEOUS TISSUE AND BREAST",1,Minor,Minor,Medical,Medicare,Private Health Insurance,,,,false,35716.33,17587.07
Long Island,Suffolk,5154000,000924,South Shore University Hospital,50 to 69,117,F,Other Race,Spanish/Hispanic,13,Emergency,Expired,2018,NEO030,BREAST CANCER - ALL OTHER TYPES,RES005,CHEST TUBE PLACEMENT AND THERAPEUTIC THORACENTESIS,382,MALIGNANT BREAST DISORDERS,09,"DISEASES AND DISORDERS OF THE SKIN, SUBCUTANEOUS TISSUE AND BREAST",4,Extreme,Major,Medical,Medicaid,Medicaid,,,,true,111589.85,27835.79
New York City,Manhattan,7002032,001469,Mount Sinai Morningside,50 to 69,100,F,Black/African American,Not Span/Hispanic,7,Urgent,Home w/ Home Health Services,2018,NEO030,BREAST CANCER - ALL OTHER TYPES,RES005,CHEST TUBE PLACEMENT AND THERAPEUTIC THORACENTESIS,382,MALIGNANT BREAST DISORDERS,09,"DISEASES AND DISORDERS OF THE SKIN, SUBCUTANEOUS TISSUE AND BREAST",3,Major,Major,Medical,Private Health Insurance,Self-Pay,,,,false,65842.98,15279.18
Long Island,Nassau,2952006,000551,St. Joseph Hospital,50 to 69,117,F,White,Not Span/Hispanic,1,Emergency,Home or Self Care,2018,NEO030,BREAST CANCER - ALL OTHER TYPES,GIS006,PARACENTESIS,382,MALIGNANT BREAST DISORDERS,09,"DISEASES AND DISORDERS OF THE SKIN, SUBCUTANEOUS TISSUE AND BREAST",2,Moderate,Moderate,Medical,Medicaid,Medicaid,,,,true,20582.28,3939.83
Long Island,Suffolk,5153000,000913,Huntington Hospital,50 to 69,117,F,White,Not Span/Hispanic,10,Emergency,Hospice - Medical Facility,2018,NEO030,BREAST CANCER - ALL OTHER TYPES,GIS006,PARACENTESIS,382,MALIGNANT BREAST DISORDERS,09,"DISEASES AND DISORDERS OF THE SKIN, SUBCUTANEOUS TISSUE AND BREAST",4,Extreme,Extreme,Medical,Medicare,,,,,true,90676.53,26798.37
New York City,Bronx,7000011,001175,Calvary Hospital Inc,70 or Older,107,F,White,Not Span/Hispanic,18,Elective,Expired,2018,NEO030,BREAST CANCER - ALL OTHER TYPES,,,382,MALIGNANT BREAST DISORDERS,09,"DISEASES AND DISORDERS OF THE SKIN, SUBCUTANEOUS TISSUE AND BREAST",3,Major,Major,Medical,Private Health Insurance,Medicare,Medicare,,,false,38251.4,19682.04
New York City,Kings,7001003,001288,Brooklyn Hospital Center - Downtown Campus,70 or Older,112,F,Black/African American,Not Span/Hispanic,16,Emergency,Federal Health Care Facility,2018,NEO030,BREAST CANCER - ALL OTHER TYPES,RES003,THORACENTESIS (DIAGNOSTIC),382,MALIGNANT BREAST DISORDERS,09,"DISEASES AND DISORDERS OF THE SKIN, SUBCUTANEOUS TISSUE AND BREAST",2,Moderate,Minor,Medical,Medicare,Medicare,Self-Pay,,,true,124865.32,26238.14
New York City,Bronx,7000011,001175,Calvary Hospital Inc,70 or Older,104,F,Other Race,Unknown,11,Elective,Expired,2018,NEO030,BREAST CANCER - ALL OTHER TYPES,,,382,MALIGNANT BREAST DISORDERS,09,"DISEASES AND DISORDERS OF THE SKIN, SUBCUTANEOUS TISSUE AND BREAST",2,Moderate,Moderate,Medical,Private Health Insurance,Medicare,Medicaid,,,false,23310.87,12140.41
New York City,Bronx,7000006,003058,Montefiore Med Center - Jack D Weiler Hosp of A Einstein College Div,50 to 69,104,F,White,Unknown,9,Emergency,Hospice - Medical Facility,2018,NEO030,BREAST CANCER - ALL OTHER TYPES,ESA004,NON-INVASIVE VENTILATION,382,MALIGNANT BREAST DISORDERS,09,"DISEASES AND DISORDERS OF THE SKIN, SUBCUTANEOUS TISSUE AND BREAST",4,Extreme,Major,Medical,Private Health Insurance,,,,,true,107647.5,19747.37
Hudson Valley,Orange,3535001,000708,Bon Secours Community Hospital,30 to 49,OOS,F,White,Not Span/Hispanic,1,Emergency,Left Against Medical Advice,2018,NEO030,BREAST CANCER - ALL OTHER TYPES,,,382,MALIGNANT BREAST DISORDERS,09,"DISEASES AND DISORDERS OF THE SKIN, SUBCUTANEOUS TISSUE AND BREAST",3,Major,Major,Medical,Medicare,Medicaid,,,,true,27894.37,6408.55
New York City,Kings,7001021,001306,New York - Presbyterian Brooklyn Methodist Hospital,70 or Older,112,F,White,Not Span/Hispanic,12,Emergency,Hospice - Medical Facility,2018,NEO030,BREAST CANCER - ALL OTHER TYPES,RES003,THORACENTESIS (DIAGNOSTIC),382,MALIGNANT BREAST DISORDERS,09,"DISEASES AND DISORDERS OF THE SKIN, SUBCUTANEOUS TISSUE AND BREAST",3,Major,Major,Medical,Blue Cross/Blue Shield,Medicare,Self-Pay,,,true,82323.95,22584.53
New York City,Bronx,7000011,001175,Calvary Hospital Inc,70 or Older,112,F,Black/African American,Not Span/Hispanic,9,Elective,Expired,2018,NEO030,BREAST CANCER - ALL OTHER TYPES,,,382,MALIGNANT BREAST DISORDERS,09,"DISEASES AND DISORDERS OF THE SKIN, SUBCUTANEOUS TISSUE AND BREAST",3,Major,Major,Medical,Medicaid,,,,,false,21123.53,10974.93
New York City,Kings,7001021,001306,New York - Presbyterian Brooklyn Methodist Hospital,70 or Older,112,F,Black/African American,Not Span/Hispanic,6,Emergency,Skilled Nursing Home,2018,NEO030,BREAST CANCER - ALL OTHER TYPES,,,382,MALIGNANT BREAST DISORDERS,09,"DISEASES AND DISORDERS OF THE SKIN, SUBCUTANEOUS TISSUE AND BREAST",3,Major,Major,Medical,Medicare,Medicaid,Self-Pay,,,true,39824.35,9794.7
Western NY,Erie,1401014,000207,Buffalo General Medical Center,70 or Older,142,F,White,Not Span/Hispanic,3,Emergency,Expired,2018,NEO030,BREAST CANCER - ALL OTHER TYPES,,,382,MALIGNANT BREAST DISORDERS,09,"DISEASES AND DISORDERS OF THE SKIN, SUBCUTANEOUS TISSUE AND BREAST",3,Major,Major,Medical,Medicare,Self-Pay,,,,true,11928.69,4634.54
New York City,Kings,7001008,001293,"New York Community Hospital of Brooklyn, Inc",50 to 69,112,F,White,Not Span/Hispanic,7,Emergency,Inpatient Rehabilitation Facility,2018,NEO030,BREAST CANCER - ALL OTHER TYPES,RES005,CHEST TUBE PLACEMENT AND THERAPEUTIC THORACENTESIS,382,MALIGNANT BREAST DISORDERS,09,"DISEASES AND DISORDERS OF THE SKIN, SUBCUTANEOUS TISSUE AND BREAST",4,Extreme,Major,Medical,"Managed Care, Unspecified",Medicaid,Self-Pay,,,true,32460.62,14598.35
New York City,Kings,7001008,001293,"New York Community Hospital of Brooklyn, Inc",50 to 69,112,F,White,Not Span/Hispanic,10,Emergency,Home w/ Home Health Services,2018,NEO030,BREAST CANCER - ALL OTHER TYPES,,,382,MALIGNANT BREAST DISORDERS,09,"DISEASES AND DISORDERS OF THE SKIN, SUBCUTANEOUS TISSUE AND BREAST",3,Major,Major,Medical,"Managed Care, Unspecified",Medicaid,Self-Pay,,,true,55669.37,19225.77
Western NY,Erie,1401014,003067,Millard Fillmore Suburban Hospital,50 to 69,141,F,White,Not Span/Hispanic,5,Emergency,Expired,2018,NEO030,BREAST CANCER - ALL OTHER TYPES,,,382,MALIGNANT BREAST DISORDERS,09,"DISEASES AND DISORDERS OF THE SKIN, SUBCUTANEOUS TISSUE AND BREAST",4,Extreme,Major,Medical,Medicare,Self-Pay,,,,true,19410.43,8533.78
New York City,Manhattan,7002032,001466,Mount Sinai West,50 to 69,100,F,White,Not Span/Hispanic,44,Emergency,Skilled Nursing Home,2018,NEO030,BREAST CANCER - ALL OTHER TYPES,RES005,CHEST TUBE PLACEMENT AND THERAPEUTIC THORACENTESIS,382,MALIGNANT BREAST DISORDERS,09,"DISEASES AND DISORDERS OF THE SKIN, SUBCUTANEOUS TISSUE AND BREAST",4,Extreme,Extreme,Medical,Medicare,Self-Pay,,,,true,426707.46,103836.16
New York City,Bronx,7000008,001172,Lincoln Medical & Mental Health Center,50 to 69,104,F,Other Race,Spanish/Hispanic,28,Emergency,Expired,2018,NEO030,BREAST CANCER - ALL OTHER TYPES,ESA003,MECHANICAL VENTILATION,382,MALIGNANT BREAST DISORDERS,09,"DISEASES AND DISORDERS OF THE SKIN, SUBCUTANEOUS TISSUE AND BREAST",4,Extreme,Extreme,Medical,Medicare,Medicaid,,,,true,135908.43,80261.67
Capital/Adirond,Albany,0101000,000001,Albany Medical Center Hospital,50 to 69,121,F,White,Not Span/Hispanic,2,Emergency,Home or Self Care,2018,NEO030,BREAST CANCER - ALL OTHER TYPES,,,382,MALIGNANT BREAST DISORDERS,09,"DISEASES AND DISORDERS OF THE SKIN, SUBCUTANEOUS TISSUE AND BREAST",3,Major,Major,Medical,"Managed Care, Unspecified",,,,,false,17689.95,3201.06
Western NY,Erie,1401013,000292,Sisters of Charity Hospital - St. Joseph Campus,70 or Older,140,F,White,Not Span/Hispanic,3,Elective,Expired,2018,NEO030,BREAST CANCER - ALL OTHER TYPES,,,382,MALIGNANT BREAST DISORDERS,09,"DISEASES AND DISORDERS OF THE SKIN, SUBCUTANEOUS TISSUE AND BREAST",2,Moderate,Moderate,Medical,Miscellaneous/Other,,,,,false,5589.13,2701.9
New York City,Queens,7003007,001633,Queens Hospital Center,50 to 69,114,F,Other Race,Spanish/Hispanic,5,Emergency,Home w/ Home Health Services,2018,NEO030,BREAST CANCER - ALL OTHER TYPES,RES005,CHEST TUBE PLACEMENT AND THERAPEUTIC THORACENTESIS,382,MALIGNANT BREAST DISORDERS,09,"DISEASES AND DISORDERS OF THE SKIN, SUBCUTANEOUS TISSUE AND BREAST",3,Major,Major,Medical,Medicaid,Medicaid,,,,true,35643.48,19032.51
New York City,Queens,7003003,001629,Jamaica Hospital Medical Center,70 or Older,116,F,White,Not Span/Hispanic,3,Emergency,Hospice - Medical Facility,2018,NEO030,BREAST CANCER - ALL OTHER TYPES,,,382,MALIGNANT BREAST DISORDERS,09,"DISEASES AND DISORDERS OF THE SKIN, SUBCUTANEOUS TISSUE AND BREAST",3,Major,Major,Medical,Medicare,,,,,true,13131,5961.79
New York City,Queens,7003004,001630,Long Island Jewish Medical Center,30 to 49,113,F,White,Not Span/Hispanic,2,Emergency,Home w/ Home Health Services,2018,NEO030,BREAST CANCER - ALL OTHER TYPES,,,382,MALIGNANT BREAST DISORDERS,09,"DISEASES AND DISORDERS OF THE SKIN, SUBCUTANEOUS TISSUE AND BREAST",2,Moderate,Moderate,Medical,Medicaid,Medicaid,Self-Pay,,,false,22801.01,4161.29
Capital/Adirond,Albany,0101004,000005,St. Peter's Hospital,50 to 69,124,F,White,Not Span/Hispanic,4,Emergency,Home or Self Care,2018,NEO030,BREAST CANCER - ALL OTHER TYPES,IMG008,ULTRASONOGRAPHY,382,MALIGNANT BREAST DISORDERS,09,"DISEASES AND DISORDERS OF THE SKIN, SUBCUTANEOUS TISSUE AND BREAST",2,Moderate,Moderate,Medical,Medicare,Private Health Insurance,,,,true,28242.06,9536.85
New York City,Bronx,7000011,001175,Calvary Hospital Inc,30 to 49,104,F,Black/African American,Not Span/Hispanic,120 +,Elective,Expired,2018,NEO030,BREAST CANCER - ALL OTHER TYPES,,,382,MALIGNANT BREAST DISORDERS,09,"DISEASES AND DISORDERS OF THE SKIN, SUBCUTANEOUS TISSUE AND BREAST",3,Major,Major,Medical,Medicare,Medicare,Medicaid,,,false,310354.9,158654.64
New York City,Bronx,7000011,001175,Calvary Hospital Inc,70 or Older,115,F,White,Not Span/Hispanic,67,Elective,Expired,2018,NEO030,BREAST CANCER - ALL OTHER TYPES,,,382,MALIGNANT BREAST DISORDERS,09,"DISEASES AND DISORDERS OF THE SKIN, SUBCUTANEOUS TISSUE AND BREAST",3,Major,Major,Medical,Medicare,Blue Cross/Blue Shield,,,,false,144245.12,74862.33
New York City,Manhattan,7002020,001453,Memorial Hospital for Cancer and Allied Diseases,50 to 69,OOS,F,White,Not Span/Hispanic,8,Emergency,Home or Self Care,2018,NEO030,BREAST CANCER - ALL OTHER TYPES,,,382,MALIGNANT BREAST DISORDERS,09,"DISEASES AND DISORDERS OF THE SKIN, SUBCUTANEOUS TISSUE AND BREAST",1,Minor,Minor,Medical,Private Health Insurance,,,,,false,48021.58,19600.37
Hudson Valley,Westchester,5957001,001139,Westchester Medical Center,50 to 69,105,F,White,Not Span/Hispanic,1,Emergency,Home or Self Care,2018,NEO030,BREAST CANCER - ALL OTHER TYPES,RES005,CHEST TUBE PLACEMENT AND THERAPEUTIC THORACENTESIS,382,MALIGNANT BREAST DISORDERS,09,"DISEASES AND DISORDERS OF THE SKIN, SUBCUTANEOUS TISSUE AND BREAST",2,Moderate,Moderate,Medical,Medicaid,Medicaid,,,,true,24651.8,3827.53
Western NY,Erie,1401005,000210,Erie County Medical Center,30 to 49,142,F,White,Not Span/Hispanic,8,Elective,Home w/ Home Health Services,2018,NEO030,BREAST CANCER - ALL OTHER TYPES,,,382,MALIGNANT BREAST DISORDERS,09,"DISEASES AND DISORDERS OF THE SKIN, SUBCUTANEOUS TISSUE AND BREAST",3,Major,Major,Medical,Medicaid,Medicaid,,,,false,12436.37,9527.69
New York City,Manhattan,7002054,001464,New York-Presbyterian Hospital - Columbia Presbyterian Center,50 to 69,109,F,Multi-racial,Not Span/Hispanic,2,Emergency,Home or Self Care,2018,NEO030,BREAST CANCER - ALL OTHER TYPES,RES005,CHEST TUBE PLACEMENT AND THERAPEUTIC THORACENTESIS,382,MALIGNANT BREAST DISORDERS,09,"DISEASES AND DISORDERS OF THE SKIN, SUBCUTANEOUS TISSUE AND BREAST",3,Major,Major,Medical,Blue Cross/Blue Shield,Self-Pay,,,,true,35197.76,7488.99
New York City,Kings,7001016,001301,Kings County Hospital Center,70 or Older,112,F,Black/African American,Not Span/Hispanic,4,Elective,Home w/ Home Health Services,2018,NEO030,BREAST CANCER - ALL OTHER TYPES,,,382,MALIGNANT BREAST DISORDERS,09,"DISEASES AND DISORDERS OF THE SKIN, SUBCUTANEOUS TISSUE AND BREAST",2,Moderate,Moderate,Medical,Medicare,Medicare,Medicaid,,,false,22072.52,15679.46
New York City,Queens,7003003,001629,Jamaica Hospital Medical Center,50 to 69,114,F,Black/African American,Not Span/Hispanic,7,Emergency,Home or Self Care,2018,NEO030,BREAST CANCER - ALL OTHER TYPES,SKB001,SKIN BIOPSY AND DIAGNOSTIC DRAINAGE,382,MALIGNANT BREAST DISORDERS,09,"DISEASES AND DISORDERS OF THE SKIN, SUBCUTANEOUS TISSUE AND BREAST",2,Moderate,Moderate,Medical,Medicare,,,,,true,33642,15013.75
New York City,Manhattan,7002054,001437,New York-Presbyterian/Lower Manhattan Hospital,30 to 49,100,F,Black/African American,Not Span/Hispanic,3,Emergency,Home w/ Home Health Services,2018,NEO030,BREAST CANCER - ALL OTHER TYPES,ADM001,TRANSFUSION OF BLOOD AND BLOOD PRODUCTS,382,MALIGNANT BREAST DISORDERS,09,"DISEASES AND DISORDERS OF THE SKIN, SUBCUTANEOUS TISSUE AND BREAST",2,Moderate,Minor,Medical,Private Health Insurance,Self-Pay,,,,true,34407.18,7761.37
Long Island,Nassau,2950002,000528,Nassau University Medical Center,50 to 69,115,F,Black/African American,Not Span/Hispanic,3,Emergency,Home or Self Care,2018,NEO030,BREAST CANCER - ALL OTHER TYPES,IMG006,COMPUTERIZED TOMOGRAPHY (CT) WITH CONTRAST,382,MALIGNANT BREAST DISORDERS,09,"DISEASES AND DISORDERS OF THE SKIN, SUBCUTANEOUS TISSUE AND BREAST",1,Minor,Minor,Medical,Medicare,Medicaid,Self-Pay,,,false,23170.48,7499.4
New York City,Bronx,7000002,001165,Jacobi Medical Center,50 to 69,104,F,Black/African American,Not Span/Hispanic,51,Elective,Short-term Hospital,2018,NEO030,BREAST CANCER - ALL OTHER TYPES,RHB002,"PHYSICAL, OCCUPATIONAL, AND RESPIRATORY THERAPY TREATMENT",382,MALIGNANT BREAST DISORDERS,09,"DISEASES AND DISORDERS OF THE SKIN, SUBCUTANEOUS TISSUE AND BREAST",3,Major,Minor,Medical,Self-Pay,,,,,false,67392.2,39872.6
Long Island,Nassau,2908000,000511,NYU Langone Hospital-Long Island,70 or Older,115,F,White,Not Span/Hispanic,10,Emergency,Skilled Nursing Home,2018,NEO030,BREAST CANCER - ALL OTHER TYPES,GIS006,PARACENTESIS,382,MALIGNANT BREAST DISORDERS,09,"DISEASES AND DISORDERS OF THE SKIN, SUBCUTANEOUS TISSUE AND BREAST",4,Extreme,Extreme,Medical,Medicare,Medicare,Private Health Insurance,,,true,115335.12,22956.88
New York City,Bronx,7000011,001175,Calvary Hospital Inc,70 or Older,117,F,White,Not Span/Hispanic,64,Elective,Expired,2018,NEO030,BREAST CANCER - ALL OTHER TYPES,ADM021,"ADMINISTRATION OF THERAPEUTIC SUBSTANCES, NEC",382,MALIGNANT BREAST DISORDERS,09,"DISEASES AND DISORDERS OF THE SKIN, SUBCUTANEOUS TISSUE AND BREAST",3,Major,Major,Medical,Medicare,Private Health Insurance,,,,false,134586.31,69788.38
Hudson Valley,Orange,3522000,000694,St Luke's Cornwall Hospital/Newburgh,50 to 69,125,F,White,Not Span/Hispanic,4,Emergency,Home or Self Care,2018,NEO030,BREAST CANCER - ALL OTHER TYPES,SKB001,SKIN BIOPSY AND DIAGNOSTIC DRAINAGE,382,MALIGNANT BREAST DISORDERS,09,"DISEASES AND DISORDERS OF THE SKIN, SUBCUTANEOUS TISSUE AND BREAST",3,Major,Moderate,Medical,Private Health Insurance,,,,,true,50692.6,9211.33
New York City,Kings,7001021,001306,New York - Presbyterian Brooklyn Methodist Hospital,50 to 69,112,F,White,Not Span/Hispanic,3,Emergency,Home or Self Care,2018,NEO030,BREAST CANCER - ALL OTHER TYPES,GIS007,GI SYSTEM DRAINAGE (EXCLUDING PARACENTESIS),382,MALIGNANT BREAST DISORDERS,09,"DISEASES AND DISORDERS OF THE SKIN, SUBCUTANEOUS TISSUE AND BREAST",3,Major,Major,Medical,Private Health Insurance,,,,,false,31513.9,6528.69
Capital/Adirond,Albany,0101000,000001,Albany Medical Center Hospital,30 to 49,121,F,Other Race,Not Span/Hispanic,3,Emergency,Hospice - Medical Facility,2018,NEO030,BREAST CANCER - ALL OTHER TYPES,ADM005,ADMINISTRATION OF THROMBOLYTICS AND PLATELET INHIBITORS,382,MALIGNANT BREAST DISORDERS,09,"DISEASES AND DISORDERS OF THE SKIN, SUBCUTANEOUS TISSUE AND BREAST",3,Major,Major,Medical,Blue Cross/Blue Shield,,,,,true,20196.91,6623.3
Southern Tier,Broome,0301001,000043,Our Lady of Lourdes Memorial Hospital,70 or Older,137,F,White,Not Span/Hispanic,6,Emergency,Home or Self Care,2018,NEO030,BREAST CANCER - ALL OTHER TYPES,ESA004,NON-INVASIVE VENTILATION,382,MALIGNANT BREAST DISORDERS,09,"DISEASES AND DISORDERS OF THE SKIN, SUBCUTANEOUS TISSUE AND BREAST",4,Extreme,Extreme,Medical,Medicare,Medicare,Federal/State/Local/VA,,,true,13338.22,5738.83
New York City,Manhattan,7002032,001469,Mount Sinai Morningside,70 or Older,100,F,Black/African American,Not Span/Hispanic,5,Emergency,Home or Self Care,2018,NEO030,BREAST CANCER - ALL OTHER TYPES,SKB001,SKIN BIOPSY AND DIAGNOSTIC DRAINAGE,382,MALIGNANT BREAST DISORDERS,09,"DISEASES AND DISORDERS OF THE SKIN, SUBCUTANEOUS TISSUE AND BREAST",3,Major,Major,Medical,Medicare,Blue Cross/Blue Shield,Self-Pay,,,true,57230.36,13869.68
Capital/Adirond,Fulton,1701000,000330,Nathan Littauer Hospital,50 to 69,120,F,White,Not Span/Hispanic,4,Emergency,Home or Self Care,2018,NEO030,BREAST CANCER - ALL OTHER TYPES,SKB003,MASTECTOMY AND LUMPECTOMY,382,MALIGNANT BREAST DISORDERS,09,"DISEASES AND DISORDERS OF THE SKIN, SUBCUTANEOUS TISSUE AND BREAST",3,Major,Major,Medical,Blue Cross/Blue Shield,,,,,true,24416.7,3651.76
Southern Tier,Broome,0301001,000043,Our Lady of Lourdes Memorial Hospital,50 to 69,138,F,White,Not Span/Hispanic,1,Emergency,Home or Self Care,2018,NEO030,BREAST CANCER - ALL OTHER TYPES,RES005,CHEST TUBE PLACEMENT AND THERAPEUTIC THORACENTESIS,382,MALIGNANT BREAST DISORDERS,09,"DISEASES AND DISORDERS OF THE SKIN, SUBCUTANEOUS TISSUE AND BREAST",4,Extreme,Major,Medical,Blue Cross/Blue Shield,Blue Cross/Blue Shield,Self-Pay,,,true,4593.87,1372.71
New York City,Kings,7001003,001288,Brooklyn Hospital Center - Downtown Campus,50 to 69,112,F,Black/African American,Not Span/Hispanic,3,Emergency,Home or Self Care,2018,NEO030,BREAST CANCER - ALL OTHER TYPES,CAR025,PLACEMENT OF TUNNELED OR IMPLANTABLE PORTION OF A VASCULAR ACCESS DEVICE,382,MALIGNANT BREAST DISORDERS,09,"DISEASES AND DISORDERS OF THE SKIN, SUBCUTANEOUS TISSUE AND BREAST",1,Minor,Minor,Medical,Medicare,Medicare,Medicaid,,,true,46190.48,10110.32
New York City,Kings,7001002,001286,Brookdale Hospital Medical Center,50 to 69,112,F,Black/African American,Not Span/Hispanic,12,Emergency,Home or Self Care,2018,NEO030,BREAST CANCER - ALL OTHER TYPES,CAR025,PLACEMENT OF TUNNELED OR IMPLANTABLE PORTION OF A VASCULAR ACCESS DEVICE,382,MALIGNANT BREAST DISORDERS,09,"DISEASES AND DISORDERS OF THE SKIN, SUBCUTANEOUS TISSUE AND BREAST",3,Major,Major,Medical,Private Health Insurance,,,,,true,123055.79,48959.88
Southern Tier,Broome,0301001,000043,Our Lady of Lourdes Memorial Hospital,30 to 49,139,F,Black/African American,Not Span/Hispanic,9,Emergency,Home or Self Care,2018,NEO030,BREAST CANCER - ALL OTHER TYPES,ADM001,TRANSFUSION OF BLOOD AND BLOOD PRODUCTS,382,MALIGNANT BREAST DISORDERS,09,"DISEASES AND DISORDERS OF THE SKIN, SUBCUTANEOUS TISSUE AND BREAST",3,Major,Moderate,Medical,Medicaid,Self-Pay,Self-Pay,,,true,51424.55,13569.08