Hospital Service Area,Hospital County,Operating Certificate Number,Permanent Facility Id,Facility Name,Age Group,Zip Code - 3 digits,Gender,Race,Ethnicity,Length of Stay,Type of Admission,Patient Disposition,Discharge Year,CCS Diagnosis Code,CCS Diagnosis Description,CCS Procedure Code,CCS Procedure Description,APR DRG Code,APR DRG Description,APR MDC Code,APR MDC Description,APR Severity of Illness Code,APR Severity of Illness Description,APR Risk of Mortality,APR Medical Surgical Description,Payment Typology 1,Payment Typology 2,Payment Typology 3,Birth Weight,Abortion Edit Indicator,Emergency Department Indicator,Total Charges,Total Costs
New York City,Kings,7002053,001304,NYU Langone Hospital-Brooklyn,50 to 69,112,F,Other Race,Unknown,3,Emergency,Home or Self Care,2019,SKN001,SKIN AND SUBCUTANEOUS TISSUE INFECTIONS,,,383,CELLULITIS & OTHER SKIN INFECTIONS,09,"DISEASES AND DISORDERS OF THE SKIN, SUBCUTANEOUS TISSUE AND BREAST",1,Minor,Minor,Medical,Blue Cross/Blue Shield,,,,,true,29406.94,10656.83
New York City,Kings,7002053,001304,NYU Langone Hospital-Brooklyn,70 or Older,112,F,Black/African American,Not Span/Hispanic,3,Emergency,Home or Self Care,2019,SKN001,SKIN AND SUBCUTANEOUS TISSUE INFECTIONS,ADM015,ADMINISTRATION OF ANTIBIOTICS,383,CELLULITIS & OTHER SKIN INFECTIONS,09,"DISEASES AND DISORDERS OF THE SKIN, SUBCUTANEOUS TISSUE AND BREAST",1,Minor,Moderate,Medical,Blue Cross/Blue Shield,Medicaid,,,,true,33462.74,11364.78
New York City,Kings,7002053,001304,NYU Langone Hospital-Brooklyn,50 to 69,112,M,White,Not Span/Hispanic,4,Emergency,Skilled Nursing Home,2019,SKN001,SKIN AND SUBCUTANEOUS TISSUE INFECTIONS,,,383,CELLULITIS & OTHER SKIN INFECTIONS,09,"DISEASES AND DISORDERS OF THE SKIN, SUBCUTANEOUS TISSUE AND BREAST",3,Major,Moderate,Medical,Medicare,Medicaid,,,,true,49998.89,15507.9
New York City,Kings,7002053,001304,NYU Langone Hospital-Brooklyn,50 to 69,112,F,Other Race,Spanish/Hispanic,4,Emergency,Home or Self Care,2019,SKN001,SKIN AND SUBCUTANEOUS TISSUE INFECTIONS,SUD001,SUBSTANCE USE DETOXIFICATION,383,CELLULITIS & OTHER SKIN INFECTIONS,09,"DISEASES AND DISORDERS OF THE SKIN, SUBCUTANEOUS TISSUE AND BREAST",2,Moderate,Minor,Medical,Medicaid,,,,,true,47891.43,15624.62
New York City,Kings,7002053,001304,NYU Langone Hospital-Brooklyn,50 to 69,112,F,Other Race,Spanish/Hispanic,2,Emergency,Home or Self Care,2019,INF008,VIRAL INFECTION,OTR004,ISOLATION PROCEDURES,383,CELLULITIS & OTHER SKIN INFECTIONS,09,"DISEASES AND DISORDERS OF THE SKIN, SUBCUTANEOUS TISSUE AND BREAST",3,Major,Major,Medical,Medicaid,,,,,true,25745.8,8104.4
New York City,Kings,7002053,001304,NYU Langone Hospital-Brooklyn,30 to 49,112,F,Other Race,Not Span/Hispanic,1,Emergency,Home or Self Care,2019,SKN001,SKIN AND SUBCUTANEOUS TISSUE INFECTIONS,,,383,CELLULITIS & OTHER SKIN INFECTIONS,09,"DISEASES AND DISORDERS OF THE SKIN, SUBCUTANEOUS TISSUE AND BREAST",1,Minor,Minor,Medical,Blue Cross/Blue Shield,,,,,true,21475.27,7818.29
New York City,Kings,7002053,001304,NYU Langone Hospital-Brooklyn,50 to 69,100,M,Other Race,Spanish/Hispanic,3,Emergency,Left Against Medical Advice,2019,SKN001,SKIN AND SUBCUTANEOUS TISSUE INFECTIONS,,,383,CELLULITIS & OTHER SKIN INFECTIONS,09,"DISEASES AND DISORDERS OF THE SKIN, SUBCUTANEOUS TISSUE AND BREAST",3,Major,Minor,Medical,Medicaid,,,,,true,44338.02,12754.87
New York City,Kings,7002053,001304,NYU Langone Hospital-Brooklyn,50 to 69,112,F,Black/African American,Spanish/Hispanic,7,Elective,Home or Self Care,2019,SKN001,SKIN AND SUBCUTANEOUS TISSUE INFECTIONS,,,383,CELLULITIS & OTHER SKIN INFECTIONS,09,"DISEASES AND DISORDERS OF THE SKIN, SUBCUTANEOUS TISSUE AND BREAST",2,Moderate,Minor,Medical,Medicaid,,,,,true,100697.21,28525.26
New York City,Kings,7002053,001304,NYU Langone Hospital-Brooklyn,50 to 69,100,M,Other Race,Spanish/Hispanic,7,Emergency,Left Against Medical Advice,2019,SKN001,SKIN AND SUBCUTANEOUS TISSUE INFECTIONS,IMG005,MAGNETIC RESONANCE IMAGING (MRI),383,CELLULITIS & OTHER SKIN INFECTIONS,09,"DISEASES AND DISORDERS OF THE SKIN, SUBCUTANEOUS TISSUE AND BREAST",1,Minor,Minor,Medical,Medicaid,,,,,true,81851.23,24371.85
New York City,Kings,7002053,001304,NYU Langone Hospital-Brooklyn,70 or Older,112,F,White,Not Span/Hispanic,3,Emergency,Home w/ Home Health Services,2019,SKN001,SKIN AND SUBCUTANEOUS TISSUE INFECTIONS,IMG008,ULTRASONOGRAPHY,383,CELLULITIS & OTHER SKIN INFECTIONS,09,"DISEASES AND DISORDERS OF THE SKIN, SUBCUTANEOUS TISSUE AND BREAST",2,Moderate,Minor,Medical,Medicare,Blue Cross/Blue Shield,,,,true,34209.02,11259.78
New York City,Kings,7002053,001304,NYU Langone Hospital-Brooklyn,30 to 49,112,F,White,Not Span/Hispanic,1,Emergency,Home or Self Care,2019,SKN001,SKIN AND SUBCUTANEOUS TISSUE INFECTIONS,,,383,CELLULITIS & OTHER SKIN INFECTIONS,09,"DISEASES AND DISORDERS OF THE SKIN, SUBCUTANEOUS TISSUE AND BREAST",2,Moderate,Minor,Medical,Private Health Insurance,,,,,true,15325.47,4507.46
New York City,Kings,7002053,001304,NYU Langone Hospital-Brooklyn,18 to 29,100,M,Black/African American,Not Span/Hispanic,2,Emergency,Home or Self Care,2019,SKN001,SKIN AND SUBCUTANEOUS TISSUE INFECTIONS,ADM010,VACCINATIONS,383,CELLULITIS & OTHER SKIN INFECTIONS,09,"DISEASES AND DISORDERS OF THE SKIN, SUBCUTANEOUS TISSUE AND BREAST",1,Minor,Minor,Medical,Medicaid,,,,,true,40112.48,14542.27
New York City,Kings,7002053,001304,NYU Langone Hospital-Brooklyn,30 to 49,112,F,White,Not Span/Hispanic,1,Emergency,Home or Self Care,2019,SKN001,SKIN AND SUBCUTANEOUS TISSUE INFECTIONS,SKB002,INCISION AND DRAINAGE OF SKIN,383,CELLULITIS & OTHER SKIN INFECTIONS,09,"DISEASES AND DISORDERS OF THE SKIN, SUBCUTANEOUS TISSUE AND BREAST",1,Minor,Minor,Medical,Private Health Insurance,,,,,true,52129.77,16038.33
New York City,Kings,7002053,001304,NYU Langone Hospital-Brooklyn,70 or Older,112,F,White,Not Span/Hispanic,1,Emergency,Home or Self Care,2019,SKN001,SKIN AND SUBCUTANEOUS TISSUE INFECTIONS,,,383,CELLULITIS & OTHER SKIN INFECTIONS,09,"DISEASES AND DISORDERS OF THE SKIN, SUBCUTANEOUS TISSUE AND BREAST",3,Major,Major,Medical,Medicare,Blue Cross/Blue Shield,,,,true,30896.79,5022.82
New York City,Kings,7002053,001304,NYU Langone Hospital-Brooklyn,70 or Older,112,F,Black/African American,Not Span/Hispanic,4,Emergency,Home or Self Care,2019,SKN001,SKIN AND SUBCUTANEOUS TISSUE INFECTIONS,,,383,CELLULITIS & OTHER SKIN INFECTIONS,09,"DISEASES AND DISORDERS OF THE SKIN, SUBCUTANEOUS TISSUE AND BREAST",1,Minor,Moderate,Medical,Blue Cross/Blue Shield,Medicaid,,,,true,42043.14,14669.28
New York City,Kings,7002053,001304,NYU Langone Hospital-Brooklyn,50 to 69,112,M,Other Race,Not Span/Hispanic,3,Emergency,Home or Self Care,2019,SKN001,SKIN AND SUBCUTANEOUS TISSUE INFECTIONS,ADM021,"ADMINISTRATION OF THERAPEUTIC SUBSTANCES, NEC",383,CELLULITIS & OTHER SKIN INFECTIONS,09,"DISEASES AND DISORDERS OF THE SKIN, SUBCUTANEOUS TISSUE AND BREAST",4,Extreme,Moderate,Medical,Private Health Insurance,Medicaid,,,,true,29199.61,10978.37
New York City,Kings,7002053,001304,NYU Langone Hospital-Brooklyn,30 to 49,112,M,Other Race,Spanish/Hispanic,3,Emergency,Home or Self Care,2019,SKN001,SKIN AND SUBCUTANEOUS TISSUE INFECTIONS,,,383,CELLULITIS & OTHER SKIN INFECTIONS,09,"DISEASES AND DISORDERS OF THE SKIN, SUBCUTANEOUS TISSUE AND BREAST",2,Moderate,Minor,Medical,Medicaid,,,,,true,36237.5,11904.82
New York City,Kings,7002053,001304,NYU Langone Hospital-Brooklyn,50 to 69,112,M,White,Not Span/Hispanic,1,Emergency,Home w/ Home Health Services,2019,SKN001,SKIN AND SUBCUTANEOUS TISSUE INFECTIONS,,,383,CELLULITIS & OTHER SKIN INFECTIONS,09,"DISEASES AND DISORDERS OF THE SKIN, SUBCUTANEOUS TISSUE AND BREAST",2,Moderate,Minor,Medical,Medicare,Medicare,,,,true,21761.54,5339
New York City,Kings,7002053,001304,NYU Langone Hospital-Brooklyn,18 to 29,112,F,Black/African American,Not Span/Hispanic,2,Emergency,Left Against Medical Advice,2019,SKN001,SKIN AND SUBCUTANEOUS TISSUE INFECTIONS,ADM001,TRANSFUSION OF BLOOD AND BLOOD PRODUCTS,383,CELLULITIS & OTHER SKIN INFECTIONS,09,"DISEASES AND DISORDERS OF THE SKIN, SUBCUTANEOUS TISSUE AND BREAST",3,Major,Minor,Medical,Medicaid,,,,,true,37787.2,8778.19
New York City,Kings,7002053,001304,NYU Langone Hospital-Brooklyn,50 to 69,112,M,Other Race,Not Span/Hispanic,2,Emergency,Home or Self Care,2019,SKN001,SKIN AND SUBCUTANEOUS TISSUE INFECTIONS,ADM021,"ADMINISTRATION OF THERAPEUTIC SUBSTANCES, NEC",383,CELLULITIS & OTHER SKIN INFECTIONS,09,"DISEASES AND DISORDERS OF THE SKIN, SUBCUTANEOUS TISSUE AND BREAST",1,Minor,Moderate,Medical,Medicaid,,,,,true,43265.05,9399.46
New York City,Kings,7002053,001304,NYU Langone Hospital-Brooklyn,30 to 49,112,M,White,Not Span/Hispanic,2,Emergency,Home or Self Care,2019,SKN001,SKIN AND SUBCUTANEOUS TISSUE INFECTIONS,,,383,CELLULITIS & OTHER SKIN INFECTIONS,09,"DISEASES AND DISORDERS OF THE SKIN, SUBCUTANEOUS TISSUE AND BREAST",1,Minor,Minor,Medical,Private Health Insurance,,,,,true,20917.25,7521.04
New York City,Kings,7002053,001304,NYU Langone Hospital-Brooklyn,50 to 69,103,M,White,Not Span/Hispanic,2,Emergency,Home w/ Home Health Services,2019,SKN001,SKIN AND SUBCUTANEOUS TISSUE INFECTIONS,,,383,CELLULITIS & OTHER SKIN INFECTIONS,09,"DISEASES AND DISORDERS OF THE SKIN, SUBCUTANEOUS TISSUE AND BREAST",2,Moderate,Minor,Medical,Medicaid,,,,,true,44989.9,12262.69
New York City,Kings,7002053,001304,NYU Langone Hospital-Brooklyn,30 to 49,112,M,White,Not Span/Hispanic,1,Emergency,Home or Self Care,2019,SKN001,SKIN AND SUBCUTANEOUS TISSUE INFECTIONS,ADM021,"ADMINISTRATION OF THERAPEUTIC SUBSTANCES, NEC",383,CELLULITIS & OTHER SKIN INFECTIONS,09,"DISEASES AND DISORDERS OF THE SKIN, SUBCUTANEOUS TISSUE AND BREAST",2,Moderate,Minor,Medical,Medicaid,,,,,true,16190.64,4623.08
New York City,Kings,7002053,001304,NYU Langone Hospital-Brooklyn,30 to 49,112,M,Other Race,Not Span/Hispanic,3,Emergency,Home w/ Home Health Services,2019,SKN001,SKIN AND SUBCUTANEOUS TISSUE INFECTIONS,MRS005,MALE PERINEUM PROCEDURES,383,CELLULITIS & OTHER SKIN INFECTIONS,09,"DISEASES AND DISORDERS OF THE SKIN, SUBCUTANEOUS TISSUE AND BREAST",2,Moderate,Minor,Medical,Medicaid,,,,,true,82573.13,23693.71
New York City,Kings,7002053,001304,NYU Langone Hospital-Brooklyn,18 to 29,112,M,Other Race,Spanish/Hispanic,3,Emergency,Home or Self Care,2019,SKN001,SKIN AND SUBCUTANEOUS TISSUE INFECTIONS,ADM015,ADMINISTRATION OF ANTIBIOTICS,383,CELLULITIS & OTHER SKIN INFECTIONS,09,"DISEASES AND DISORDERS OF THE SKIN, SUBCUTANEOUS TISSUE AND BREAST",1,Minor,Minor,Medical,Private Health Insurance,,,,,true,36439.3,11628.66
New York City,Kings,7002053,001304,NYU Langone Hospital-Brooklyn,18 to 29,112,M,Other Race,Not Span/Hispanic,1,Emergency,Home or Self Care,2019,SKN001,SKIN AND SUBCUTANEOUS TISSUE INFECTIONS,,,383,CELLULITIS & OTHER SKIN INFECTIONS,09,"DISEASES AND DISORDERS OF THE SKIN, SUBCUTANEOUS TISSUE AND BREAST",1,Minor,Minor,Medical,Private Health Insurance,,,,,true,33027.13,12185.77
New York City,Kings,7002053,001304,NYU Langone Hospital-Brooklyn,30 to 49,112,F,Other Race,Not Span/Hispanic,1,Emergency,Home or Self Care,2019,SKN001,SKIN AND SUBCUTANEOUS TISSUE INFECTIONS,,,383,CELLULITIS & OTHER SKIN INFECTIONS,09,"DISEASES AND DISORDERS OF THE SKIN, SUBCUTANEOUS TISSUE AND BREAST",3,Major,Moderate,Medical,Private Health Insurance,,,,,true,12675.41,4209.67
New York City,Kings,7002053,001304,NYU Langone Hospital-Brooklyn,70 or Older,112,F,White,Not Span/Hispanic,4,Emergency,Skilled Nursing Home,2019,SKN001,SKIN AND SUBCUTANEOUS TISSUE INFECTIONS,,,383,CELLULITIS & OTHER SKIN INFECTIONS,09,"DISEASES AND DISORDERS OF THE SKIN, SUBCUTANEOUS TISSUE AND BREAST",2,Moderate,Moderate,Medical,Medicare,,,,,true,70194.45,23494
New York City,Kings,7002053,001304,NYU Langone Hospital-Brooklyn,70 or Older,112,F,White,Not Span/Hispanic,4,Emergency,Home w/ Home Health Services,2019,SKN001,SKIN AND SUBCUTANEOUS TISSUE INFECTIONS,,,383,CELLULITIS & OTHER SKIN INFECTIONS,09,"DISEASES AND DISORDERS OF THE SKIN, SUBCUTANEOUS TISSUE AND BREAST",3,Major,Moderate,Medical,Medicare,Medicare,,,,true,65764.5,23369.29
New York City,Kings,7002053,001304,NYU Langone Hospital-Brooklyn,30 to 49,112,F,White,Not Span/Hispanic,1,Emergency,Home or Self Care,2019,SKN001,SKIN AND SUBCUTANEOUS TISSUE INFECTIONS,,,383,CELLULITIS & OTHER SKIN INFECTIONS,09,"DISEASES AND DISORDERS OF THE SKIN, SUBCUTANEOUS TISSUE AND BREAST",2,Moderate,Minor,Medical,Private Health Insurance,,,,,true,26563.32,9276.82
New York City,Kings,7002053,001304,NYU Langone Hospital-Brooklyn,0 to 17,112,M,White,Spanish/Hispanic,2,Emergency,Home or Self Care,2019,SKN001,SKIN AND SUBCUTANEOUS TISSUE INFECTIONS,,,383,CELLULITIS & OTHER SKIN INFECTIONS,09,"DISEASES AND DISORDERS OF THE SKIN, SUBCUTANEOUS TISSUE AND BREAST",1,Minor,Minor,Medical,Medicaid,,,,,true,20196.63,6380.38
New York City,Kings,7002053,001304,NYU Langone Hospital-Brooklyn,50 to 69,112,M,Black/African American,Not Span/Hispanic,5,Emergency,Home w/ Home Health Services,2019,SKN001,SKIN AND SUBCUTANEOUS TISSUE INFECTIONS,,,383,CELLULITIS & OTHER SKIN INFECTIONS,09,"DISEASES AND DISORDERS OF THE SKIN, SUBCUTANEOUS TISSUE AND BREAST",3,Major,Minor,Medical,Medicaid,,,,,true,43910.23,17401.21
New York City,Kings,7002053,001304,NYU Langone Hospital-Brooklyn,0 to 17,112,M,Black/African American,Not Span/Hispanic,3,Emergency,Home or Self Care,2019,SKN001,SKIN AND SUBCUTANEOUS TISSUE INFECTIONS,ADM015,ADMINISTRATION OF ANTIBIOTICS,383,CELLULITIS & OTHER SKIN INFECTIONS,09,"DISEASES AND DISORDERS OF THE SKIN, SUBCUTANEOUS TISSUE AND BREAST",1,Minor,Minor,Medical,Private Health Insurance,,,,,true,25040.42,8647.35
New York City,Kings,7002053,001304,NYU Langone Hospital-Brooklyn,30 to 49,112,M,Other Race,Not Span/Hispanic,2,Emergency,Home or Self Care,2019,SKN001,SKIN AND SUBCUTANEOUS TISSUE INFECTIONS,MST005,INCISION AND DRAINAGE OF SUBCUTANEOUS TISSUE AND FASCIA,383,CELLULITIS & OTHER SKIN INFECTIONS,09,"DISEASES AND DISORDERS OF THE SKIN, SUBCUTANEOUS TISSUE AND BREAST",1,Minor,Minor,Medical,Medicaid,,,,,true,30393.78,10683.92
New York City,Kings,7002053,001304,NYU Langone Hospital-Brooklyn,18 to 29,112,M,Other Race,Spanish/Hispanic,1,Emergency,Home or Self Care,2019,SKN001,SKIN AND SUBCUTANEOUS TISSUE INFECTIONS,SKB002,INCISION AND DRAINAGE OF SKIN,383,CELLULITIS & OTHER SKIN INFECTIONS,09,"DISEASES AND DISORDERS OF THE SKIN, SUBCUTANEOUS TISSUE AND BREAST",2,Moderate,Moderate,Medical,Private Health Insurance,,,,,true,18376.16,4711.32
New York City,Kings,7002053,001304,NYU Langone Hospital-Brooklyn,70 or Older,112,F,White,Not Span/Hispanic,6,Emergency,Hospice - Home,2019,SKN001,SKIN AND SUBCUTANEOUS TISSUE INFECTIONS,,,383,CELLULITIS & OTHER SKIN INFECTIONS,09,"DISEASES AND DISORDERS OF THE SKIN, SUBCUTANEOUS TISSUE AND BREAST",4,Extreme,Major,Medical,Private Health Insurance,,,,,true,62674.6,22691.06
New York City,Kings,7002053,001304,NYU Langone Hospital-Brooklyn,70 or Older,112,M,White,Not Span/Hispanic,1,Emergency,Home or Self Care,2019,SKN001,SKIN AND SUBCUTANEOUS TISSUE INFECTIONS,,,383,CELLULITIS & OTHER SKIN INFECTIONS,09,"DISEASES AND DISORDERS OF THE SKIN, SUBCUTANEOUS TISSUE AND BREAST",1,Minor,Minor,Medical,Blue Cross/Blue Shield,,,,,true,22079.08,8258.69
New York City,Kings,7002053,001304,NYU Langone Hospital-Brooklyn,70 or Older,112,F,Other Race,Not Span/Hispanic,2,Emergency,Home w/ Home Health Services,2019,SKN001,SKIN AND SUBCUTANEOUS TISSUE INFECTIONS,ADM015,ADMINISTRATION OF ANTIBIOTICS,383,CELLULITIS & OTHER SKIN INFECTIONS,09,"DISEASES AND DISORDERS OF THE SKIN, SUBCUTANEOUS TISSUE AND BREAST",2,Moderate,Moderate,Medical,Medicare,Medicaid,,,,true,44717.17,16101.73
New York City,Kings,7002053,001304,NYU Langone Hospital-Brooklyn,30 to 49,112,F,Other Race,Spanish/Hispanic,3,Emergency,Home or Self Care,2019,SKN001,SKIN AND SUBCUTANEOUS TISSUE INFECTIONS,,,383,CELLULITIS & OTHER SKIN INFECTIONS,09,"DISEASES AND DISORDERS OF THE SKIN, SUBCUTANEOUS TISSUE AND BREAST",2,Moderate,Minor,Medical,Medicaid,,,,,true,36280.23,11215.14
New York City,Kings,7002053,001304,NYU Langone Hospital-Brooklyn,30 to 49,112,F,Black/African American,Not Span/Hispanic,12,Emergency,Skilled Nursing Home,2019,SKN001,SKIN AND SUBCUTANEOUS TISSUE INFECTIONS,,,383,CELLULITIS & OTHER SKIN INFECTIONS,09,"DISEASES AND DISORDERS OF THE SKIN, SUBCUTANEOUS TISSUE AND BREAST",3,Major,Minor,Medical,Miscellaneous/Other,,,,,true,103658.58,41237.98
New York City,Kings,7002053,001304,NYU Langone Hospital-Brooklyn,0 to 17,112,M,White,Not Span/Hispanic,2,Emergency,Home or Self Care,2019,SKN001,SKIN AND SUBCUTANEOUS TISSUE INFECTIONS,ENT015,DENTAL PROCEDURES,383,CELLULITIS & OTHER SKIN INFECTIONS,09,"DISEASES AND DISORDERS OF THE SKIN, SUBCUTANEOUS TISSUE AND BREAST",1,Minor,Minor,Medical,Medicaid,,,,,true,20079.57,7007.94
New York City,Kings,7002053,001304,NYU Langone Hospital-Brooklyn,30 to 49,103,M,White,Not Span/Hispanic,1,Emergency,Home or Self Care,2019,SKN001,SKIN AND SUBCUTANEOUS TISSUE INFECTIONS,,,383,CELLULITIS & OTHER SKIN INFECTIONS,09,"DISEASES AND DISORDERS OF THE SKIN, SUBCUTANEOUS TISSUE AND BREAST",1,Minor,Minor,Medical,Medicare,,,,,true,51133.86,18720.53
New York City,Kings,7002053,001304,NYU Langone Hospital-Brooklyn,0 to 17,112,F,Other Race,Not Span/Hispanic,2,Emergency,Home or Self Care,2019,SKN001,SKIN AND SUBCUTANEOUS TISSUE INFECTIONS,ADM015,ADMINISTRATION OF ANTIBIOTICS,383,CELLULITIS & OTHER SKIN INFECTIONS,09,"DISEASES AND DISORDERS OF THE SKIN, SUBCUTANEOUS TISSUE AND BREAST",1,Minor,Minor,Medical,Medicaid,,,,,true,20967.36,6906.42
New York City,Kings,7002053,001304,NYU Langone Hospital-Brooklyn,50 to 69,112,M,Other Race,Spanish/Hispanic,1,Emergency,Left Against Medical Advice,2019,SKN001,SKIN AND SUBCUTANEOUS TISSUE INFECTIONS,,,383,CELLULITIS & OTHER SKIN INFECTIONS,09,"DISEASES AND DISORDERS OF THE SKIN, SUBCUTANEOUS TISSUE AND BREAST",1,Minor,Minor,Medical,Medicaid,,,,,true,14803.14,4483.51
New York City,Kings,7002053,001304,NYU Langone Hospital-Brooklyn,70 or Older,112,M,White,Not Span/Hispanic,1,Emergency,Home or Self Care,2019,SKN001,SKIN AND SUBCUTANEOUS TISSUE INFECTIONS,ADM015,ADMINISTRATION OF ANTIBIOTICS,383,CELLULITIS & OTHER SKIN INFECTIONS,09,"DISEASES AND DISORDERS OF THE SKIN, SUBCUTANEOUS TISSUE AND BREAST",2,Moderate,Minor,Medical,Private Health Insurance,,,,,true,22398.17,4795.72
New York City,Kings,7002053,001304,NYU Langone Hospital-Brooklyn,30 to 49,OOS,F,Other Race,Not Span/Hispanic,1,Emergency,Left Against Medical Advice,2019,SKN001,SKIN AND SUBCUTANEOUS TISSUE INFECTIONS,,,383,CELLULITIS & OTHER SKIN INFECTIONS,09,"DISEASES AND DISORDERS OF THE SKIN, SUBCUTANEOUS TISSUE AND BREAST",2,Moderate,Minor,Medical,Blue Cross/Blue Shield,,,,,true,24359.23,8339.71
New York City,Kings,7002053,001304,NYU Langone Hospital-Brooklyn,30 to 49,114,M,Other Race,Spanish/Hispanic,2,Emergency,Home or Self Care,2019,SKN001,SKIN AND SUBCUTANEOUS TISSUE INFECTIONS,,,383,CELLULITIS & OTHER SKIN INFECTIONS,09,"DISEASES AND DISORDERS OF THE SKIN, SUBCUTANEOUS TISSUE AND BREAST",2,Moderate,Minor,Medical,Medicaid,,,,,true,30739.72,9053.6
New York City,Kings,7002053,001304,NYU Langone Hospital-Brooklyn,50 to 69,112,M,White,Not Span/Hispanic,5,Emergency,Home w/ Home Health Services,2019,SKN001,SKIN AND SUBCUTANEOUS TISSUE INFECTIONS,,,383,CELLULITIS & OTHER SKIN INFECTIONS,09,"DISEASES AND DISORDERS OF THE SKIN, SUBCUTANEOUS TISSUE AND BREAST",3,Major,Major,Medical,Medicare,,,,,true,53440.29,18159.99
New York City,Kings,7002053,001304,NYU Langone Hospital-Brooklyn,70 or Older,112,F,White,Not Span/Hispanic,6,Emergency,Home w/ Home Health Services,2019,SKN001,SKIN AND SUBCUTANEOUS TISSUE INFECTIONS,,,383,CELLULITIS & OTHER SKIN INFECTIONS,09,"DISEASES AND DISORDERS OF THE SKIN, SUBCUTANEOUS TISSUE AND BREAST",3,Major,Major,Medical,Medicare,Medicaid,,,,true,75912.34,23014.95
New York City,Kings,7002053,001304,NYU Langone Hospital-Brooklyn,50 to 69,112,M,White,Not Span/Hispanic,4,Emergency,Hospice - Medical Facility,2019,SKN001,SKIN AND SUBCUTANEOUS TISSUE INFECTIONS,ADM015,ADMINISTRATION OF ANTIBIOTICS,383,CELLULITIS & OTHER SKIN INFECTIONS,09,"DISEASES AND DISORDERS OF THE SKIN, SUBCUTANEOUS TISSUE AND BREAST",4,Extreme,Extreme,Medical,Medicaid,,,,,true,127737.19,35741.03
New York City,Kings,7002053,001304,NYU Langone Hospital-Brooklyn,50 to 69,112,M,White,Unknown,3,Emergency,Home or Self Care,2019,SKN001,SKIN AND SUBCUTANEOUS TISSUE INFECTIONS,,,383,CELLULITIS & OTHER SKIN INFECTIONS,09,"DISEASES AND DISORDERS OF THE SKIN, SUBCUTANEOUS TISSUE AND BREAST",2,Moderate,Minor,Medical,Medicaid,,,,,true,32978.74,11574
New York City,Kings,7002053,001304,NYU Langone Hospital-Brooklyn,70 or Older,112,M,Other Race,Spanish/Hispanic,5,Emergency,Home or Self Care,2019,SKN001,SKIN AND SUBCUTANEOUS TISSUE INFECTIONS,IMG008,ULTRASONOGRAPHY,383,CELLULITIS & OTHER SKIN INFECTIONS,09,"DISEASES AND DISORDERS OF THE SKIN, SUBCUTANEOUS TISSUE AND BREAST",3,Major,Moderate,Medical,Medicare,,,,,true,56875.84,19401.16
New York City,Kings,7002053,001304,NYU Langone Hospital-Brooklyn,30 to 49,112,M,Other Race,Unknown,1,Emergency,Home or Self Care,2019,SKN001,SKIN AND SUBCUTANEOUS TISSUE INFECTIONS,ADM021,"ADMINISTRATION OF THERAPEUTIC SUBSTANCES, NEC",383,CELLULITIS & OTHER SKIN INFECTIONS,09,"DISEASES AND DISORDERS OF THE SKIN, SUBCUTANEOUS TISSUE AND BREAST",1,Minor,Minor,Medical,Miscellaneous/Other,,,,,true,23647.23,8779.23
New York City,Kings,7002053,001304,NYU Langone Hospital-Brooklyn,50 to 69,112,M,White,Not Span/Hispanic,3,Emergency,Home w/ Home Health Services,2019,SKN001,SKIN AND SUBCUTANEOUS TISSUE INFECTIONS,ADM015,ADMINISTRATION OF ANTIBIOTICS,383,CELLULITIS & OTHER SKIN INFECTIONS,09,"DISEASES AND DISORDERS OF THE SKIN, SUBCUTANEOUS TISSUE AND BREAST",2,Moderate,Moderate,Medical,Medicare,Blue Cross/Blue Shield,,,,true,37794.27,11124.38
New York City,Kings,7002053,001304,NYU Langone Hospital-Brooklyn,30 to 49,112,F,Other Race,Spanish/Hispanic,1,Emergency,Home or Self Care,2019,SKN001,SKIN AND SUBCUTANEOUS TISSUE INFECTIONS,,,383,CELLULITIS & OTHER SKIN INFECTIONS,09,"DISEASES AND DISORDERS OF THE SKIN, SUBCUTANEOUS TISSUE AND BREAST",1,Minor,Minor,Medical,Medicaid,,,,,true,29376.59,9696.71
New York City,Kings,7002053,001304,NYU Langone Hospital-Brooklyn,18 to 29,112,M,Other Race,Not Span/Hispanic,6,Emergency,Home or Self Care,2019,SKN001,SKIN AND SUBCUTANEOUS TISSUE INFECTIONS,SKB002,INCISION AND DRAINAGE OF SKIN,383,CELLULITIS & OTHER SKIN INFECTIONS,09,"DISEASES AND DISORDERS OF THE SKIN, SUBCUTANEOUS TISSUE AND BREAST",2,Moderate,Minor,Medical,Medicaid,,,,,true,72704.63,21737.69
New York City,Kings,7002053,001304,NYU Langone Hospital-Brooklyn,30 to 49,112,M,Black/African American,Not Span/Hispanic,3,Emergency,Home or Self Care,2019,SKN001,SKIN AND SUBCUTANEOUS TISSUE INFECTIONS,MST005,INCISION AND DRAINAGE OF SUBCUTANEOUS TISSUE AND FASCIA,383,CELLULITIS & OTHER SKIN INFECTIONS,09,"DISEASES AND DISORDERS OF THE SKIN, SUBCUTANEOUS TISSUE AND BREAST",2,Moderate,Minor,Medical,Private Health Insurance,,,,,true,50884.07,15358.16
New York City,Kings,7002053,001304,NYU Langone Hospital-Brooklyn,70 or Older,112,F,Other Race,Spanish/Hispanic,6,Emergency,Skilled Nursing Home,2019,SKN001,SKIN AND SUBCUTANEOUS TISSUE INFECTIONS,ESA001,HEMODIALYSIS,383,CELLULITIS & OTHER SKIN INFECTIONS,09,"DISEASES AND DISORDERS OF THE SKIN, SUBCUTANEOUS TISSUE AND BREAST",4,Extreme,Major,Medical,Private Health Insurance,Medicaid,,,,true,66914.17,22898.68
New York City,Kings,7002053,001304,NYU Langone Hospital-Brooklyn,70 or Older,112,F,White,Not Span/Hispanic,5,Emergency,Home w/ Home Health Services,2019,SKN001,SKIN AND SUBCUTANEOUS TISSUE INFECTIONS,,,383,CELLULITIS & OTHER SKIN INFECTIONS,09,"DISEASES AND DISORDERS OF THE SKIN, SUBCUTANEOUS TISSUE AND BREAST",2,Moderate,Moderate,Medical,Medicare,,,,,true,49617.45,17557.39