Hospital Service Area,Hospital County,Operating Certificate Number,Permanent Facility Id,Facility Name,Age Group,Zip Code - 3 digits,Gender,Race,Ethnicity,Length of Stay,Type of Admission,Patient Disposition,Discharge Year,CCS Diagnosis Code,CCS Diagnosis Description,CCS Procedure Code,CCS Procedure Description,APR DRG Code,APR DRG Description,APR MDC Code,APR MDC Description,APR Severity of Illness Code,APR Severity of Illness Description,APR Risk of Mortality,APR Medical Surgical Description,Payment Typology 1,Payment Typology 2,Payment Typology 3,Birth Weight,Abortion Edit Indicator,Emergency Department Indicator,Total Charges,Total Costs
New York City,Kings,7002053,001304,NYU Langone Hospital-Brooklyn,70 or Older,112,F,White,Not Span/Hispanic,3,Emergency,Skilled Nursing Home,2020,SKN001,SKIN AND SUBCUTANEOUS TISSUE INFECTIONS,,,383,CELLULITIS & OTHER SKIN INFECTIONS,09,"DISEASES AND DISORDERS OF THE SKIN, SUBCUTANEOUS TISSUE AND BREAST",1,Minor,Minor,Medical,Medicare,Blue Cross/Blue Shield,,,,Y,53815.3,17927.69
New York City,Kings,7002053,001304,NYU Langone Hospital-Brooklyn,50 to 69,112,M,White,Not Span/Hispanic,4,Emergency,Home or Self Care,2020,SKN001,SKIN AND SUBCUTANEOUS TISSUE INFECTIONS,,,383,CELLULITIS & OTHER SKIN INFECTIONS,09,"DISEASES AND DISORDERS OF THE SKIN, SUBCUTANEOUS TISSUE AND BREAST",1,Minor,Minor,Medical,Medicare,Blue Cross/Blue Shield,,,,Y,61091.64,15125.45
New York City,Kings,7002053,001304,NYU Langone Hospital-Brooklyn,50 to 69,112,M,White,Unknown,1,Emergency,Home or Self Care,2020,SKN001,SKIN AND SUBCUTANEOUS TISSUE INFECTIONS,,,383,CELLULITIS & OTHER SKIN INFECTIONS,09,"DISEASES AND DISORDERS OF THE SKIN, SUBCUTANEOUS TISSUE AND BREAST",1,Minor,Minor,Medical,Medicaid,,,,,Y,12881.94,4007.37
New York City,Kings,7002053,001304,NYU Langone Hospital-Brooklyn,70 or Older,112,F,White,Not Span/Hispanic,12,Emergency,Skilled Nursing Home,2020,SKN001,SKIN AND SUBCUTANEOUS TISSUE INFECTIONS,ADM015,ADMINISTRATION OF ANTIBIOTICS,383,CELLULITIS & OTHER SKIN INFECTIONS,09,"DISEASES AND DISORDERS OF THE SKIN, SUBCUTANEOUS TISSUE AND BREAST",4,Extreme,Extreme,Medical,Medicare,Blue Cross/Blue Shield,,,,Y,134449.46,44922.99
New York City,Kings,7002053,001304,NYU Langone Hospital-Brooklyn,50 to 69,,F,Black/African American,Not Span/Hispanic,2,Emergency,Home or Self Care,2020,SKN001,SKIN AND SUBCUTANEOUS TISSUE INFECTIONS,,,383,CELLULITIS & OTHER SKIN INFECTIONS,09,"DISEASES AND DISORDERS OF THE SKIN, SUBCUTANEOUS TISSUE AND BREAST",1,Minor,Minor,Medical,Medicaid,,,,,Y,31719.62,11065.58
New York City,Kings,7002053,001304,NYU Langone Hospital-Brooklyn,70 or Older,112,M,White,Not Span/Hispanic,3,Emergency,Home or Self Care,2020,SKN001,SKIN AND SUBCUTANEOUS TISSUE INFECTIONS,,,383,CELLULITIS & OTHER SKIN INFECTIONS,09,"DISEASES AND DISORDERS OF THE SKIN, SUBCUTANEOUS TISSUE AND BREAST",2,Moderate,Minor,Medical,Medicare,Medicare,,,,Y,54320.47,12610.6
New York City,Kings,7002053,001304,NYU Langone Hospital-Brooklyn,50 to 69,OOS,M,White,Not Span/Hispanic,1,Emergency,Home or Self Care,2020,SKN001,SKIN AND SUBCUTANEOUS TISSUE INFECTIONS,,,383,CELLULITIS & OTHER SKIN INFECTIONS,09,"DISEASES AND DISORDERS OF THE SKIN, SUBCUTANEOUS TISSUE AND BREAST",1,Minor,Minor,Medical,Self-Pay,,,,,Y,16455.92,4296.79
New York City,Kings,7002053,001304,NYU Langone Hospital-Brooklyn,50 to 69,112,M,White,Unknown,1,Emergency,Home or Self Care,2020,SKN001,SKIN AND SUBCUTANEOUS TISSUE INFECTIONS,,,383,CELLULITIS & OTHER SKIN INFECTIONS,09,"DISEASES AND DISORDERS OF THE SKIN, SUBCUTANEOUS TISSUE AND BREAST",1,Minor,Minor,Medical,Blue Cross/Blue Shield,,,,,Y,22790.04,4925.48
New York City,Kings,7002053,001304,NYU Langone Hospital-Brooklyn,30 to 49,112,M,White,Not Span/Hispanic,1,Emergency,Left Against Medical Advice,2020,SKN001,SKIN AND SUBCUTANEOUS TISSUE INFECTIONS,ADM015,ADMINISTRATION OF ANTIBIOTICS,383,CELLULITIS & OTHER SKIN INFECTIONS,09,"DISEASES AND DISORDERS OF THE SKIN, SUBCUTANEOUS TISSUE AND BREAST",2,Moderate,Minor,Medical,Private Health Insurance,,,,,Y,16978.27,4401.72
New York City,Kings,7002053,001304,NYU Langone Hospital-Brooklyn,30 to 49,112,M,White,Not Span/Hispanic,4,Emergency,Home or Self Care,2020,SKN001,SKIN AND SUBCUTANEOUS TISSUE INFECTIONS,,,383,CELLULITIS & OTHER SKIN INFECTIONS,09,"DISEASES AND DISORDERS OF THE SKIN, SUBCUTANEOUS TISSUE AND BREAST",2,Moderate,Moderate,Medical,Medicare,Medicaid,,,,Y,65283.94,18249.69
New York City,Kings,7002053,001304,NYU Langone Hospital-Brooklyn,30 to 49,112,M,Other Race,Spanish/Hispanic,3,Emergency,Home or Self Care,2020,SKN001,SKIN AND SUBCUTANEOUS TISSUE INFECTIONS,SKB002,INCISION AND DRAINAGE OF SKIN,383,CELLULITIS & OTHER SKIN INFECTIONS,09,"DISEASES AND DISORDERS OF THE SKIN, SUBCUTANEOUS TISSUE AND BREAST",1,Minor,Minor,Medical,Self-Pay,,,,,Y,38001.33,11422.32
New York City,Kings,7002053,001304,NYU Langone Hospital-Brooklyn,70 or Older,112,F,White,Spanish/Hispanic,6,Emergency,Skilled Nursing Home,2020,SKN001,SKIN AND SUBCUTANEOUS TISSUE INFECTIONS,CAR024,VENOUS AND ARTERIAL CATHETER PLACEMENT,383,CELLULITIS & OTHER SKIN INFECTIONS,09,"DISEASES AND DISORDERS OF THE SKIN, SUBCUTANEOUS TISSUE AND BREAST",3,Major,Moderate,Medical,Medicare,Medicare,,,,Y,70746.93,21830.87
New York City,Kings,7002053,001304,NYU Langone Hospital-Brooklyn,50 to 69,112,F,Other Race,Spanish/Hispanic,2,Emergency,Left Against Medical Advice,2020,SKN001,SKIN AND SUBCUTANEOUS TISSUE INFECTIONS,ADM015,ADMINISTRATION OF ANTIBIOTICS,383,CELLULITIS & OTHER SKIN INFECTIONS,09,"DISEASES AND DISORDERS OF THE SKIN, SUBCUTANEOUS TISSUE AND BREAST",2,Moderate,Minor,Medical,Medicaid,,,,,Y,36242.63,8769.43
New York City,Kings,7002053,001304,NYU Langone Hospital-Brooklyn,30 to 49,113,M,Other Race,Spanish/Hispanic,1,Emergency,Home or Self Care,2020,SKN001,SKIN AND SUBCUTANEOUS TISSUE INFECTIONS,,,383,CELLULITIS & OTHER SKIN INFECTIONS,09,"DISEASES AND DISORDERS OF THE SKIN, SUBCUTANEOUS TISSUE AND BREAST",2,Moderate,Minor,Medical,Medicaid,,,,,Y,33382.85,8778.44
New York City,Kings,7002053,001304,NYU Langone Hospital-Brooklyn,50 to 69,112,M,White,Not Span/Hispanic,4,Emergency,Home or Self Care,2020,SKN001,SKIN AND SUBCUTANEOUS TISSUE INFECTIONS,,,383,CELLULITIS & OTHER SKIN INFECTIONS,09,"DISEASES AND DISORDERS OF THE SKIN, SUBCUTANEOUS TISSUE AND BREAST",2,Moderate,Minor,Medical,Self-Pay,,,,,Y,54823.22,14550.52
New York City,Kings,7002053,001304,NYU Langone Hospital-Brooklyn,70 or Older,112,F,White,Not Span/Hispanic,5,Emergency,Home w/ Home Health Services,2020,SKN001,SKIN AND SUBCUTANEOUS TISSUE INFECTIONS,ADM015,ADMINISTRATION OF ANTIBIOTICS,383,CELLULITIS & OTHER SKIN INFECTIONS,09,"DISEASES AND DISORDERS OF THE SKIN, SUBCUTANEOUS TISSUE AND BREAST",3,Major,Major,Medical,Medicare,,,,,Y,68909.45,18468.98
New York City,Kings,7002053,001304,NYU Langone Hospital-Brooklyn,70 or Older,112,F,White,Not Span/Hispanic,4,Emergency,Home w/ Home Health Services,2020,SKN001,SKIN AND SUBCUTANEOUS TISSUE INFECTIONS,IMG008,ULTRASONOGRAPHY,383,CELLULITIS & OTHER SKIN INFECTIONS,09,"DISEASES AND DISORDERS OF THE SKIN, SUBCUTANEOUS TISSUE AND BREAST",3,Major,Moderate,Medical,Medicaid,,,,,Y,63721.06,16057.67
New York City,Kings,7002053,001304,NYU Langone Hospital-Brooklyn,50 to 69,112,M,White,Not Span/Hispanic,4,Emergency,Home or Self Care,2020,SKN001,SKIN AND SUBCUTANEOUS TISSUE INFECTIONS,ESA001,HEMODIALYSIS,383,CELLULITIS & OTHER SKIN INFECTIONS,09,"DISEASES AND DISORDERS OF THE SKIN, SUBCUTANEOUS TISSUE AND BREAST",3,Major,Moderate,Medical,Medicare,Blue Cross/Blue Shield,,,,Y,66143.42,17911.77
New York City,Kings,7002053,001304,NYU Langone Hospital-Brooklyn,70 or Older,112,M,White,Not Span/Hispanic,11,Emergency,Skilled Nursing Home,2020,SKN001,SKIN AND SUBCUTANEOUS TISSUE INFECTIONS,ADM015,ADMINISTRATION OF ANTIBIOTICS,383,CELLULITIS & OTHER SKIN INFECTIONS,09,"DISEASES AND DISORDERS OF THE SKIN, SUBCUTANEOUS TISSUE AND BREAST",2,Moderate,Major,Medical,Medicare,,,,,Y,129617.33,40593.94
New York City,Kings,7002053,001304,NYU Langone Hospital-Brooklyn,50 to 69,112,M,White,Not Span/Hispanic,4,Emergency,Home or Self Care,2020,SKN001,SKIN AND SUBCUTANEOUS TISSUE INFECTIONS,ADM015,ADMINISTRATION OF ANTIBIOTICS,383,CELLULITIS & OTHER SKIN INFECTIONS,09,"DISEASES AND DISORDERS OF THE SKIN, SUBCUTANEOUS TISSUE AND BREAST",2,Moderate,Minor,Medical,Medicaid,,,,,Y,56376.38,15021.64
New York City,Kings,7002053,001304,NYU Langone Hospital-Brooklyn,50 to 69,112,M,Other Race,Unknown,6,Emergency,Home or Self Care,2020,SKN001,SKIN AND SUBCUTANEOUS TISSUE INFECTIONS,ADM015,ADMINISTRATION OF ANTIBIOTICS,383,CELLULITIS & OTHER SKIN INFECTIONS,09,"DISEASES AND DISORDERS OF THE SKIN, SUBCUTANEOUS TISSUE AND BREAST",2,Moderate,Minor,Medical,Medicaid,,,,,Y,93233.56,22658.36
New York City,Kings,7002053,001304,NYU Langone Hospital-Brooklyn,30 to 49,112,M,White,Spanish/Hispanic,3,Emergency,Home w/ Home Health Services,2020,SKN001,SKIN AND SUBCUTANEOUS TISSUE INFECTIONS,SKB002,INCISION AND DRAINAGE OF SKIN,383,CELLULITIS & OTHER SKIN INFECTIONS,09,"DISEASES AND DISORDERS OF THE SKIN, SUBCUTANEOUS TISSUE AND BREAST",2,Moderate,Moderate,Medical,Private Health Insurance,,,,,Y,49872.05,11210.64
New York City,Kings,7002053,001304,NYU Langone Hospital-Brooklyn,50 to 69,104,M,White,Not Span/Hispanic,20,Emergency,Home w/ Home Health Services,2020,SKN001,SKIN AND SUBCUTANEOUS TISSUE INFECTIONS,ADM015,ADMINISTRATION OF ANTIBIOTICS,383,CELLULITIS & OTHER SKIN INFECTIONS,09,"DISEASES AND DISORDERS OF THE SKIN, SUBCUTANEOUS TISSUE AND BREAST",3,Major,Moderate,Medical,Medicaid,,,,,Y,289599.68,71298.66
New York City,Kings,7002053,001304,NYU Langone Hospital-Brooklyn,50 to 69,103,M,White,Not Span/Hispanic,1,Emergency,Left Against Medical Advice,2020,SKN001,SKIN AND SUBCUTANEOUS TISSUE INFECTIONS,IMG006,COMPUTERIZED TOMOGRAPHY (CT) WITH CONTRAST,383,CELLULITIS & OTHER SKIN INFECTIONS,09,"DISEASES AND DISORDERS OF THE SKIN, SUBCUTANEOUS TISSUE AND BREAST",1,Minor,Minor,Medical,Medicare,,,,,Y,33043.85,9065.52
New York City,Kings,7002053,001304,NYU Langone Hospital-Brooklyn,50 to 69,112,F,White,Not Span/Hispanic,4,Emergency,Home or Self Care,2020,SKN001,SKIN AND SUBCUTANEOUS TISSUE INFECTIONS,,,383,CELLULITIS & OTHER SKIN INFECTIONS,09,"DISEASES AND DISORDERS OF THE SKIN, SUBCUTANEOUS TISSUE AND BREAST",2,Moderate,Moderate,Medical,Private Health Insurance,,,,,Y,49999.64,17140.39
New York City,Kings,7002053,001304,NYU Langone Hospital-Brooklyn,50 to 69,112,F,White,Not Span/Hispanic,3,Emergency,Home or Self Care,2020,SKN001,SKIN AND SUBCUTANEOUS TISSUE INFECTIONS,SKB002,INCISION AND DRAINAGE OF SKIN,383,CELLULITIS & OTHER SKIN INFECTIONS,09,"DISEASES AND DISORDERS OF THE SKIN, SUBCUTANEOUS TISSUE AND BREAST",2,Moderate,Moderate,Medical,Medicaid,,,,,Y,42293.35,14126.9
New York City,Kings,7002053,001304,NYU Langone Hospital-Brooklyn,70 or Older,112,F,White,Not Span/Hispanic,9,Emergency,Hospice - Medical Facility,2020,SKN001,SKIN AND SUBCUTANEOUS TISSUE INFECTIONS,,,383,CELLULITIS & OTHER SKIN INFECTIONS,09,"DISEASES AND DISORDERS OF THE SKIN, SUBCUTANEOUS TISSUE AND BREAST",3,Major,Major,Medical,Medicare,Blue Cross/Blue Shield,,,,Y,84889.78,30234.8
New York City,Kings,7002053,001304,NYU Langone Hospital-Brooklyn,18 to 29,OOS,F,Other Race,Not Span/Hispanic,5,Emergency,Home or Self Care,2020,SKN001,SKIN AND SUBCUTANEOUS TISSUE INFECTIONS,ADM015,ADMINISTRATION OF ANTIBIOTICS,383,CELLULITIS & OTHER SKIN INFECTIONS,09,"DISEASES AND DISORDERS OF THE SKIN, SUBCUTANEOUS TISSUE AND BREAST",2,Moderate,Minor,Medical,Medicaid,,,,,Y,46635.42,17192.21
New York City,Kings,7002053,001304,NYU Langone Hospital-Brooklyn,30 to 49,112,M,Other Race,Spanish/Hispanic,1,Emergency,Home w/ Home Health Services,2020,SKN001,SKIN AND SUBCUTANEOUS TISSUE INFECTIONS,SKB002,INCISION AND DRAINAGE OF SKIN,383,CELLULITIS & OTHER SKIN INFECTIONS,09,"DISEASES AND DISORDERS OF THE SKIN, SUBCUTANEOUS TISSUE AND BREAST",1,Minor,Minor,Medical,Medicaid,,,,,Y,30588.93,8667.66
New York City,Kings,7002053,001304,NYU Langone Hospital-Brooklyn,30 to 49,112,M,Black/African American,Not Span/Hispanic,3,Emergency,Home or Self Care,2020,SKN001,SKIN AND SUBCUTANEOUS TISSUE INFECTIONS,,,383,CELLULITIS & OTHER SKIN INFECTIONS,09,"DISEASES AND DISORDERS OF THE SKIN, SUBCUTANEOUS TISSUE AND BREAST",3,Major,Moderate,Medical,Medicare,,,,,Y,55963.77,12867.63
New York City,Kings,7002053,001304,NYU Langone Hospital-Brooklyn,30 to 49,112,M,White,Spanish/Hispanic,1,Emergency,Home w/ Home Health Services,2020,SKN001,SKIN AND SUBCUTANEOUS TISSUE INFECTIONS,MST005,INCISION AND DRAINAGE OF SUBCUTANEOUS TISSUE AND FASCIA,383,CELLULITIS & OTHER SKIN INFECTIONS,09,"DISEASES AND DISORDERS OF THE SKIN, SUBCUTANEOUS TISSUE AND BREAST",2,Moderate,Moderate,Medical,Medicaid,,,,,Y,42160.48,11808.79
New York City,Kings,7002053,001304,NYU Langone Hospital-Brooklyn,70 or Older,112,F,White,Not Span/Hispanic,7,Emergency,Home or Self Care,2020,SKN001,SKIN AND SUBCUTANEOUS TISSUE INFECTIONS,MST020,SUBCUTANEOUS TISSUE AND FASCIA EXCISION,383,CELLULITIS & OTHER SKIN INFECTIONS,09,"DISEASES AND DISORDERS OF THE SKIN, SUBCUTANEOUS TISSUE AND BREAST",3,Major,Moderate,Medical,Medicare,,,,,Y,114068.64,29145.68
New York City,Kings,7002053,001304,NYU Langone Hospital-Brooklyn,30 to 49,112,F,White,Spanish/Hispanic,2,Emergency,Home or Self Care,2020,INF008,VIRAL INFECTION,OTR004,ISOLATION PROCEDURES,383,CELLULITIS & OTHER SKIN INFECTIONS,09,"DISEASES AND DISORDERS OF THE SKIN, SUBCUTANEOUS TISSUE AND BREAST",2,Moderate,Minor,Medical,Medicaid,,,,,Y,31099.22,9845.47
New York City,Kings,7002053,001304,NYU Langone Hospital-Brooklyn,50 to 69,112,M,White,Not Span/Hispanic,2,Emergency,Home w/ Home Health Services,2020,SKN001,SKIN AND SUBCUTANEOUS TISSUE INFECTIONS,SKB009,NAIL PROCEDURES,383,CELLULITIS & OTHER SKIN INFECTIONS,09,"DISEASES AND DISORDERS OF THE SKIN, SUBCUTANEOUS TISSUE AND BREAST",2,Moderate,Moderate,Medical,Medicare,,,,,Y,38691.1,10211.92
New York City,Kings,7002053,001304,NYU Langone Hospital-Brooklyn,30 to 49,112,M,Other Race,Unknown,1,Emergency,Home or Self Care,2020,SKN001,SKIN AND SUBCUTANEOUS TISSUE INFECTIONS,,,383,CELLULITIS & OTHER SKIN INFECTIONS,09,"DISEASES AND DISORDERS OF THE SKIN, SUBCUTANEOUS TISSUE AND BREAST",1,Minor,Minor,Medical,Private Health Insurance,,,,,Y,25215.77,8125.33
New York City,Kings,7002053,001304,NYU Langone Hospital-Brooklyn,50 to 69,112,M,Other Race,Not Span/Hispanic,3,Emergency,Home or Self Care,2020,SKN001,SKIN AND SUBCUTANEOUS TISSUE INFECTIONS,,,383,CELLULITIS & OTHER SKIN INFECTIONS,09,"DISEASES AND DISORDERS OF THE SKIN, SUBCUTANEOUS TISSUE AND BREAST",3,Major,Moderate,Medical,Medicaid,,,,,Y,51873.33,11904.58
New York City,Kings,7002053,001304,NYU Langone Hospital-Brooklyn,70 or Older,112,F,White,Not Span/Hispanic,7,Emergency,Skilled Nursing Home,2020,SKN001,SKIN AND SUBCUTANEOUS TISSUE INFECTIONS,ADM015,ADMINISTRATION OF ANTIBIOTICS,383,CELLULITIS & OTHER SKIN INFECTIONS,09,"DISEASES AND DISORDERS OF THE SKIN, SUBCUTANEOUS TISSUE AND BREAST",2,Moderate,Moderate,Medical,Medicare,,,,,Y,82019.15,24474.11
New York City,Kings,7002053,001304,NYU Langone Hospital-Brooklyn,70 or Older,112,M,White,Not Span/Hispanic,3,Emergency,Home w/ Home Health Services,2020,SKN001,SKIN AND SUBCUTANEOUS TISSUE INFECTIONS,ADM015,ADMINISTRATION OF ANTIBIOTICS,383,CELLULITIS & OTHER SKIN INFECTIONS,09,"DISEASES AND DISORDERS OF THE SKIN, SUBCUTANEOUS TISSUE AND BREAST",2,Moderate,Minor,Medical,Medicare,Medicaid,,,,Y,60199.27,13228.21
New York City,Kings,7002053,001304,NYU Langone Hospital-Brooklyn,50 to 69,112,F,White,Unknown,1,Emergency,Home or Self Care,2020,SKN001,SKIN AND SUBCUTANEOUS TISSUE INFECTIONS,,,383,CELLULITIS & OTHER SKIN INFECTIONS,09,"DISEASES AND DISORDERS OF THE SKIN, SUBCUTANEOUS TISSUE AND BREAST",2,Moderate,Minor,Medical,Medicaid,,,,,Y,32003.13,10331.56
New York City,Kings,7002053,001304,NYU Langone Hospital-Brooklyn,50 to 69,112,M,White,Not Span/Hispanic,5,Emergency,Home or Self Care,2020,SKN001,SKIN AND SUBCUTANEOUS TISSUE INFECTIONS,,,383,CELLULITIS & OTHER SKIN INFECTIONS,09,"DISEASES AND DISORDERS OF THE SKIN, SUBCUTANEOUS TISSUE AND BREAST",2,Moderate,Minor,Medical,Medicaid,,,,,Y,98261.71,24821.39
New York City,Kings,7002053,001304,NYU Langone Hospital-Brooklyn,70 or Older,112,M,White,Not Span/Hispanic,3,Emergency,Home w/ Home Health Services,2020,SKN001,SKIN AND SUBCUTANEOUS TISSUE INFECTIONS,,,383,CELLULITIS & OTHER SKIN INFECTIONS,09,"DISEASES AND DISORDERS OF THE SKIN, SUBCUTANEOUS TISSUE AND BREAST",2,Moderate,Minor,Medical,Medicare,Medicare,,,,Y,54494.72,12074.63
New York City,Kings,7002053,001304,NYU Langone Hospital-Brooklyn,70 or Older,112,M,White,Not Span/Hispanic,4,Emergency,Home w/ Home Health Services,2020,SKN001,SKIN AND SUBCUTANEOUS TISSUE INFECTIONS,,,383,CELLULITIS & OTHER SKIN INFECTIONS,09,"DISEASES AND DISORDERS OF THE SKIN, SUBCUTANEOUS TISSUE AND BREAST",2,Moderate,Moderate,Medical,Medicare,,,,,Y,51656.75,15216.93
New York City,Kings,7002053,001304,NYU Langone Hospital-Brooklyn,70 or Older,112,M,White,Not Span/Hispanic,11,Elective,Home w/ Home Health Services,2020,SKN001,SKIN AND SUBCUTANEOUS TISSUE INFECTIONS,RHB002,"PHYSICAL, OCCUPATIONAL, AND RESPIRATORY THERAPY TREATMENT",383,CELLULITIS & OTHER SKIN INFECTIONS,09,"DISEASES AND DISORDERS OF THE SKIN, SUBCUTANEOUS TISSUE AND BREAST",3,Major,Major,Medical,Medicare,Private Health Insurance,,,,N,155161.01,35789.25
New York City,Kings,7002053,001304,NYU Langone Hospital-Brooklyn,70 or Older,112,F,Other Race,Not Span/Hispanic,8,Emergency,Home or Self Care,2020,SKN001,SKIN AND SUBCUTANEOUS TISSUE INFECTIONS,,,383,CELLULITIS & OTHER SKIN INFECTIONS,09,"DISEASES AND DISORDERS OF THE SKIN, SUBCUTANEOUS TISSUE AND BREAST",2,Moderate,Moderate,Medical,Medicare,Medicaid,,,,Y,79213.22,27493.31
New York City,Kings,7002053,001304,NYU Langone Hospital-Brooklyn,30 to 49,112,M,White,Not Span/Hispanic,6,Emergency,Home or Self Care,2020,SKN001,SKIN AND SUBCUTANEOUS TISSUE INFECTIONS,SKB002,INCISION AND DRAINAGE OF SKIN,383,CELLULITIS & OTHER SKIN INFECTIONS,09,"DISEASES AND DISORDERS OF THE SKIN, SUBCUTANEOUS TISSUE AND BREAST",2,Moderate,Minor,Medical,Medicaid,,,,,Y,73909.34,20831.35
New York City,Kings,7002053,001304,NYU Langone Hospital-Brooklyn,50 to 69,112,F,White,Not Span/Hispanic,2,Emergency,Home w/ Home Health Services,2020,SKN001,SKIN AND SUBCUTANEOUS TISSUE INFECTIONS,IMG008,ULTRASONOGRAPHY,383,CELLULITIS & OTHER SKIN INFECTIONS,09,"DISEASES AND DISORDERS OF THE SKIN, SUBCUTANEOUS TISSUE AND BREAST",2,Moderate,Moderate,Medical,Medicaid,,,,,Y,38013.71,11928.53
New York City,Kings,7002053,001304,NYU Langone Hospital-Brooklyn,70 or Older,112,F,Other Race,Not Span/Hispanic,3,Emergency,Home w/ Home Health Services,2020,SKN001,SKIN AND SUBCUTANEOUS TISSUE INFECTIONS,,,383,CELLULITIS & OTHER SKIN INFECTIONS,09,"DISEASES AND DISORDERS OF THE SKIN, SUBCUTANEOUS TISSUE AND BREAST",2,Moderate,Moderate,Medical,Private Health Insurance,Medicaid,,,,Y,38427.71,11678.38
New York City,Kings,7002053,001304,NYU Langone Hospital-Brooklyn,50 to 69,112,F,Other Race,Not Span/Hispanic,1,Emergency,Home or Self Care,2020,SKN001,SKIN AND SUBCUTANEOUS TISSUE INFECTIONS,,,383,CELLULITIS & OTHER SKIN INFECTIONS,09,"DISEASES AND DISORDERS OF THE SKIN, SUBCUTANEOUS TISSUE AND BREAST",2,Moderate,Minor,Medical,Medicare,,,,,Y,24248.11,7509.88
New York City,Kings,7002053,001304,NYU Langone Hospital-Brooklyn,70 or Older,112,M,Other Race,Spanish/Hispanic,2,Emergency,Home w/ Home Health Services,2020,SKN001,SKIN AND SUBCUTANEOUS TISSUE INFECTIONS,SKB002,INCISION AND DRAINAGE OF SKIN,383,CELLULITIS & OTHER SKIN INFECTIONS,09,"DISEASES AND DISORDERS OF THE SKIN, SUBCUTANEOUS TISSUE AND BREAST",3,Major,Moderate,Medical,Medicare,Medicaid,,,,Y,54505.48,14331.39
New York City,Kings,7002053,001304,NYU Langone Hospital-Brooklyn,30 to 49,112,F,Other Race,Spanish/Hispanic,1,Emergency,Home w/ Home Health Services,2020,SKN001,SKIN AND SUBCUTANEOUS TISSUE INFECTIONS,SKB002,INCISION AND DRAINAGE OF SKIN,383,CELLULITIS & OTHER SKIN INFECTIONS,09,"DISEASES AND DISORDERS OF THE SKIN, SUBCUTANEOUS TISSUE AND BREAST",1,Minor,Minor,Medical,Private Health Insurance,,,,,Y,17796.1,4464.27
New York City,Kings,7002053,001304,NYU Langone Hospital-Brooklyn,70 or Older,112,M,White,Not Span/Hispanic,2,Emergency,Skilled Nursing Home,2020,SKN001,SKIN AND SUBCUTANEOUS TISSUE INFECTIONS,,,383,CELLULITIS & OTHER SKIN INFECTIONS,09,"DISEASES AND DISORDERS OF THE SKIN, SUBCUTANEOUS TISSUE AND BREAST",2,Moderate,Major,Medical,Medicare,Medicare,,,,Y,47406.37,12913.16
New York City,Kings,7002053,001304,NYU Langone Hospital-Brooklyn,50 to 69,112,F,White,Not Span/Hispanic,3,Emergency,Home or Self Care,2020,SKN001,SKIN AND SUBCUTANEOUS TISSUE INFECTIONS,,,383,CELLULITIS & OTHER SKIN INFECTIONS,09,"DISEASES AND DISORDERS OF THE SKIN, SUBCUTANEOUS TISSUE AND BREAST",1,Minor,Minor,Medical,Private Health Insurance,,,,,Y,46019.41,14334.8
New York City,Kings,7002053,001304,NYU Langone Hospital-Brooklyn,50 to 69,112,M,White,Not Span/Hispanic,1,Emergency,Home or Self Care,2020,SKN001,SKIN AND SUBCUTANEOUS TISSUE INFECTIONS,ADM015,ADMINISTRATION OF ANTIBIOTICS,383,CELLULITIS & OTHER SKIN INFECTIONS,09,"DISEASES AND DISORDERS OF THE SKIN, SUBCUTANEOUS TISSUE AND BREAST",2,Moderate,Moderate,Medical,Medicaid,,,,,Y,27329.22,7520.85
New York City,Kings,7002053,001304,NYU Langone Hospital-Brooklyn,70 or Older,112,F,White,Spanish/Hispanic,2,Emergency,Home or Self Care,2020,SKN001,SKIN AND SUBCUTANEOUS TISSUE INFECTIONS,ADM015,ADMINISTRATION OF ANTIBIOTICS,383,CELLULITIS & OTHER SKIN INFECTIONS,09,"DISEASES AND DISORDERS OF THE SKIN, SUBCUTANEOUS TISSUE AND BREAST",2,Moderate,Moderate,Medical,Medicare,,,,,Y,44451.7,9454.16
New York City,Kings,7002053,001304,NYU Langone Hospital-Brooklyn,70 or Older,,M,White,Unknown,2,Emergency,Home w/ Home Health Services,2020,SKN001,SKIN AND SUBCUTANEOUS TISSUE INFECTIONS,SKB001,SKIN BIOPSY AND DIAGNOSTIC DRAINAGE,383,CELLULITIS & OTHER SKIN INFECTIONS,09,"DISEASES AND DISORDERS OF THE SKIN, SUBCUTANEOUS TISSUE AND BREAST",1,Minor,Minor,Medical,Private Health Insurance,,,,,Y,42370.17,11245.17
New York City,Kings,7002053,001304,NYU Langone Hospital-Brooklyn,50 to 69,112,M,Multi-racial,Spanish/Hispanic,4,Emergency,Home or Self Care,2020,SKN001,SKIN AND SUBCUTANEOUS TISSUE INFECTIONS,ADM015,ADMINISTRATION OF ANTIBIOTICS,383,CELLULITIS & OTHER SKIN INFECTIONS,09,"DISEASES AND DISORDERS OF THE SKIN, SUBCUTANEOUS TISSUE AND BREAST",2,Moderate,Minor,Medical,Medicare,,,,,Y,74548.01,20044.62
New York City,Kings,7002053,001304,NYU Langone Hospital-Brooklyn,0 to 17,112,F,White,Spanish/Hispanic,4,Emergency,Home or Self Care,2020,SKN001,SKIN AND SUBCUTANEOUS TISSUE INFECTIONS,,,383,CELLULITIS & OTHER SKIN INFECTIONS,09,"DISEASES AND DISORDERS OF THE SKIN, SUBCUTANEOUS TISSUE AND BREAST",2,Moderate,Minor,Medical,Medicaid,,,,,Y,48709.86,10613.52
New York City,Kings,7002053,001304,NYU Langone Hospital-Brooklyn,70 or Older,112,F,White,Not Span/Hispanic,3,Emergency,Home or Self Care,2020,SKN001,SKIN AND SUBCUTANEOUS TISSUE INFECTIONS,,,383,CELLULITIS & OTHER SKIN INFECTIONS,09,"DISEASES AND DISORDERS OF THE SKIN, SUBCUTANEOUS TISSUE AND BREAST",2,Moderate,Minor,Medical,Medicare,,,,,Y,48250.9,14850.15
New York City,Kings,7002053,001304,NYU Langone Hospital-Brooklyn,70 or Older,112,M,White,Not Span/Hispanic,10,Emergency,Skilled Nursing Home,2020,SKN001,SKIN AND SUBCUTANEOUS TISSUE INFECTIONS,ADM015,ADMINISTRATION OF ANTIBIOTICS,383,CELLULITIS & OTHER SKIN INFECTIONS,09,"DISEASES AND DISORDERS OF THE SKIN, SUBCUTANEOUS TISSUE AND BREAST",3,Major,Major,Medical,Medicare,,,,,Y,94186.8,33768.06
New York City,Kings,7002053,001304,NYU Langone Hospital-Brooklyn,70 or Older,103,M,White,Not Span/Hispanic,2,Emergency,Home or Self Care,2020,SKN001,SKIN AND SUBCUTANEOUS TISSUE INFECTIONS,,,383,CELLULITIS & OTHER SKIN INFECTIONS,09,"DISEASES AND DISORDERS OF THE SKIN, SUBCUTANEOUS TISSUE AND BREAST",1,Minor,Minor,Medical,Medicaid,,,,,Y,28501.02,9939.97