Hospital Service Area,Hospital County,Operating Certificate Number,Permanent Facility Id,Facility Name,Age Group,Zip Code - 3 digits,Gender,Race,Ethnicity,Length of Stay,Type of Admission,Patient Disposition,Discharge Year,CCS Diagnosis Code,CCS Diagnosis Description,CCS Procedure Code,CCS Procedure Description,APR DRG Code,APR DRG Description,APR MDC Code,APR MDC Description,APR Severity of Illness Code,APR Severity of Illness Description,APR Risk of Mortality,APR Medical Surgical Description,Payment Typology 1,Payment Typology 2,Payment Typology 3,Birth Weight,Abortion Edit Indicator,Emergency Department Indicator,Total Charges,Total Costs
Long Island,Nassau,2908000,000511,NYU Winthrop Hospital,70 or Older,110,M,White,Not Span/Hispanic,4,Emergency,Skilled Nursing Home,2017,239,Superficial injury; contusion,000,NO PROC,384,"Contusion, open wound & other trauma to skin & subcutaneous tissue",09,"Diseases and Disorders of the Skin, Subcutaneous Tissue and Breast",2,Moderate,Minor,Medical,Medicare,Medicare,Private Health Insurance,,N,Y,38942.30,7262.87
Long Island,Nassau,2908000,000511,NYU Winthrop Hospital,70 or Older,115,F,White,Not Span/Hispanic,4,Emergency,Home w/ Home Health Services,2017,239,Superficial injury; contusion,171,SUTURE SKIN/SUBCUT TISS,384,"Contusion, open wound & other trauma to skin & subcutaneous tissue",09,"Diseases and Disorders of the Skin, Subcutaneous Tissue and Breast",2,Moderate,Minor,Medical,Medicare,Medicare,,,N,Y,55886.18,13055.22
Long Island,Nassau,2908000,000511,NYU Winthrop Hospital,70 or Older,115,M,White,Not Span/Hispanic,12,Emergency,Skilled Nursing Home,2017,235,Open wounds of head; neck; and trunk,227,"OT DX PRC (INTERVW,EVAL",384,"Contusion, open wound & other trauma to skin & subcutaneous tissue",09,"Diseases and Disorders of the Skin, Subcutaneous Tissue and Breast",3,Major,Major,Medical,Medicare,Medicare,,,N,Y,73609.63,16876.63
Long Island,Nassau,2908000,000511,NYU Winthrop Hospital,50 to 69,115,M,White,Not Span/Hispanic,1,Emergency,Home or Self Care,2017,239,Superficial injury; contusion,000,NO PROC,384,"Contusion, open wound & other trauma to skin & subcutaneous tissue",09,"Diseases and Disorders of the Skin, Subcutaneous Tissue and Breast",1,Minor,Minor,Medical,Blue Cross/Blue Shield,Medicare,,,N,Y,30209.77,5459.01
Long Island,Nassau,2908000,000511,NYU Winthrop Hospital,70 or Older,115,M,White,Not Span/Hispanic,2,Emergency,Home or Self Care,2017,236,Open wounds of extremities,171,SUTURE SKIN/SUBCUT TISS,384,"Contusion, open wound & other trauma to skin & subcutaneous tissue",09,"Diseases and Disorders of the Skin, Subcutaneous Tissue and Breast",2,Moderate,Moderate,Medical,Medicare,Medicare,,,N,Y,35569.87,7822.15
Long Island,Nassau,2908000,000511,NYU Winthrop Hospital,0 to 17,115,F,White,Not Span/Hispanic,1,Emergency,Home or Self Care,2017,235,Open wounds of head; neck; and trunk,171,SUTURE SKIN/SUBCUT TISS,384,"Contusion, open wound & other trauma to skin & subcutaneous tissue",09,"Diseases and Disorders of the Skin, Subcutaneous Tissue and Breast",1,Minor,Minor,Medical,Blue Cross/Blue Shield,,,,N,Y,10565.00,1916.77
Long Island,Nassau,2908000,000511,NYU Winthrop Hospital,70 or Older,115,F,White,Not Span/Hispanic,5,Emergency,Skilled Nursing Home,2017,239,Superficial injury; contusion,000,NO PROC,384,"Contusion, open wound & other trauma to skin & subcutaneous tissue",09,"Diseases and Disorders of the Skin, Subcutaneous Tissue and Breast",1,Minor,Minor,Medical,Medicare,Medicare,Private Health Insurance,,N,Y,48252.03,9036.79
Long Island,Nassau,2908000,000511,NYU Winthrop Hospital,0 to 17,110,F,Black/African American,Not Span/Hispanic,1,Trauma,Home or Self Care,2017,239,Superficial injury; contusion,000,NO PROC,384,"Contusion, open wound & other trauma to skin & subcutaneous tissue",09,"Diseases and Disorders of the Skin, Subcutaneous Tissue and Breast",1,Minor,Minor,Medical,Self-Pay,,,,N,Y,34503.67,3866.99
Long Island,Nassau,2908000,000511,NYU Winthrop Hospital,70 or Older,115,M,White,Not Span/Hispanic,4,Urgent,Skilled Nursing Home,2017,239,Superficial injury; contusion,000,NO PROC,384,"Contusion, open wound & other trauma to skin & subcutaneous tissue",09,"Diseases and Disorders of the Skin, Subcutaneous Tissue and Breast",2,Moderate,Moderate,Medical,Medicare,Medicare,Blue Cross/Blue Shield,,N,Y,39539.04,8177.52
Long Island,Nassau,2908000,000511,NYU Winthrop Hospital,70 or Older,114,F,White,Not Span/Hispanic,2,Emergency,Home or Self Care,2017,236,Open wounds of extremities,175,OT OR THER PRC SKN/BRST,384,"Contusion, open wound & other trauma to skin & subcutaneous tissue",09,"Diseases and Disorders of the Skin, Subcutaneous Tissue and Breast",2,Moderate,Minor,Medical,Medicare,Medicare,,,N,Y,36149.11,8937.61
Long Island,Nassau,2908000,000511,NYU Winthrop Hospital,0 to 17,115,M,White,Not Span/Hispanic,1,Emergency,Home or Self Care,2017,239,Superficial injury; contusion,000,NO PROC,384,"Contusion, open wound & other trauma to skin & subcutaneous tissue",09,"Diseases and Disorders of the Skin, Subcutaneous Tissue and Breast",2,Moderate,Minor,Medical,Private Health Insurance,,,,N,Y,16045.79,2893.68
Long Island,Nassau,2908000,000511,NYU Winthrop Hospital,70 or Older,115,F,White,Not Span/Hispanic,3,Emergency,Skilled Nursing Home,2017,239,Superficial injury; contusion,222,BLOOD TRANSFUSION,384,"Contusion, open wound & other trauma to skin & subcutaneous tissue",09,"Diseases and Disorders of the Skin, Subcutaneous Tissue and Breast",2,Moderate,Moderate,Medical,Medicare,Medicare,Private Health Insurance,,N,Y,45370.55,11157.78
Long Island,Nassau,2908000,000511,NYU Winthrop Hospital,70 or Older,118,F,White,Not Span/Hispanic,10,Emergency,Home w/ Home Health Services,2017,239,Superficial injury; contusion,175,OT OR THER PRC SKN/BRST,384,"Contusion, open wound & other trauma to skin & subcutaneous tissue",09,"Diseases and Disorders of the Skin, Subcutaneous Tissue and Breast",3,Major,Moderate,Medical,Medicare,Medicare,Private Health Insurance,,N,Y,139954.02,29198.71
Long Island,Nassau,2908000,000511,NYU Winthrop Hospital,70 or Older,110,F,White,Not Span/Hispanic,3,Emergency,Skilled Nursing Home,2017,239,Superficial injury; contusion,000,NO PROC,384,"Contusion, open wound & other trauma to skin & subcutaneous tissue",09,"Diseases and Disorders of the Skin, Subcutaneous Tissue and Breast",2,Moderate,Moderate,Medical,Medicare,Medicare,Private Health Insurance,,N,Y,53488.93,8176.34
Long Island,Nassau,2908000,000511,NYU Winthrop Hospital,70 or Older,118,F,White,Not Span/Hispanic,2,Emergency,Home or Self Care,2017,236,Open wounds of extremities,168,"INCIS/DRAIN, SKIN/SUBCU",384,"Contusion, open wound & other trauma to skin & subcutaneous tissue",09,"Diseases and Disorders of the Skin, Subcutaneous Tissue and Breast",2,Moderate,Minor,Medical,Medicare,Medicare,Blue Cross/Blue Shield,,N,Y,13402.76,3078.87
Long Island,Nassau,2908000,000511,NYU Winthrop Hospital,0 to 17,115,M,Other Race,Spanish/Hispanic,1,Emergency,Home w/ Home Health Services,2017,235,Open wounds of head; neck; and trunk,000,NO PROC,384,"Contusion, open wound & other trauma to skin & subcutaneous tissue",09,"Diseases and Disorders of the Skin, Subcutaneous Tissue and Breast",2,Moderate,Minor,Medical,Medicaid,Medicaid,,,N,Y,12462.67,2987.19
Long Island,Nassau,2908000,000511,NYU Winthrop Hospital,50 to 69,115,M,White,Not Span/Hispanic,17,Emergency,Skilled Nursing Home,2017,239,Superficial injury; contusion,174,OT NON-OR THER PRC SKIN,384,"Contusion, open wound & other trauma to skin & subcutaneous tissue",09,"Diseases and Disorders of the Skin, Subcutaneous Tissue and Breast",2,Moderate,Moderate,Medical,Medicare,Medicare,Private Health Insurance,,N,Y,225376.49,45871.01
Long Island,Nassau,2908000,000511,NYU Winthrop Hospital,70 or Older,115,F,White,Not Span/Hispanic,3,Emergency,Inpatient Rehabilitation Facility,2017,239,Superficial injury; contusion,155,ARTHROCENTESIS,384,"Contusion, open wound & other trauma to skin & subcutaneous tissue",09,"Diseases and Disorders of the Skin, Subcutaneous Tissue and Breast",3,Major,Major,Medical,Medicare,Medicare,Private Health Insurance,,N,Y,36682.06,7400.90
Long Island,Nassau,2908000,000511,NYU Winthrop Hospital,30 to 49,112,M,Other Race,Not Span/Hispanic,1,Emergency,Home or Self Care,2017,235,Open wounds of head; neck; and trunk,171,SUTURE SKIN/SUBCUT TISS,384,"Contusion, open wound & other trauma to skin & subcutaneous tissue",09,"Diseases and Disorders of the Skin, Subcutaneous Tissue and Breast",2,Moderate,Major,Medical,Medicaid,,,,N,Y,39368.10,6136.07
Long Island,Nassau,2908000,000511,NYU Winthrop Hospital,0 to 17,115,F,Other Race,Spanish/Hispanic,1,Emergency,Psychiatric Hospital or Unit of Hosp,2017,239,Superficial injury; contusion,000,NO PROC,384,"Contusion, open wound & other trauma to skin & subcutaneous tissue",09,"Diseases and Disorders of the Skin, Subcutaneous Tissue and Breast",1,Minor,Minor,Medical,Medicaid,Medicaid,,,N,Y,8183.35,1804.42
Long Island,Nassau,2908000,000511,NYU Winthrop Hospital,70 or Older,117,F,White,Not Span/Hispanic,3,Emergency,Skilled Nursing Home,2017,239,Superficial injury; contusion,000,NO PROC,384,"Contusion, open wound & other trauma to skin & subcutaneous tissue",09,"Diseases and Disorders of the Skin, Subcutaneous Tissue and Breast",2,Moderate,Minor,Medical,Medicare,Medicare,Blue Cross/Blue Shield,,N,Y,29469.67,7127.36
Long Island,Nassau,2908000,000511,NYU Winthrop Hospital,70 or Older,117,F,White,Not Span/Hispanic,2,Emergency,Home or Self Care,2017,236,Open wounds of extremities,000,NO PROC,384,"Contusion, open wound & other trauma to skin & subcutaneous tissue",09,"Diseases and Disorders of the Skin, Subcutaneous Tissue and Breast",3,Major,Major,Medical,Medicare,Medicare,,,N,Y,28523.77,6090.69
Long Island,Nassau,2908000,000511,NYU Winthrop Hospital,30 to 49,117,M,White,Spanish/Hispanic,2,Emergency,Home or Self Care,2017,235,Open wounds of head; neck; and trunk,229,NONOP RMVL FOREIGN BODY,384,"Contusion, open wound & other trauma to skin & subcutaneous tissue",09,"Diseases and Disorders of the Skin, Subcutaneous Tissue and Breast",2,Moderate,Minor,Medical,Federal/State/Local/VA,,,,N,Y,69170.31,10788.26
Long Island,Nassau,2908000,000511,NYU Winthrop Hospital,0 to 17,110,M,White,Not Span/Hispanic,1,Emergency,Home or Self Care,2017,239,Superficial injury; contusion,000,NO PROC,384,"Contusion, open wound & other trauma to skin & subcutaneous tissue",09,"Diseases and Disorders of the Skin, Subcutaneous Tissue and Breast",1,Minor,Minor,Medical,Private Health Insurance,Blue Cross/Blue Shield,,,N,Y,12459.64,3014.84
Long Island,Nassau,2908000,000511,NYU Winthrop Hospital,18 to 29,114,F,Black/African American,Not Span/Hispanic,1,Emergency,Home or Self Care,2017,239,Superficial injury; contusion,000,NO PROC,384,"Contusion, open wound & other trauma to skin & subcutaneous tissue",09,"Diseases and Disorders of the Skin, Subcutaneous Tissue and Breast",1,Minor,Minor,Medical,Private Health Insurance,Federal/State/Local/VA,,,N,Y,40082.41,4901.45
Long Island,Nassau,2908000,000511,NYU Winthrop Hospital,0 to 17,115,F,White,Spanish/Hispanic,1,Emergency,Home or Self Care,2017,235,Open wounds of head; neck; and trunk,171,SUTURE SKIN/SUBCUT TISS,384,"Contusion, open wound & other trauma to skin & subcutaneous tissue",09,"Diseases and Disorders of the Skin, Subcutaneous Tissue and Breast",1,Minor,Minor,Medical,Private Health Insurance,,,,N,Y,19112.19,3711.01
Long Island,Nassau,2908000,000511,NYU Winthrop Hospital,50 to 69,117,F,White,Not Span/Hispanic,3,Emergency,Home or Self Care,2017,236,Open wounds of extremities,214,"TRACTN, SPLNT, OT WOUND",384,"Contusion, open wound & other trauma to skin & subcutaneous tissue",09,"Diseases and Disorders of the Skin, Subcutaneous Tissue and Breast",1,Minor,Minor,Medical,Blue Cross/Blue Shield,,,,N,Y,50009.32,11637.23
Long Island,Nassau,2908000,000511,NYU Winthrop Hospital,70 or Older,115,M,White,Not Span/Hispanic,3,Emergency,Home w/ Home Health Services,2017,239,Superficial injury; contusion,000,NO PROC,384,"Contusion, open wound & other trauma to skin & subcutaneous tissue",09,"Diseases and Disorders of the Skin, Subcutaneous Tissue and Breast",2,Moderate,Moderate,Medical,Medicare,Medicare,Private Health Insurance,,N,Y,60003.42,12773.70
Long Island,Nassau,2908000,000511,NYU Winthrop Hospital,50 to 69,115,M,White,Not Span/Hispanic,1,Emergency,Home or Self Care,2017,239,Superficial injury; contusion,000,NO PROC,384,"Contusion, open wound & other trauma to skin & subcutaneous tissue",09,"Diseases and Disorders of the Skin, Subcutaneous Tissue and Breast",2,Moderate,Minor,Medical,Private Health Insurance,,,,N,Y,35668.36,4686.81
Long Island,Nassau,2908000,000511,NYU Winthrop Hospital,50 to 69,115,F,White,Not Span/Hispanic,7,Emergency,Home w/ Home Health Services,2017,239,Superficial injury; contusion,000,NO PROC,384,"Contusion, open wound & other trauma to skin & subcutaneous tissue",09,"Diseases and Disorders of the Skin, Subcutaneous Tissue and Breast",2,Moderate,Minor,Medical,Private Health Insurance,Private Health Insurance,Medicare,,N,Y,138176.72,28164.07
Long Island,Nassau,2908000,000511,NYU Winthrop Hospital,0 to 17,115,F,White,Not Span/Hispanic,1,Emergency,Home or Self Care,2017,239,Superficial injury; contusion,000,NO PROC,384,"Contusion, open wound & other trauma to skin & subcutaneous tissue",09,"Diseases and Disorders of the Skin, Subcutaneous Tissue and Breast",1,Minor,Minor,Medical,Private Health Insurance,,,,N,Y,19834.00,3167.90
Long Island,Nassau,2908000,000511,NYU Winthrop Hospital,0 to 17,115,F,Other Race,Not Span/Hispanic,2,Trauma,Home or Self Care,2017,239,Superficial injury; contusion,000,NO PROC,384,"Contusion, open wound & other trauma to skin & subcutaneous tissue",09,"Diseases and Disorders of the Skin, Subcutaneous Tissue and Breast",1,Minor,Minor,Medical,Private Health Insurance,Blue Cross/Blue Shield,,,N,N,23329.69,4244.50
Long Island,Nassau,2908000,000511,NYU Winthrop Hospital,70 or Older,110,F,White,Not Span/Hispanic,4,Emergency,Skilled Nursing Home,2017,235,Open wounds of head; neck; and trunk,000,NO PROC,384,"Contusion, open wound & other trauma to skin & subcutaneous tissue",09,"Diseases and Disorders of the Skin, Subcutaneous Tissue and Breast",1,Minor,Moderate,Medical,Medicare,Medicare,Private Health Insurance,,N,Y,46227.31,8965.86
Long Island,Nassau,2908000,000511,NYU Winthrop Hospital,50 to 69,117,M,White,Not Span/Hispanic,4,Emergency,Home or Self Care,2017,236,Open wounds of extremities,000,NO PROC,384,"Contusion, open wound & other trauma to skin & subcutaneous tissue",09,"Diseases and Disorders of the Skin, Subcutaneous Tissue and Breast",1,Minor,Minor,Medical,Blue Cross/Blue Shield,,,,N,Y,30001.73,7253.95
Long Island,Nassau,2908000,000511,NYU Winthrop Hospital,0 to 17,115,F,White,Spanish/Hispanic,2,Emergency,Home or Self Care,2017,236,Open wounds of extremities,174,OT NON-OR THER PRC SKIN,384,"Contusion, open wound & other trauma to skin & subcutaneous tissue",09,"Diseases and Disorders of the Skin, Subcutaneous Tissue and Breast",1,Minor,Minor,Medical,Blue Cross/Blue Shield,,,,N,Y,47896.19,13571.39
Long Island,Nassau,2908000,000511,NYU Winthrop Hospital,18 to 29,115,M,Black/African American,Not Span/Hispanic,1,Emergency,Home or Self Care,2017,235,Open wounds of head; neck; and trunk,226,OT DX RADIO & RELATED,384,"Contusion, open wound & other trauma to skin & subcutaneous tissue",09,"Diseases and Disorders of the Skin, Subcutaneous Tissue and Breast",1,Minor,Minor,Medical,Medicaid,Medicaid,,,N,N,55730.78,12025.94
Long Island,Nassau,2908000,000511,NYU Winthrop Hospital,70 or Older,115,F,White,Not Span/Hispanic,10,Emergency,Home or Self Care,2017,239,Superficial injury; contusion,155,ARTHROCENTESIS,384,"Contusion, open wound & other trauma to skin & subcutaneous tissue",09,"Diseases and Disorders of the Skin, Subcutaneous Tissue and Breast",3,Major,Major,Medical,Medicare,Medicare,Medicaid,,N,Y,76601.77,18408.14
Long Island,Nassau,2908000,000511,NYU Winthrop Hospital,50 to 69,117,M,White,Not Span/Hispanic,1,Emergency,Home or Self Care,2017,239,Superficial injury; contusion,000,NO PROC,384,"Contusion, open wound & other trauma to skin & subcutaneous tissue",09,"Diseases and Disorders of the Skin, Subcutaneous Tissue and Breast",1,Minor,Minor,Medical,Private Health Insurance,,,,N,Y,26658.92,5552.21
Long Island,Nassau,2908000,000511,NYU Winthrop Hospital,0 to 17,,F,Other Race,Spanish/Hispanic,1,Emergency,Home or Self Care,2017,239,Superficial injury; contusion,000,NO PROC,384,"Contusion, open wound & other trauma to skin & subcutaneous tissue",09,"Diseases and Disorders of the Skin, Subcutaneous Tissue and Breast",1,Minor,Minor,Medical,Private Health Insurance,,,,N,Y,19523.38,4173.79
Long Island,Nassau,2908000,000511,NYU Winthrop Hospital,70 or Older,117,F,White,Not Span/Hispanic,1,Emergency,Left Against Medical Advice,2017,239,Superficial injury; contusion,000,NO PROC,384,"Contusion, open wound & other trauma to skin & subcutaneous tissue",09,"Diseases and Disorders of the Skin, Subcutaneous Tissue and Breast",2,Moderate,Minor,Medical,Private Health Insurance,Medicare,Medicare,,N,Y,67156.44,8812.18
Long Island,Nassau,2908000,000511,NYU Winthrop Hospital,50 to 69,115,M,White,Not Span/Hispanic,2,Emergency,Home or Self Care,2017,236,Open wounds of extremities,000,NO PROC,384,"Contusion, open wound & other trauma to skin & subcutaneous tissue",09,"Diseases and Disorders of the Skin, Subcutaneous Tissue and Breast",1,Minor,Minor,Medical,Blue Cross/Blue Shield,,,,N,Y,25100.87,4908.05
Long Island,Nassau,2908000,000511,NYU Winthrop Hospital,50 to 69,117,F,White,Not Span/Hispanic,2,Emergency,Home w/ Home Health Services,2017,239,Superficial injury; contusion,168,"INCIS/DRAIN, SKIN/SUBCU",384,"Contusion, open wound & other trauma to skin & subcutaneous tissue",09,"Diseases and Disorders of the Skin, Subcutaneous Tissue and Breast",1,Minor,Minor,Medical,Private Health Insurance,Self-Pay,,,N,Y,19628.54,4598.09
Long Island,Nassau,2908000,000511,NYU Winthrop Hospital,70 or Older,115,M,White,Not Span/Hispanic,8,Emergency,Inpatient Rehabilitation Facility,2017,239,Superficial injury; contusion,000,NO PROC,384,"Contusion, open wound & other trauma to skin & subcutaneous tissue",09,"Diseases and Disorders of the Skin, Subcutaneous Tissue and Breast",2,Moderate,Moderate,Medical,Medicare,Medicare,Private Health Insurance,,N,Y,73840.26,14877.51
Long Island,Nassau,2908000,000511,NYU Winthrop Hospital,50 to 69,115,M,White,Not Span/Hispanic,2,Emergency,Home or Self Care,2017,236,Open wounds of extremities,229,NONOP RMVL FOREIGN BODY,384,"Contusion, open wound & other trauma to skin & subcutaneous tissue",09,"Diseases and Disorders of the Skin, Subcutaneous Tissue and Breast",2,Moderate,Minor,Medical,Medicaid,Medicaid,,,N,Y,21271.42,4844.78
Long Island,Nassau,2908000,000511,NYU Winthrop Hospital,70 or Older,115,F,White,Not Span/Hispanic,3,Emergency,Skilled Nursing Home,2017,239,Superficial injury; contusion,000,NO PROC,384,"Contusion, open wound & other trauma to skin & subcutaneous tissue",09,"Diseases and Disorders of the Skin, Subcutaneous Tissue and Breast",2,Moderate,Moderate,Medical,Medicare,Medicaid,Medicare,,N,Y,36236.09,6880.78
Long Island,Nassau,2908000,000511,NYU Winthrop Hospital,0 to 17,115,M,Other Race,Not Span/Hispanic,1,Emergency,Home or Self Care,2017,236,Open wounds of extremities,000,NO PROC,384,"Contusion, open wound & other trauma to skin & subcutaneous tissue",09,"Diseases and Disorders of the Skin, Subcutaneous Tissue and Breast",1,Minor,Minor,Medical,Medicaid,Medicaid,,,N,Y,10183.56,2468.08
Long Island,Nassau,2908000,000511,NYU Winthrop Hospital,70 or Older,117,F,White,Not Span/Hispanic,1,Emergency,Home or Self Care,2017,239,Superficial injury; contusion,148,OT FRACTURE/DISLOC PRC,384,"Contusion, open wound & other trauma to skin & subcutaneous tissue",09,"Diseases and Disorders of the Skin, Subcutaneous Tissue and Breast",2,Moderate,Minor,Medical,Medicare,Medicare,,,N,Y,45664.65,6591.77
Long Island,Nassau,2908000,000511,NYU Winthrop Hospital,18 to 29,115,M,White,Not Span/Hispanic,5,Emergency,Home w/ Home Health Services,2017,236,Open wounds of extremities,175,OT OR THER PRC SKN/BRST,384,"Contusion, open wound & other trauma to skin & subcutaneous tissue",09,"Diseases and Disorders of the Skin, Subcutaneous Tissue and Breast",2,Moderate,Minor,Medical,Federal/State/Local/VA,,,,N,Y,52724.78,14295.45
Long Island,Nassau,2908000,000511,NYU Winthrop Hospital,70 or Older,115,M,White,Not Span/Hispanic,1,Emergency,Home w/ Home Health Services,2017,239,Superficial injury; contusion,174,OT NON-OR THER PRC SKIN,384,"Contusion, open wound & other trauma to skin & subcutaneous tissue",09,"Diseases and Disorders of the Skin, Subcutaneous Tissue and Breast",1,Minor,Minor,Medical,Miscellaneous/Other,Medicare,Medicare,,N,Y,45519.60,11894.35
Long Island,Nassau,2908000,000511,NYU Winthrop Hospital,50 to 69,115,M,Black/African American,Not Span/Hispanic,2,Emergency,Home w/ Home Health Services,2017,239,Superficial injury; contusion,000,NO PROC,384,"Contusion, open wound & other trauma to skin & subcutaneous tissue",09,"Diseases and Disorders of the Skin, Subcutaneous Tissue and Breast",2,Moderate,Minor,Medical,Federal/State/Local/VA,,,,N,Y,22329.68,5190.39
Long Island,Nassau,2908000,000511,NYU Winthrop Hospital,70 or Older,115,F,White,Not Span/Hispanic,2,Trauma,Home w/ Home Health Services,2017,235,Open wounds of head; neck; and trunk,171,SUTURE SKIN/SUBCUT TISS,384,"Contusion, open wound & other trauma to skin & subcutaneous tissue",09,"Diseases and Disorders of the Skin, Subcutaneous Tissue and Breast",2,Moderate,Moderate,Medical,Medicare,Medicare,Private Health Insurance,,N,Y,56039.81,11739.37
Long Island,Nassau,2908000,000511,NYU Winthrop Hospital,30 to 49,110,M,White,Spanish/Hispanic,7,Emergency,Home w/ Home Health Services,2017,239,Superficial injury; contusion,173,OT DX PRC SKIN/SUBCUTAN,384,"Contusion, open wound & other trauma to skin & subcutaneous tissue",09,"Diseases and Disorders of the Skin, Subcutaneous Tissue and Breast",2,Moderate,Minor,Medical,Medicaid,,,,N,Y,73378.43,15215.06
Long Island,Nassau,2908000,000511,NYU Winthrop Hospital,70 or Older,115,F,White,Not Span/Hispanic,4,Emergency,Skilled Nursing Home,2017,236,Open wounds of extremities,171,SUTURE SKIN/SUBCUT TISS,384,"Contusion, open wound & other trauma to skin & subcutaneous tissue",09,"Diseases and Disorders of the Skin, Subcutaneous Tissue and Breast",3,Major,Major,Medical,Medicare,Medicare,,,N,Y,52938.15,10675.08
Long Island,Nassau,2908000,000511,NYU Winthrop Hospital,18 to 29,OOS,M,Black/African American,Not Span/Hispanic,1,Trauma,Home or Self Care,2017,239,Superficial injury; contusion,000,NO PROC,384,"Contusion, open wound & other trauma to skin & subcutaneous tissue",09,"Diseases and Disorders of the Skin, Subcutaneous Tissue and Breast",1,Minor,Minor,Medical,Miscellaneous/Other,,,,N,Y,70146.50,8526.56
Long Island,Nassau,2908000,000511,NYU Winthrop Hospital,0 to 17,115,M,White,Spanish/Hispanic,1,Emergency,Home or Self Care,2017,239,Superficial injury; contusion,000,NO PROC,384,"Contusion, open wound & other trauma to skin & subcutaneous tissue",09,"Diseases and Disorders of the Skin, Subcutaneous Tissue and Breast",1,Minor,Minor,Medical,Medicaid,Medicaid,,,N,Y,30505.21,5324.21
Long Island,Nassau,2908000,000511,NYU Winthrop Hospital,70 or Older,115,F,Black/African American,Not Span/Hispanic,2,Emergency,Skilled Nursing Home,2017,239,Superficial injury; contusion,222,BLOOD TRANSFUSION,384,"Contusion, open wound & other trauma to skin & subcutaneous tissue",09,"Diseases and Disorders of the Skin, Subcutaneous Tissue and Breast",2,Moderate,Moderate,Medical,Medicare,Medicare,,,N,Y,48579.05,10751.80