Hospital Service Area,Hospital County,Operating Certificate Number,Permanent Facility Id,Facility Name,Age Group,Zip Code - 3 digits,Gender,Race,Ethnicity,Length of Stay,Type of Admission,Patient Disposition,Discharge Year,CCS Diagnosis Code,CCS Diagnosis Description,CCS Procedure Code,CCS Procedure Description,APR DRG Code,APR DRG Description,APR MDC Code,APR MDC Description,APR Severity of Illness Code,APR Severity of Illness Description,APR Risk of Mortality,APR Medical Surgical Description,Payment Typology 1,Payment Typology 2,Payment Typology 3,Birth Weight,Abortion Edit Indicator,Emergency Department Indicator,Total Charges,Total Costs
New York City,Manhattan,7002053,001463,NYU Langone Hospitals,70 or Older,100,M,White,Not Span/Hispanic,3,Emergency,Skilled Nursing Home,2020,INJ017,"SUPERFICIAL INJURY; CONTUSION, INITIAL ENCOUNTER",,,384,"CONTUSION, OPEN WOUND & OTHER TRAUMA TO SKIN & SUBCUTANEOUS TISSUE",09,"DISEASES AND DISORDERS OF THE SKIN, SUBCUTANEOUS TISSUE AND BREAST",2,Moderate,Minor,Medical,Medicare,,,,,Y,60209.68,15297.76
New York City,Manhattan,7002053,001463,NYU Langone Hospitals,70 or Older,100,F,White,Not Span/Hispanic,1,Emergency,Home or Self Care,2020,INJ017,"SUPERFICIAL INJURY; CONTUSION, INITIAL ENCOUNTER",ADM004,TRANSFUSION OF CLOTTING FACTORS,384,"CONTUSION, OPEN WOUND & OTHER TRAUMA TO SKIN & SUBCUTANEOUS TISSUE",09,"DISEASES AND DISORDERS OF THE SKIN, SUBCUTANEOUS TISSUE AND BREAST",2,Moderate,Minor,Medical,Medicare,Private Health Insurance,,,,Y,98153.18,13874.14
New York City,Manhattan,7002053,001463,NYU Langone Hospitals,70 or Older,100,F,White,Not Span/Hispanic,3,Emergency,Skilled Nursing Home,2020,INJ011,"OPEN WOUNDS OF HEAD AND NECK, INITIAL ENCOUNTER",SKB006,SKIN LACERATION REPAIR (EXCLUDING PERINEUM),384,"CONTUSION, OPEN WOUND & OTHER TRAUMA TO SKIN & SUBCUTANEOUS TISSUE",09,"DISEASES AND DISORDERS OF THE SKIN, SUBCUTANEOUS TISSUE AND BREAST",2,Moderate,Major,Medical,Medicare,Medicare,,,,Y,51281.46,16265.95
New York City,Manhattan,7002053,001463,NYU Langone Hospitals,70 or Older,112,F,White,Not Span/Hispanic,5,Emergency,Home or Self Care,2020,INJ017,"SUPERFICIAL INJURY; CONTUSION, INITIAL ENCOUNTER",ADM001,TRANSFUSION OF BLOOD AND BLOOD PRODUCTS,384,"CONTUSION, OPEN WOUND & OTHER TRAUMA TO SKIN & SUBCUTANEOUS TISSUE",09,"DISEASES AND DISORDERS OF THE SKIN, SUBCUTANEOUS TISSUE AND BREAST",3,Major,Major,Medical,Medicare,Medicaid,,,,Y,78738.75,24561.54
New York City,Manhattan,7002053,001463,NYU Langone Hospitals,70 or Older,104,F,Other Race,Spanish/Hispanic,9,Emergency,Skilled Nursing Home,2020,INJ017,"SUPERFICIAL INJURY; CONTUSION, INITIAL ENCOUNTER",ADM001,TRANSFUSION OF BLOOD AND BLOOD PRODUCTS,384,"CONTUSION, OPEN WOUND & OTHER TRAUMA TO SKIN & SUBCUTANEOUS TISSUE",09,"DISEASES AND DISORDERS OF THE SKIN, SUBCUTANEOUS TISSUE AND BREAST",2,Moderate,Major,Medical,Medicare,Medicaid,,,,Y,117681.89,35443.21
New York City,Manhattan,7002053,001463,NYU Langone Hospitals,70 or Older,100,M,White,Not Span/Hispanic,5,Emergency,Inpatient Rehabilitation Facility,2020,INJ017,"SUPERFICIAL INJURY; CONTUSION, INITIAL ENCOUNTER",ADM001,TRANSFUSION OF BLOOD AND BLOOD PRODUCTS,384,"CONTUSION, OPEN WOUND & OTHER TRAUMA TO SKIN & SUBCUTANEOUS TISSUE",09,"DISEASES AND DISORDERS OF THE SKIN, SUBCUTANEOUS TISSUE AND BREAST",3,Major,Major,Medical,Medicare,Private Health Insurance,,,,Y,88875.51,22291.71
New York City,Manhattan,7002053,001463,NYU Langone Hospitals,18 to 29,104,F,Other Race,Spanish/Hispanic,3,Emergency,Home w/ Home Health Services,2020,INJ012,"OPEN WOUNDS TO LIMBS, INITIAL ENCOUNTER",MST003,"SUBCUTANEOUS TISSUE, FASCIA, AND MUSCLE BIOPSY",384,"CONTUSION, OPEN WOUND & OTHER TRAUMA TO SKIN & SUBCUTANEOUS TISSUE",09,"DISEASES AND DISORDERS OF THE SKIN, SUBCUTANEOUS TISSUE AND BREAST",3,Major,Moderate,Medical,Medicaid,,,,,Y,82163.26,17078.87
New York City,Manhattan,7002053,001463,NYU Langone Hospitals,70 or Older,100,F,Other Race,Unknown,3,Emergency,Home w/ Home Health Services,2020,INJ017,"SUPERFICIAL INJURY; CONTUSION, INITIAL ENCOUNTER",,,384,"CONTUSION, OPEN WOUND & OTHER TRAUMA TO SKIN & SUBCUTANEOUS TISSUE",09,"DISEASES AND DISORDERS OF THE SKIN, SUBCUTANEOUS TISSUE AND BREAST",2,Moderate,Minor,Medical,Private Health Insurance,,,,,Y,42034.58,11956.02
New York City,Manhattan,7002053,001463,NYU Langone Hospitals,70 or Older,100,F,White,Not Span/Hispanic,2,Emergency,Home w/ Home Health Services,2020,INJ017,"SUPERFICIAL INJURY; CONTUSION, INITIAL ENCOUNTER",MAM006,PACEMAKER AND DEFIBRILLATOR INTERROGATION,384,"CONTUSION, OPEN WOUND & OTHER TRAUMA TO SKIN & SUBCUTANEOUS TISSUE",09,"DISEASES AND DISORDERS OF THE SKIN, SUBCUTANEOUS TISSUE AND BREAST",2,Moderate,Moderate,Medical,Medicare,Blue Cross/Blue Shield,,,,Y,74105.99,19113.13
New York City,Manhattan,7002053,001463,NYU Langone Hospitals,70 or Older,103,F,White,Not Span/Hispanic,2,Emergency,Home w/ Home Health Services,2020,INJ012,"OPEN WOUNDS TO LIMBS, INITIAL ENCOUNTER",SKB008,SKIN EXCISION AND DEBRIDEMENT,384,"CONTUSION, OPEN WOUND & OTHER TRAUMA TO SKIN & SUBCUTANEOUS TISSUE",09,"DISEASES AND DISORDERS OF THE SKIN, SUBCUTANEOUS TISSUE AND BREAST",1,Minor,Moderate,Medical,Medicare,,,,,Y,34707.32,10573.44
New York City,Manhattan,7002053,001463,NYU Langone Hospitals,70 or Older,100,F,White,Not Span/Hispanic,2,Emergency,Home w/ Home Health Services,2020,INJ012,"OPEN WOUNDS TO LIMBS, INITIAL ENCOUNTER",,,384,"CONTUSION, OPEN WOUND & OTHER TRAUMA TO SKIN & SUBCUTANEOUS TISSUE",09,"DISEASES AND DISORDERS OF THE SKIN, SUBCUTANEOUS TISSUE AND BREAST",2,Moderate,Minor,Medical,Medicare,Private Health Insurance,,,,Y,57463.03,17404.3
New York City,Manhattan,7002053,001463,NYU Langone Hospitals,0 to 17,112,M,White,Not Span/Hispanic,3,Emergency,Home or Self Care,2020,INJ017,"SUPERFICIAL INJURY; CONTUSION, INITIAL ENCOUNTER",MST028,"SUBCUTANEOUS TISSUE AND FASCIA PROCEDURES, NEC",384,"CONTUSION, OPEN WOUND & OTHER TRAUMA TO SKIN & SUBCUTANEOUS TISSUE",09,"DISEASES AND DISORDERS OF THE SKIN, SUBCUTANEOUS TISSUE AND BREAST",1,Minor,Minor,Medical,Medicaid,,,,,Y,59677.43,15113
New York City,Manhattan,7002053,001463,NYU Langone Hospitals,18 to 29,112,F,White,Not Span/Hispanic,2,Emergency,Home or Self Care,2020,INJ012,"OPEN WOUNDS TO LIMBS, INITIAL ENCOUNTER",,,384,"CONTUSION, OPEN WOUND & OTHER TRAUMA TO SKIN & SUBCUTANEOUS TISSUE",09,"DISEASES AND DISORDERS OF THE SKIN, SUBCUTANEOUS TISSUE AND BREAST",1,Minor,Minor,Medical,Private Health Insurance,,,,,Y,25970.54,9941.27
New York City,Manhattan,7002053,001463,NYU Langone Hospitals,70 or Older,100,F,Other Race,Spanish/Hispanic,6,Emergency,Skilled Nursing Home,2020,INJ017,"SUPERFICIAL INJURY; CONTUSION, INITIAL ENCOUNTER",OTR004,ISOLATION PROCEDURES,384,"CONTUSION, OPEN WOUND & OTHER TRAUMA TO SKIN & SUBCUTANEOUS TISSUE",09,"DISEASES AND DISORDERS OF THE SKIN, SUBCUTANEOUS TISSUE AND BREAST",3,Major,Moderate,Medical,Medicare,Medicaid,,,,Y,102677.78,36669.66
New York City,Manhattan,7002053,001463,NYU Langone Hospitals,70 or Older,100,F,White,Not Span/Hispanic,1,Emergency,Home or Self Care,2020,INJ011,"OPEN WOUNDS OF HEAD AND NECK, INITIAL ENCOUNTER",SKB006,SKIN LACERATION REPAIR (EXCLUDING PERINEUM),384,"CONTUSION, OPEN WOUND & OTHER TRAUMA TO SKIN & SUBCUTANEOUS TISSUE",09,"DISEASES AND DISORDERS OF THE SKIN, SUBCUTANEOUS TISSUE AND BREAST",2,Moderate,Moderate,Medical,Medicare,Blue Cross/Blue Shield,,,,Y,31053.12,7482.69
New York City,Manhattan,7002053,001463,NYU Langone Hospitals,70 or Older,112,F,White,Not Span/Hispanic,2,Emergency,Skilled Nursing Home,2020,INJ017,"SUPERFICIAL INJURY; CONTUSION, INITIAL ENCOUNTER",ADM010,VACCINATIONS,384,"CONTUSION, OPEN WOUND & OTHER TRAUMA TO SKIN & SUBCUTANEOUS TISSUE",09,"DISEASES AND DISORDERS OF THE SKIN, SUBCUTANEOUS TISSUE AND BREAST",2,Moderate,Minor,Medical,Medicare,Medicaid,,,,Y,56041.96,16996.08
New York City,Manhattan,7002053,001463,NYU Langone Hospitals,70 or Older,113,F,White,Unknown,9,Emergency,Skilled Nursing Home,2020,INJ017,"SUPERFICIAL INJURY; CONTUSION, INITIAL ENCOUNTER",,,384,"CONTUSION, OPEN WOUND & OTHER TRAUMA TO SKIN & SUBCUTANEOUS TISSUE",09,"DISEASES AND DISORDERS OF THE SKIN, SUBCUTANEOUS TISSUE AND BREAST",4,Extreme,Major,Medical,Medicare,,,,,Y,120597.95,45522.22
New York City,Manhattan,7002053,001463,NYU Langone Hospitals,50 to 69,111,M,Other Race,Spanish/Hispanic,9,Emergency,Home w/ Home Health Services,2020,INJ012,"OPEN WOUNDS TO LIMBS, INITIAL ENCOUNTER",MST020,SUBCUTANEOUS TISSUE AND FASCIA EXCISION,384,"CONTUSION, OPEN WOUND & OTHER TRAUMA TO SKIN & SUBCUTANEOUS TISSUE",09,"DISEASES AND DISORDERS OF THE SKIN, SUBCUTANEOUS TISSUE AND BREAST",1,Minor,Minor,Medical,Miscellaneous/Other,,,,,N,145267.25,47240.82
New York City,Manhattan,7002053,001463,NYU Langone Hospitals,70 or Older,113,F,White,Not Span/Hispanic,1,Emergency,Home w/ Home Health Services,2020,INJ017,"SUPERFICIAL INJURY; CONTUSION, INITIAL ENCOUNTER",ADM010,VACCINATIONS,384,"CONTUSION, OPEN WOUND & OTHER TRAUMA TO SKIN & SUBCUTANEOUS TISSUE",09,"DISEASES AND DISORDERS OF THE SKIN, SUBCUTANEOUS TISSUE AND BREAST",2,Moderate,Minor,Medical,Medicare,Medicaid,,,,Y,44951.09,11562.25
New York City,Manhattan,7002053,001463,NYU Langone Hospitals,70 or Older,112,F,Multi-racial,Not Span/Hispanic,1,Emergency,Home w/ Home Health Services,2020,INJ027,OTHER UNSPECIFIED INJURY,,,384,"CONTUSION, OPEN WOUND & OTHER TRAUMA TO SKIN & SUBCUTANEOUS TISSUE",09,"DISEASES AND DISORDERS OF THE SKIN, SUBCUTANEOUS TISSUE AND BREAST",2,Moderate,Moderate,Medical,Medicare,,,,,Y,59016.32,14587.34
New York City,Manhattan,7002053,001463,NYU Langone Hospitals,50 to 69,100,M,White,Not Span/Hispanic,2,Emergency,Left Against Medical Advice,2020,INJ017,"SUPERFICIAL INJURY; CONTUSION, INITIAL ENCOUNTER",EST001,PHERESIS THERAPY,384,"CONTUSION, OPEN WOUND & OTHER TRAUMA TO SKIN & SUBCUTANEOUS TISSUE",09,"DISEASES AND DISORDERS OF THE SKIN, SUBCUTANEOUS TISSUE AND BREAST",2,Moderate,Moderate,Medical,Private Health Insurance,,,,,Y,63142.78,17122.71
New York City,Manhattan,7002053,001463,NYU Langone Hospitals,70 or Older,112,M,White,Not Span/Hispanic,5,Emergency,Skilled Nursing Home,2020,INJ017,"SUPERFICIAL INJURY; CONTUSION, INITIAL ENCOUNTER",,,384,"CONTUSION, OPEN WOUND & OTHER TRAUMA TO SKIN & SUBCUTANEOUS TISSUE",09,"DISEASES AND DISORDERS OF THE SKIN, SUBCUTANEOUS TISSUE AND BREAST",2,Moderate,Moderate,Medical,Medicare,Medicare,,,,Y,108944.91,32749.72
New York City,Manhattan,7002053,001463,NYU Langone Hospitals,70 or Older,112,M,White,Not Span/Hispanic,1,Emergency,Home w/ Home Health Services,2020,INJ017,"SUPERFICIAL INJURY; CONTUSION, INITIAL ENCOUNTER",,,384,"CONTUSION, OPEN WOUND & OTHER TRAUMA TO SKIN & SUBCUTANEOUS TISSUE",09,"DISEASES AND DISORDERS OF THE SKIN, SUBCUTANEOUS TISSUE AND BREAST",2,Moderate,Moderate,Medical,Medicare,Blue Cross/Blue Shield,,,,Y,74370.34,18181
New York City,Manhattan,7002053,001463,NYU Langone Hospitals,70 or Older,100,M,White,Not Span/Hispanic,2,Emergency,Home or Self Care,2020,INJ011,"OPEN WOUNDS OF HEAD AND NECK, INITIAL ENCOUNTER",SKB006,SKIN LACERATION REPAIR (EXCLUDING PERINEUM),384,"CONTUSION, OPEN WOUND & OTHER TRAUMA TO SKIN & SUBCUTANEOUS TISSUE",09,"DISEASES AND DISORDERS OF THE SKIN, SUBCUTANEOUS TISSUE AND BREAST",2,Moderate,Moderate,Medical,Private Health Insurance,,,,,Y,45124.82,11937.63
New York City,Manhattan,7002053,001463,NYU Langone Hospitals,30 to 49,100,M,Multi-racial,Not Span/Hispanic,1,Emergency,Home or Self Care,2020,INJ012,"OPEN WOUNDS TO LIMBS, INITIAL ENCOUNTER",ADM010,VACCINATIONS,384,"CONTUSION, OPEN WOUND & OTHER TRAUMA TO SKIN & SUBCUTANEOUS TISSUE",09,"DISEASES AND DISORDERS OF THE SKIN, SUBCUTANEOUS TISSUE AND BREAST",1,Minor,Minor,Medical,Blue Cross/Blue Shield,,,,,Y,21793.76,5865.44
New York City,Manhattan,7002053,001463,NYU Langone Hospitals,70 or Older,100,F,Other Race,Not Span/Hispanic,1,Emergency,Home w/ Home Health Services,2020,INJ017,"SUPERFICIAL INJURY; CONTUSION, INITIAL ENCOUNTER",,,384,"CONTUSION, OPEN WOUND & OTHER TRAUMA TO SKIN & SUBCUTANEOUS TISSUE",09,"DISEASES AND DISORDERS OF THE SKIN, SUBCUTANEOUS TISSUE AND BREAST",1,Minor,Minor,Medical,Medicare,Medicare,,,,Y,45696.01,13669.02
New York City,Manhattan,7002053,001463,NYU Langone Hospitals,70 or Older,112,F,White,Not Span/Hispanic,4,Emergency,Skilled Nursing Home,2020,INJ011,"OPEN WOUNDS OF HEAD AND NECK, INITIAL ENCOUNTER",SKB006,SKIN LACERATION REPAIR (EXCLUDING PERINEUM),384,"CONTUSION, OPEN WOUND & OTHER TRAUMA TO SKIN & SUBCUTANEOUS TISSUE",09,"DISEASES AND DISORDERS OF THE SKIN, SUBCUTANEOUS TISSUE AND BREAST",3,Major,Major,Medical,Medicare,Blue Cross/Blue Shield,,,,Y,96632.18,31886.5
New York City,Manhattan,7002053,001463,NYU Langone Hospitals,70 or Older,100,M,White,Not Span/Hispanic,2,Emergency,Home w/ Home Health Services,2020,INJ017,"SUPERFICIAL INJURY; CONTUSION, INITIAL ENCOUNTER",MST028,"SUBCUTANEOUS TISSUE AND FASCIA PROCEDURES, NEC",384,"CONTUSION, OPEN WOUND & OTHER TRAUMA TO SKIN & SUBCUTANEOUS TISSUE",09,"DISEASES AND DISORDERS OF THE SKIN, SUBCUTANEOUS TISSUE AND BREAST",1,Minor,Minor,Medical,Medicare,Private Health Insurance,,,,Y,57182.06,16098.65
New York City,Manhattan,7002053,001463,NYU Langone Hospitals,70 or Older,100,M,White,Not Span/Hispanic,3,Emergency,Home w/ Home Health Services,2020,INJ017,"SUPERFICIAL INJURY; CONTUSION, INITIAL ENCOUNTER",MST028,"SUBCUTANEOUS TISSUE AND FASCIA PROCEDURES, NEC",384,"CONTUSION, OPEN WOUND & OTHER TRAUMA TO SKIN & SUBCUTANEOUS TISSUE",09,"DISEASES AND DISORDERS OF THE SKIN, SUBCUTANEOUS TISSUE AND BREAST",2,Moderate,Minor,Medical,Medicare,Private Health Insurance,,,,Y,77236.8,18822.97
