Hospital Service Area,Hospital County,Operating Certificate Number,Permanent Facility Id,Facility Name,Age Group,Zip Code - 3 digits,Gender,Race,Ethnicity,Length of Stay,Type of Admission,Patient Disposition,Discharge Year,CCS Diagnosis Code,CCS Diagnosis Description,CCS Procedure Code,CCS Procedure Description,APR DRG Code,APR DRG Description,APR MDC Code,APR MDC Description,APR Severity of Illness Code,APR Severity of Illness Description,APR Risk of Mortality,APR Medical Surgical Description,Payment Typology 1,Payment Typology 2,Payment Typology 3,Birth Weight,Abortion Edit Indicator,Emergency Department Indicator,Total Charges,Total Costs
New York City,Bronx,7000006,001168,Montefiore Medical Center-Wakefield Hospital,70 or Older,104,F,White,Not Span/Hispanic,2,Emergency,Home w/ Home Health Services,2017,253,Allergic reactions,231,OTHER THERAPEUTIC PRCS,385,"Other skin, subcutaneous tissue & breast disorders",09,"Diseases and Disorders of the Skin, Subcutaneous Tissue and Breast",3,Major,Moderate,Medical,Medicare,,,,N,Y,17149.85,2944.91
New York City,Bronx,7000006,001169,Montefiore Medical Center - Henry & Lucy Moses Div,50 to 69,104,M,Other Race,Not Span/Hispanic,9,Emergency,Home or Self Care,2017,239,Superficial injury; contusion,000,NO PROC,385,"Other skin, subcutaneous tissue & breast disorders",09,"Diseases and Disorders of the Skin, Subcutaneous Tissue and Breast",2,Moderate,Minor,Medical,Medicaid,,,,N,Y,83526.98,18925.77
New York City,Bronx,7000006,001169,Montefiore Medical Center - Henry & Lucy Moses Div,50 to 69,104,M,Black/African American,Not Span/Hispanic,5,Elective,Home w/ Home Health Services,2017,121,Other diseases of veins and lymphatics,175,OT OR THER PRC SKN/BRST,385,"Other skin, subcutaneous tissue & breast disorders",09,"Diseases and Disorders of the Skin, Subcutaneous Tissue and Breast",1,Minor,Minor,Medical,Medicare,Medicaid,,,N,N,57161.96,13030.25
New York City,Bronx,7000006,001169,Montefiore Medical Center - Henry & Lucy Moses Div,0 to 17,104,M,Other Race,Spanish/Hispanic,5,Emergency,Home or Self Care,2017,198,Other inflammatory condition of skin,231,OTHER THERAPEUTIC PRCS,385,"Other skin, subcutaneous tissue & breast disorders",09,"Diseases and Disorders of the Skin, Subcutaneous Tissue and Breast",1,Minor,Minor,Medical,Medicaid,,,,N,Y,54853.74,15200.56
New York City,Kings,7001033,001315,Kingsbrook Jewish Medical Center,50 to 69,112,F,Black/African American,Not Span/Hispanic,1,Emergency,Home or Self Care,2017,167,Nonmalignant breast conditions,174,OT NON-OR THER PRC SKIN,385,"Other skin, subcutaneous tissue & breast disorders",09,"Diseases and Disorders of the Skin, Subcutaneous Tissue and Breast",1,Minor,Minor,Medical,Medicaid,Medicaid,Self-Pay,,N,Y,17714.00,5475.61
New York City,Manhattan,7002002,001439,Mount Sinai Beth Israel,70 or Older,112,F,White,Not Span/Hispanic,13,Emergency,Home w/ Home Health Services,2017,253,Allergic reactions,180,OTHER CT SCAN,385,"Other skin, subcutaneous tissue & breast disorders",09,"Diseases and Disorders of the Skin, Subcutaneous Tissue and Breast",4,Extreme,Extreme,Medical,Medicare,Private Health Insurance,Medicaid,,N,N,87726.85,28953.81
New York City,Manhattan,7002024,001456,Mount Sinai Hospital,50 to 69,100,F,Black/African American,Not Span/Hispanic,7,Emergency,Home w/ Home Health Services,2017,121,Other diseases of veins and lymphatics,000,NO PROC,385,"Other skin, subcutaneous tissue & breast disorders",09,"Diseases and Disorders of the Skin, Subcutaneous Tissue and Breast",3,Major,Moderate,Medical,Medicaid,Self-Pay,,,N,Y,55352.59,18485.97
New York City,Manhattan,7002024,001456,Mount Sinai Hospital,30 to 49,100,F,Other Race,Not Span/Hispanic,2,Emergency,Home or Self Care,2017,200,Other skin disorders,000,NO PROC,385,"Other skin, subcutaneous tissue & breast disorders",09,"Diseases and Disorders of the Skin, Subcutaneous Tissue and Breast",2,Moderate,Minor,Medical,Private Health Insurance,Self-Pay,,,N,Y,41804.80,14887.90
Hudson Valley,Orange,3523000,000699,Orange Regional Medical Center,50 to 69,109,F,White,Not Span/Hispanic,8,Emergency,Home or Self Care,2017,253,Allergic reactions,173,OT DX PRC SKIN/SUBCUTAN,385,"Other skin, subcutaneous tissue & breast disorders",09,"Diseases and Disorders of the Skin, Subcutaneous Tissue and Breast",2,Moderate,Minor,Medical,Private Health Insurance,,,,N,Y,45167.68,13503.05
Hudson Valley,Orange,3523000,000699,Orange Regional Medical Center,50 to 69,125,F,White,Not Span/Hispanic,3,Urgent,Inpatient Rehabilitation Facility,2017,253,Allergic reactions,000,NO PROC,385,"Other skin, subcutaneous tissue & breast disorders",09,"Diseases and Disorders of the Skin, Subcutaneous Tissue and Breast",2,Moderate,Minor,Medical,Medicare,Private Health Insurance,,,N,N,15713.58,4118.34
New York City,Manhattan,7002024,001456,Mount Sinai Hospital,30 to 49,104,F,Other Race,Not Span/Hispanic,4,Emergency,Home or Self Care,2017,200,Other skin disorders,202,ELECTROCARDIOGRAM,385,"Other skin, subcutaneous tissue & breast disorders",09,"Diseases and Disorders of the Skin, Subcutaneous Tissue and Breast",1,Minor,Moderate,Medical,Medicaid,Medicaid,Self-Pay,,N,Y,40203.84,12830.02
New York City,Manhattan,7002024,001456,Mount Sinai Hospital,50 to 69,104,M,Black/African American,Not Span/Hispanic,6,Emergency,Home or Self Care,2017,198,Other inflammatory condition of skin,000,NO PROC,385,"Other skin, subcutaneous tissue & breast disorders",09,"Diseases and Disorders of the Skin, Subcutaneous Tissue and Breast",2,Moderate,Minor,Medical,Medicaid,Medicaid,Self-Pay,,N,Y,43214.30,14876.43
Hudson Valley,Westchester,5904001,001072,Montefiore New Rochelle Hospital,50 to 69,105,M,Black/African American,Not Span/Hispanic,4,Emergency,Home or Self Care,2017,121,Other diseases of veins and lymphatics,000,NO PROC,385,"Other skin, subcutaneous tissue & breast disorders",09,"Diseases and Disorders of the Skin, Subcutaneous Tissue and Breast",2,Moderate,Minor,Medical,Medicare,Medicaid,Self-Pay,,N,N,34107.04,15999.84
New York City,Bronx,7000006,001169,Montefiore Medical Center - Henry & Lucy Moses Div,18 to 29,104,F,Other Race,Spanish/Hispanic,2,Emergency,Home or Self Care,2017,200,Other skin disorders,175,OT OR THER PRC SKN/BRST,385,"Other skin, subcutaneous tissue & breast disorders",09,"Diseases and Disorders of the Skin, Subcutaneous Tissue and Breast",2,Moderate,Minor,Medical,Medicaid,,,,N,N,46435.09,10393.20
New York City,Bronx,7000006,001169,Montefiore Medical Center - Henry & Lucy Moses Div,50 to 69,104,F,Other Race,Not Span/Hispanic,11,Emergency,Home w/ Home Health Services,2017,167,Nonmalignant breast conditions,000,NO PROC,385,"Other skin, subcutaneous tissue & breast disorders",09,"Diseases and Disorders of the Skin, Subcutaneous Tissue and Breast",2,Moderate,Moderate,Medical,Medicare,,,,N,Y,87548.73,20086.12
New York City,Bronx,7000006,001169,Montefiore Medical Center - Henry & Lucy Moses Div,70 or Older,104,M,Other Race,Spanish/Hispanic,2,Emergency,Home or Self Care,2017,198,Other inflammatory condition of skin,000,NO PROC,385,"Other skin, subcutaneous tissue & breast disorders",09,"Diseases and Disorders of the Skin, Subcutaneous Tissue and Breast",1,Minor,Minor,Medical,Medicare,Private Health Insurance,,,N,N,16714.60,3537.67
New York City,Bronx,7000006,001169,Montefiore Medical Center - Henry & Lucy Moses Div,30 to 49,104,M,Other Race,Not Span/Hispanic,1,Emergency,Home or Self Care,2017,200,Other skin disorders,231,OTHER THERAPEUTIC PRCS,385,"Other skin, subcutaneous tissue & breast disorders",09,"Diseases and Disorders of the Skin, Subcutaneous Tissue and Breast",1,Minor,Minor,Medical,Medicaid,,,,N,Y,17130.98,2437.14
New York City,Kings,7001003,001288,Brooklyn Hospital Center - Downtown Campus,50 to 69,112,F,Black/African American,Unknown,6,Emergency,Home or Self Care,2017,200,Other skin disorders,222,BLOOD TRANSFUSION,385,"Other skin, subcutaneous tissue & breast disorders",09,"Diseases and Disorders of the Skin, Subcutaneous Tissue and Breast",2,Moderate,Minor,Medical,Private Health Insurance,Self-Pay,,,N,Y,51050.61,8802.11
New York City,Kings,7001003,001288,Brooklyn Hospital Center - Downtown Campus,30 to 49,112,M,White,Unknown,1,Emergency,Home or Self Care,2017,200,Other skin disorders,168,"INCIS/DRAIN, SKIN/SUBCU",385,"Other skin, subcutaneous tissue & breast disorders",09,"Diseases and Disorders of the Skin, Subcutaneous Tissue and Breast",2,Moderate,Minor,Medical,Private Health Insurance,Self-Pay,,,N,Y,11195.59,2140.88
New York City,Kings,7001003,001288,Brooklyn Hospital Center - Downtown Campus,18 to 29,112,F,Black/African American,Not Span/Hispanic,2,Emergency,Home or Self Care,2017,167,Nonmalignant breast conditions,174,OT NON-OR THER PRC SKIN,385,"Other skin, subcutaneous tissue & breast disorders",09,"Diseases and Disorders of the Skin, Subcutaneous Tissue and Breast",1,Minor,Minor,Medical,Private Health Insurance,Self-Pay,,,N,Y,29234.33,6593.82
New York City,Kings,7001037,001320,University Hospital of Brooklyn,18 to 29,112,F,Black/African American,Not Span/Hispanic,3,Emergency,Home or Self Care,2017,167,Nonmalignant breast conditions,165,BREAST BIOPSY & DX PRCS,385,"Other skin, subcutaneous tissue & breast disorders",09,"Diseases and Disorders of the Skin, Subcutaneous Tissue and Breast",1,Minor,Minor,Medical,Medicaid,Medicaid,Self-Pay,,N,Y,15364.00,10988.16
New York City,Kings,7001037,001320,University Hospital of Brooklyn,18 to 29,112,F,Black/African American,Not Span/Hispanic,2,Emergency,Left Against Medical Advice,2017,253,Allergic reactions,228,PROPHYLACTIC VAC/INOCUL,385,"Other skin, subcutaneous tissue & breast disorders",09,"Diseases and Disorders of the Skin, Subcutaneous Tissue and Breast",1,Minor,Minor,Medical,Medicare,Self-Pay,,,N,Y,11811.00,7465.29
New York City,Kings,7001037,001320,University Hospital of Brooklyn,0 to 17,112,M,Other Race,Not Span/Hispanic,3,Emergency,Home or Self Care,2017,253,Allergic reactions,231,OTHER THERAPEUTIC PRCS,385,"Other skin, subcutaneous tissue & breast disorders",09,"Diseases and Disorders of the Skin, Subcutaneous Tissue and Breast",1,Minor,Minor,Medical,Self-Pay,Self-Pay,,,N,Y,11879.00,20137.16
New York City,Kings,7002002,001324,Mount Sinai Brooklyn,30 to 49,112,F,Other Race,Not Span/Hispanic,1,Emergency,Home or Self Care,2017,167,Nonmalignant breast conditions,174,OT NON-OR THER PRC SKIN,385,"Other skin, subcutaneous tissue & breast disorders",09,"Diseases and Disorders of the Skin, Subcutaneous Tissue and Breast",1,Minor,Minor,Medical,Medicaid,Self-Pay,,,N,Y,16925.02,3959.73
New York City,Kings,7002002,001324,Mount Sinai Brooklyn,18 to 29,112,F,White,Not Span/Hispanic,2,Emergency,Home w/ Home Health Services,2017,167,Nonmalignant breast conditions,175,OT OR THER PRC SKN/BRST,385,"Other skin, subcutaneous tissue & breast disorders",09,"Diseases and Disorders of the Skin, Subcutaneous Tissue and Breast",1,Minor,Minor,Medical,Private Health Insurance,Medicaid,Self-Pay,,N,N,25565.98,4842.12
New York City,Manhattan,7002002,001439,Mount Sinai Beth Israel,50 to 69,112,F,Black/African American,Not Span/Hispanic,5,Emergency,Home w/ Home Health Services,2017,121,Other diseases of veins and lymphatics,216,RESP INTUB/MECH VENTIL,385,"Other skin, subcutaneous tissue & breast disorders",09,"Diseases and Disorders of the Skin, Subcutaneous Tissue and Breast",3,Major,Moderate,Medical,Medicaid,Medicaid,Self-Pay,,N,Y,41771.55,14539.43
New York City,Manhattan,7002024,001456,Mount Sinai Hospital,70 or Older,112,F,White,Not Span/Hispanic,6,Emergency,Home w/ Home Health Services,2017,200,Other skin disorders,165,BREAST BIOPSY & DX PRCS,385,"Other skin, subcutaneous tissue & breast disorders",09,"Diseases and Disorders of the Skin, Subcutaneous Tissue and Breast",3,Major,Major,Medical,Medicare,Medicaid,Self-Pay,,N,Y,58047.54,19318.72
New York City,Manhattan,7002032,001466,Mount Sinai West,50 to 69,100,M,White,Not Span/Hispanic,2,Emergency,Home or Self Care,2017,253,Allergic reactions,222,BLOOD TRANSFUSION,385,"Other skin, subcutaneous tissue & breast disorders",09,"Diseases and Disorders of the Skin, Subcutaneous Tissue and Breast",1,Minor,Minor,Medical,Private Health Insurance,Self-Pay,,,N,Y,21558.99,5636.31
Long Island,Nassau,2950002,000528,Nassau University Medical Center,30 to 49,115,F,White,Spanish/Hispanic,5,Emergency,Home or Self Care,2017,167,Nonmalignant breast conditions,054,OT VASC CATH; NOT HEART,385,"Other skin, subcutaneous tissue & breast disorders",09,"Diseases and Disorders of the Skin, Subcutaneous Tissue and Breast",1,Minor,Minor,Medical,Medicaid,Self-Pay,,,N,N,29046.31,11846.82
Long Island,Nassau,2950002,000528,Nassau University Medical Center,0 to 17,115,M,White,Spanish/Hispanic,3,Emergency,Home or Self Care,2017,253,Allergic reactions,231,OTHER THERAPEUTIC PRCS,385,"Other skin, subcutaneous tissue & breast disorders",09,"Diseases and Disorders of the Skin, Subcutaneous Tissue and Breast",1,Minor,Minor,Medical,Medicaid,Medicaid,Self-Pay,,N,N,15945.50,12847.20
Long Island,Nassau,2950002,000528,Nassau University Medical Center,30 to 49,115,F,Black/African American,Not Span/Hispanic,3,Emergency,Home w/ Home Health Services,2017,167,Nonmalignant breast conditions,197,OTHER DX ULTRASOUND,385,"Other skin, subcutaneous tissue & breast disorders",09,"Diseases and Disorders of the Skin, Subcutaneous Tissue and Breast",1,Minor,Minor,Medical,Medicaid,Medicaid,Self-Pay,,N,N,16564.57,6105.16
Long Island,Nassau,2950002,000528,Nassau University Medical Center,0 to 17,117,F,White,Not Span/Hispanic,1,Emergency,Home or Self Care,2017,253,Allergic reactions,231,OTHER THERAPEUTIC PRCS,385,"Other skin, subcutaneous tissue & breast disorders",09,"Diseases and Disorders of the Skin, Subcutaneous Tissue and Breast",1,Minor,Minor,Medical,Private Health Insurance,Self-Pay,,,N,Y,9813.31,6352.65
New York City,Kings,7001008,001293,"New York Community Hospital of Brooklyn, Inc",18 to 29,112,F,Black/African American,Not Span/Hispanic,3,Emergency,Home or Self Care,2017,200,Other skin disorders,163,OT NON-OR THER PRC MUSC,385,"Other skin, subcutaneous tissue & breast disorders",09,"Diseases and Disorders of the Skin, Subcutaneous Tissue and Breast",1,Minor,Minor,Medical,Private Health Insurance,Self-Pay,,,N,Y,11299.56,8559.94
New York City,Kings,7001008,001293,"New York Community Hospital of Brooklyn, Inc",50 to 69,112,F,White,Not Span/Hispanic,4,Emergency,Home or Self Care,2017,198,Other inflammatory condition of skin,227,"OT DX PRC (INTERVW,EVAL",385,"Other skin, subcutaneous tissue & breast disorders",09,"Diseases and Disorders of the Skin, Subcutaneous Tissue and Breast",2,Moderate,Minor,Medical,Blue Cross/Blue Shield,Self-Pay,,,N,Y,13949.22,6630.83
New York City,Kings,7001021,001306,New York - Presbyterian Brooklyn Methodist Hospital,0 to 17,112,M,Black/African American,Not Span/Hispanic,2,Emergency,Home or Self Care,2017,253,Allergic reactions,000,NO PROC,385,"Other skin, subcutaneous tissue & breast disorders",09,"Diseases and Disorders of the Skin, Subcutaneous Tissue and Breast",2,Moderate,Minor,Medical,Private Health Insurance,Self-Pay,,,N,Y,11560.11,6049.93
New York City,Kings,7001021,001306,New York - Presbyterian Brooklyn Methodist Hospital,70 or Older,100,F,White,Not Span/Hispanic,6,Emergency,Skilled Nursing Home,2017,253,Allergic reactions,000,NO PROC,385,"Other skin, subcutaneous tissue & breast disorders",09,"Diseases and Disorders of the Skin, Subcutaneous Tissue and Breast",3,Major,Moderate,Medical,Private Health Insurance,Self-Pay,,,N,Y,33952.38,10574.37
New York City,Manhattan,7002054,001437,New York-Presbyterian/Lower Manhattan Hospital,18 to 29,112,F,White,Not Span/Hispanic,2,Emergency,Home or Self Care,2017,167,Nonmalignant breast conditions,231,OTHER THERAPEUTIC PRCS,385,"Other skin, subcutaneous tissue & breast disorders",09,"Diseases and Disorders of the Skin, Subcutaneous Tissue and Breast",1,Minor,Minor,Medical,Medicaid,Medicaid,Self-Pay,,N,Y,19504.84,4940.15
New York City,Manhattan,7002054,001437,New York-Presbyterian/Lower Manhattan Hospital,50 to 69,100,F,Other Race,Spanish/Hispanic,1,Emergency,Home or Self Care,2017,167,Nonmalignant breast conditions,231,OTHER THERAPEUTIC PRCS,385,"Other skin, subcutaneous tissue & breast disorders",09,"Diseases and Disorders of the Skin, Subcutaneous Tissue and Breast",1,Minor,Minor,Medical,Medicare,Medicare,Medicaid,,N,Y,14197.09,4137.18
New York City,Manhattan,7002054,001437,New York-Presbyterian/Lower Manhattan Hospital,50 to 69,112,F,Other Race,Not Span/Hispanic,4,Emergency,Home or Self Care,2017,253,Allergic reactions,156,"INJ/ASP MUSC,TENDONS,ST",385,"Other skin, subcutaneous tissue & breast disorders",09,"Diseases and Disorders of the Skin, Subcutaneous Tissue and Breast",1,Minor,Moderate,Medical,Private Health Insurance,Medicaid,Self-Pay,,N,Y,40144.73,9957.79
New York City,Manhattan,7002054,001458,New York Presbyterian Hospital - New York Weill Cornell Center,0 to 17,113,F,White,Not Span/Hispanic,1,Emergency,Home or Self Care,2017,200,Other skin disorders,000,NO PROC,385,"Other skin, subcutaneous tissue & breast disorders",09,"Diseases and Disorders of the Skin, Subcutaneous Tissue and Breast",1,Minor,Minor,Medical,Medicaid,Medicaid,Self-Pay,,N,N,11706.07,3923.88
New York City,Manhattan,7002054,001458,New York Presbyterian Hospital - New York Weill Cornell Center,30 to 49,112,F,White,Not Span/Hispanic,15,Emergency,Home or Self Care,2017,253,Allergic reactions,222,BLOOD TRANSFUSION,385,"Other skin, subcutaneous tissue & breast disorders",09,"Diseases and Disorders of the Skin, Subcutaneous Tissue and Breast",3,Major,Minor,Medical,Private Health Insurance,Self-Pay,,,N,Y,151234.49,37041.42
New York City,Manhattan,7002054,001458,New York Presbyterian Hospital - New York Weill Cornell Center,30 to 49,104,M,Other Race,Spanish/Hispanic,2,Emergency,Home or Self Care,2017,253,Allergic reactions,231,OTHER THERAPEUTIC PRCS,385,"Other skin, subcutaneous tissue & breast disorders",09,"Diseases and Disorders of the Skin, Subcutaneous Tissue and Breast",2,Moderate,Moderate,Medical,Private Health Insurance,Medicaid,Self-Pay,,N,Y,25346.18,6063.67
New York City,Manhattan,7002054,001464,New York Presbyterian Hospital - Columbia Presbyterian Center,70 or Older,100,F,Other Race,Not Span/Hispanic,4,Emergency,Home or Self Care,2017,095,Other nervous system disorders,000,NO PROC,385,"Other skin, subcutaneous tissue & breast disorders",09,"Diseases and Disorders of the Skin, Subcutaneous Tissue and Breast",3,Major,Major,Medical,Medicare,Medicare,Self-Pay,,N,Y,46115.19,12103.37
New York City,Manhattan,7002054,001464,New York Presbyterian Hospital - Columbia Presbyterian Center,30 to 49,129,F,Other Race,Not Span/Hispanic,2,Emergency,Home or Self Care,2017,200,Other skin disorders,000,NO PROC,385,"Other skin, subcutaneous tissue & breast disorders",09,"Diseases and Disorders of the Skin, Subcutaneous Tissue and Breast",1,Minor,Minor,Medical,Medicaid,Medicaid,Self-Pay,,N,Y,20382.57,5068.67
New York City,Manhattan,7002054,001464,New York Presbyterian Hospital - Columbia Presbyterian Center,50 to 69,104,M,Other Race,Not Span/Hispanic,2,Emergency,Home or Self Care,2017,253,Allergic reactions,173,OT DX PRC SKIN/SUBCUTAN,385,"Other skin, subcutaneous tissue & breast disorders",09,"Diseases and Disorders of the Skin, Subcutaneous Tissue and Breast",2,Moderate,Minor,Medical,Medicare,Private Health Insurance,Self-Pay,,N,N,20903.79,4985.32
New York City,Manhattan,7002054,001464,New York Presbyterian Hospital - Columbia Presbyterian Center,30 to 49,112,F,Other Race,Not Span/Hispanic,10,Emergency,Home w/ Home Health Services,2017,121,Other diseases of veins and lymphatics,037,DX BRONCHOSCOPY & BIOPS,385,"Other skin, subcutaneous tissue & breast disorders",09,"Diseases and Disorders of the Skin, Subcutaneous Tissue and Breast",4,Extreme,Major,Medical,Medicare,Medicaid,Self-Pay,,N,Y,128372.28,32684.71
New York City,Queens,7003010,001637,New York - Presbyterian/Queens,70 or Older,113,F,Other Race,Spanish/Hispanic,7,Emergency,Skilled Nursing Home,2017,004,Mycoses,179,CT SCAN ABDOMEN,385,"Other skin, subcutaneous tissue & breast disorders",09,"Diseases and Disorders of the Skin, Subcutaneous Tissue and Breast",1,Minor,Moderate,Medical,Medicare,Medicare,Medicaid,,N,Y,45021.19,13015.99
New York City,Queens,7003010,001637,New York - Presbyterian/Queens,70 or Older,113,F,Other Race,Not Span/Hispanic,3,Emergency,Home or Self Care,2017,253,Allergic reactions,231,OTHER THERAPEUTIC PRCS,385,"Other skin, subcutaneous tissue & breast disorders",09,"Diseases and Disorders of the Skin, Subcutaneous Tissue and Breast",3,Major,Major,Medical,Medicaid,Medicaid,Self-Pay,,N,Y,20353.49,6280.21
New York City,Queens,7003010,001637,New York - Presbyterian/Queens,18 to 29,114,M,Multi-racial,Spanish/Hispanic,5,Emergency,Home or Self Care,2017,198,Other inflammatory condition of skin,231,OTHER THERAPEUTIC PRCS,385,"Other skin, subcutaneous tissue & breast disorders",09,"Diseases and Disorders of the Skin, Subcutaneous Tissue and Breast",1,Minor,Minor,Medical,Medicaid,Self-Pay,,,N,Y,34880.65,21261.90
Central NY,Onondaga,3301008,000636,Crouse Hospital,50 to 69,132,M,Black/African American,Not Span/Hispanic,1,Elective,Home or Self Care,2017,200,Other skin disorders,031,DX PRCS ON NOSE & MOUTH,385,"Other skin, subcutaneous tissue & breast disorders",09,"Diseases and Disorders of the Skin, Subcutaneous Tissue and Breast",1,Minor,Moderate,Medical,Private Health Insurance,,,,N,N,18189.98,6905.47
Central NY,Onondaga,3301008,000636,Crouse Hospital,50 to 69,132,F,White,Not Span/Hispanic,2,Urgent,Left Against Medical Advice,2017,200,Other skin disorders,231,OTHER THERAPEUTIC PRCS,385,"Other skin, subcutaneous tissue & breast disorders",09,"Diseases and Disorders of the Skin, Subcutaneous Tissue and Breast",1,Minor,Minor,Medical,Blue Cross/Blue Shield,,,,N,Y,7911.76,3389.12
Hudson Valley,Rockland,4329000,000779,Good Samaritan Hospital of Suffern,30 to 49,109,F,Black/African American,Not Span/Hispanic,1,Emergency,Home or Self Care,2017,253,Allergic reactions,000,NO PROC,385,"Other skin, subcutaneous tissue & breast disorders",09,"Diseases and Disorders of the Skin, Subcutaneous Tissue and Breast",1,Minor,Minor,Medical,Blue Cross/Blue Shield,,,,N,Y,19570.90,5300.76
Hudson Valley,Westchester,5903001,001061,Montefiore Mount Vernon Hospital,70 or Older,105,M,White,Not Span/Hispanic,14,Emergency,Home or Self Care,2017,121,Other diseases of veins and lymphatics,000,NO PROC,385,"Other skin, subcutaneous tissue & breast disorders",09,"Diseases and Disorders of the Skin, Subcutaneous Tissue and Breast",3,Major,Moderate,Medical,Blue Cross/Blue Shield,Medicare,Self-Pay,,N,N,89550.95,39825.87
Hudson Valley,Westchester,5904001,001072,Montefiore New Rochelle Hospital,70 or Older,108,M,White,Not Span/Hispanic,2,Emergency,Home or Self Care,2017,198,Other inflammatory condition of skin,000,NO PROC,385,"Other skin, subcutaneous tissue & breast disorders",09,"Diseases and Disorders of the Skin, Subcutaneous Tissue and Breast",1,Minor,Minor,Medical,Medicare,Medicare,Private Health Insurance,,N,N,14740.00,6941.17
New York City,Bronx,7000011,001175,Calvary Hospital Inc,70 or Older,104,F,White,Not Span/Hispanic,114,Elective,Home or Self Care,2017,023,Other non-epithelial cancer of skin,000,NO PROC,385,"Other skin, subcutaneous tissue & breast disorders",09,"Diseases and Disorders of the Skin, Subcutaneous Tissue and Breast",2,Moderate,Moderate,Medical,Medicare,Medicare,Medicaid,,N,N,233657.67,126657.88
,,,,Redacted for Confidentiality,18 to 29,,M,Other Race,Not Span/Hispanic,39,Elective,Home or Self Care,2017,200,Other skin disorders,000,NO PROC,385,"Other skin, subcutaneous tissue & breast disorders",09,"Diseases and Disorders of the Skin, Subcutaneous Tissue and Breast",3,Major,Minor,Medical,Private Health Insurance,,,,N,N,81660.92,44265.61