Hospital Service Area,Hospital County,Operating Certificate Number,Permanent Facility Id,Facility Name,Age Group,Zip Code - 3 digits,Gender,Race,Ethnicity,Length of Stay,Type of Admission,Patient Disposition,Discharge Year,CCS Diagnosis Code,CCS Diagnosis Description,CCS Procedure Code,CCS Procedure Description,APR DRG Code,APR DRG Description,APR MDC Code,APR MDC Description,APR Severity of Illness Code,APR Severity of Illness Description,APR Risk of Mortality,APR Medical Surgical Description,Payment Typology 1,Payment Typology 2,Payment Typology 3,Birth Weight,Abortion Edit Indicator,Emergency Department Indicator,Total Charges,Total Costs
New York City,Manhattan,7002001,001438,Bellevue Hospital Center,50 to 69,101,F,Other Race,Not Span/Hispanic,3,Emergency,Home or Self Care,2017,121,Other diseases of veins and lymphatics,231,OTHER THERAPEUTIC PRCS,385,"Other skin, subcutaneous tissue & breast disorders",09,"Diseases and Disorders of the Skin, Subcutaneous Tissue and Breast",1,Minor,Moderate,Medical,Medicaid,Medicaid,,,N,Y,17920.53,11554.23
New York City,Manhattan,7002001,001438,Bellevue Hospital Center,30 to 49,100,M,Black/African American,Not Span/Hispanic,3,Emergency,Home or Self Care,2017,198,Other inflammatory condition of skin,222,BLOOD TRANSFUSION,385,"Other skin, subcutaneous tissue & breast disorders",09,"Diseases and Disorders of the Skin, Subcutaneous Tissue and Breast",2,Moderate,Minor,Medical,Medicaid,Medicaid,,,N,Y,19139.33,12340.04
New York City,Manhattan,7002001,001438,Bellevue Hospital Center,50 to 69,100,M,Other Race,Not Span/Hispanic,2,Emergency,Home or Self Care,2017,007,Viral infection,077,PROCTOSCOPY & AR BIOPSY,385,"Other skin, subcutaneous tissue & breast disorders",09,"Diseases and Disorders of the Skin, Subcutaneous Tissue and Breast",2,Moderate,Minor,Medical,Medicare,Medicare,Medicaid,,N,N,12401.43,7995.80
New York City,Manhattan,7002001,001438,Bellevue Hospital Center,18 to 29,100,F,Other Race,Not Span/Hispanic,2,Emergency,Home or Self Care,2017,253,Allergic reactions,000,NO PROC,385,"Other skin, subcutaneous tissue & breast disorders",09,"Diseases and Disorders of the Skin, Subcutaneous Tissue and Breast",1,Minor,Minor,Medical,Private Health Insurance,,,,N,Y,14545.32,9378.07
New York City,Manhattan,7002001,001438,Bellevue Hospital Center,50 to 69,100,M,Other Race,Not Span/Hispanic,9,Emergency,Home or Self Care,2017,200,Other skin disorders,159,OT DX PRCS ON MUSC/SKEL,385,"Other skin, subcutaneous tissue & breast disorders",09,"Diseases and Disorders of the Skin, Subcutaneous Tissue and Breast",1,Minor,Moderate,Medical,Medicaid,Medicaid,,,N,Y,65706.76,42364.30
New York City,Manhattan,7002001,001438,Bellevue Hospital Center,0 to 17,100,M,Black/African American,Not Span/Hispanic,3,Emergency,Home or Self Care,2017,253,Allergic reactions,032,OT NON-OR THER PRC NOSE,385,"Other skin, subcutaneous tissue & breast disorders",09,"Diseases and Disorders of the Skin, Subcutaneous Tissue and Breast",1,Minor,Minor,Medical,Medicaid,Medicaid,,,N,Y,17270.70,11135.25
New York City,Manhattan,7002001,001438,Bellevue Hospital Center,70 or Older,100,M,Black/African American,Not Span/Hispanic,31,Emergency,Home or Self Care,2017,008,Other infections; including parasitic,231,OTHER THERAPEUTIC PRCS,385,"Other skin, subcutaneous tissue & breast disorders",09,"Diseases and Disorders of the Skin, Subcutaneous Tissue and Breast",1,Minor,Minor,Medical,Medicaid,Medicaid,,,N,Y,151531.69,97699.75
New York City,Manhattan,7002001,001438,Bellevue Hospital Center,50 to 69,100,M,White,Not Span/Hispanic,4,Emergency,Home or Self Care,2017,008,Other infections; including parasitic,222,BLOOD TRANSFUSION,385,"Other skin, subcutaneous tissue & breast disorders",09,"Diseases and Disorders of the Skin, Subcutaneous Tissue and Breast",2,Moderate,Minor,Medical,Medicaid,,,,N,Y,26222.19,16906.70
New York City,Manhattan,7002001,001438,Bellevue Hospital Center,50 to 69,100,M,White,Not Span/Hispanic,6,Emergency,Home or Self Care,2017,008,Other infections; including parasitic,174,OT NON-OR THER PRC SKIN,385,"Other skin, subcutaneous tissue & breast disorders",09,"Diseases and Disorders of the Skin, Subcutaneous Tissue and Breast",1,Minor,Minor,Medical,Medicaid,Medicaid,,,N,Y,33187.99,21397.89
New York City,Manhattan,7002001,001438,Bellevue Hospital Center,30 to 49,104,M,Other Race,Not Span/Hispanic,2,Emergency,Home or Self Care,2017,047,Other and unspecified benign neoplasm,175,OT OR THER PRC SKN/BRST,385,"Other skin, subcutaneous tissue & breast disorders",09,"Diseases and Disorders of the Skin, Subcutaneous Tissue and Breast",1,Minor,Minor,Medical,Medicaid,,,,N,N,15290.30,9858.39
New York City,Manhattan,7002001,001438,Bellevue Hospital Center,50 to 69,100,M,White,Not Span/Hispanic,4,Emergency,Home or Self Care,2017,008,Other infections; including parasitic,000,NO PROC,385,"Other skin, subcutaneous tissue & breast disorders",09,"Diseases and Disorders of the Skin, Subcutaneous Tissue and Breast",2,Moderate,Moderate,Medical,Self-Pay,,,,N,Y,27696.79,17857.45
New York City,Manhattan,7002001,001438,Bellevue Hospital Center,30 to 49,100,M,Other Race,Not Span/Hispanic,1,Emergency,Home or Self Care,2017,200,Other skin disorders,000,NO PROC,385,"Other skin, subcutaneous tissue & breast disorders",09,"Diseases and Disorders of the Skin, Subcutaneous Tissue and Breast",1,Minor,Minor,Medical,Self-Pay,,,,N,Y,18565.23,11969.89
New York City,Manhattan,7002001,001438,Bellevue Hospital Center,70 or Older,100,M,Other Race,Not Span/Hispanic,9,Emergency,Skilled Nursing Home,2017,198,Other inflammatory condition of skin,231,OTHER THERAPEUTIC PRCS,385,"Other skin, subcutaneous tissue & breast disorders",09,"Diseases and Disorders of the Skin, Subcutaneous Tissue and Breast",2,Moderate,Moderate,Medical,Medicare,Medicare,Medicaid,,N,Y,46115.98,29733.19
New York City,Manhattan,7002001,001438,Bellevue Hospital Center,0 to 17,112,M,Other Race,Spanish/Hispanic,1,Emergency,Home or Self Care,2017,200,Other skin disorders,000,NO PROC,385,"Other skin, subcutaneous tissue & breast disorders",09,"Diseases and Disorders of the Skin, Subcutaneous Tissue and Breast",1,Minor,Minor,Medical,Medicaid,Medicaid,,,N,Y,8881.08,5726.06
New York City,Manhattan,7002001,001438,Bellevue Hospital Center,70 or Older,112,F,White,Not Span/Hispanic,2,Emergency,Home or Self Care,2017,253,Allergic reactions,177,COMP AXIAL TOMOGR (CT),385,"Other skin, subcutaneous tissue & breast disorders",09,"Diseases and Disorders of the Skin, Subcutaneous Tissue and Breast",1,Minor,Moderate,Medical,Medicaid,,,,N,Y,14960.75,9645.91
New York City,Manhattan,7002001,001438,Bellevue Hospital Center,50 to 69,113,M,Other Race,Not Span/Hispanic,24,Emergency,Left Against Medical Advice,2017,198,Other inflammatory condition of skin,173,OT DX PRC SKIN/SUBCUTAN,385,"Other skin, subcutaneous tissue & breast disorders",09,"Diseases and Disorders of the Skin, Subcutaneous Tissue and Breast",3,Major,Minor,Medical,Department of Corrections,,,,N,Y,133902.40,86333.30
New York City,Manhattan,7002001,001438,Bellevue Hospital Center,50 to 69,100,M,White,Not Span/Hispanic,1,Emergency,Left Against Medical Advice,2017,253,Allergic reactions,231,OTHER THERAPEUTIC PRCS,385,"Other skin, subcutaneous tissue & breast disorders",09,"Diseases and Disorders of the Skin, Subcutaneous Tissue and Breast",2,Moderate,Minor,Medical,Self-Pay,,,,N,Y,7144.53,4606.42
New York City,Manhattan,7002001,001438,Bellevue Hospital Center,0 to 17,111,F,Other Race,Not Span/Hispanic,1,Emergency,Home or Self Care,2017,200,Other skin disorders,231,OTHER THERAPEUTIC PRCS,385,"Other skin, subcutaneous tissue & breast disorders",09,"Diseases and Disorders of the Skin, Subcutaneous Tissue and Breast",1,Minor,Minor,Medical,Medicaid,Medicaid,,,N,Y,6837.41,4408.41
New York City,Manhattan,7002001,001438,Bellevue Hospital Center,50 to 69,104,M,Black/African American,Not Span/Hispanic,3,Emergency,Home or Self Care,2017,047,Other and unspecified benign neoplasm,000,NO PROC,385,"Other skin, subcutaneous tissue & breast disorders",09,"Diseases and Disorders of the Skin, Subcutaneous Tissue and Breast",3,Major,Moderate,Medical,Medicaid,,,,N,Y,17925.91,11557.69
New York City,Manhattan,7002001,001438,Bellevue Hospital Center,50 to 69,100,M,Black/African American,Not Span/Hispanic,12,Emergency,Psychiatric Hospital or Unit of Hosp,2017,008,Other infections; including parasitic,197,OTHER DX ULTRASOUND,385,"Other skin, subcutaneous tissue & breast disorders",09,"Diseases and Disorders of the Skin, Subcutaneous Tissue and Breast",2,Moderate,Minor,Medical,Medicaid,Medicaid,,,N,Y,65426.48,42183.59
New York City,Manhattan,7002001,001438,Bellevue Hospital Center,50 to 69,112,F,Other Race,Not Span/Hispanic,2,Emergency,Home or Self Care,2017,167,Nonmalignant breast conditions,174,OT NON-OR THER PRC SKIN,385,"Other skin, subcutaneous tissue & breast disorders",09,"Diseases and Disorders of the Skin, Subcutaneous Tissue and Breast",2,Moderate,Moderate,Medical,Medicaid,,,,N,Y,14127.77,9108.85
New York City,Manhattan,7002001,001438,Bellevue Hospital Center,50 to 69,112,F,Black/African American,Not Span/Hispanic,8,Emergency,Left Against Medical Advice,2017,095,Other nervous system disorders,198,MAG RESONANCE IMAGING,385,"Other skin, subcutaneous tissue & breast disorders",09,"Diseases and Disorders of the Skin, Subcutaneous Tissue and Breast",2,Moderate,Minor,Medical,Medicare,Medicare,Medicaid,,N,Y,52096.88,33589.36
New York City,Manhattan,7002001,001438,Bellevue Hospital Center,30 to 49,112,M,Other Race,Not Span/Hispanic,2,Emergency,Home or Self Care,2017,200,Other skin disorders,000,NO PROC,385,"Other skin, subcutaneous tissue & breast disorders",09,"Diseases and Disorders of the Skin, Subcutaneous Tissue and Breast",1,Minor,Minor,Medical,Medicaid,,,,N,N,12426.44,8011.92
New York City,Manhattan,7002001,001438,Bellevue Hospital Center,70 or Older,100,M,Other Race,Not Span/Hispanic,2,Emergency,Home or Self Care,2017,121,Other diseases of veins and lymphatics,222,BLOOD TRANSFUSION,385,"Other skin, subcutaneous tissue & breast disorders",09,"Diseases and Disorders of the Skin, Subcutaneous Tissue and Breast",2,Moderate,Minor,Medical,Medicare,Medicare,Medicaid,,N,Y,13340.77,8601.43
New York City,Manhattan,7002001,001438,Bellevue Hospital Center,18 to 29,113,M,Other Race,Not Span/Hispanic,2,Emergency,Home or Self Care,2017,004,Mycoses,174,OT NON-OR THER PRC SKIN,385,"Other skin, subcutaneous tissue & breast disorders",09,"Diseases and Disorders of the Skin, Subcutaneous Tissue and Breast",1,Minor,Minor,Medical,Department of Corrections,,,,N,N,13013.73,8390.58
New York City,Manhattan,7002001,001438,Bellevue Hospital Center,30 to 49,113,M,Other Race,Not Span/Hispanic,4,Emergency,Home or Self Care,2017,167,Nonmalignant breast conditions,165,BREAST BIOPSY & DX PRCS,385,"Other skin, subcutaneous tissue & breast disorders",09,"Diseases and Disorders of the Skin, Subcutaneous Tissue and Breast",1,Minor,Minor,Medical,Department of Corrections,,,,N,N,33291.78,21464.81
New York City,Manhattan,7002001,001438,Bellevue Hospital Center,50 to 69,100,M,Black/African American,Not Span/Hispanic,8,Emergency,Home or Self Care,2017,008,Other infections; including parasitic,222,BLOOD TRANSFUSION,385,"Other skin, subcutaneous tissue & breast disorders",09,"Diseases and Disorders of the Skin, Subcutaneous Tissue and Breast",3,Major,Minor,Medical,Medicaid,,,,N,Y,44712.67,28828.40
New York City,Manhattan,7002001,001438,Bellevue Hospital Center,0 to 17,112,F,Black/African American,Not Span/Hispanic,4,Emergency,Home or Self Care,2017,004,Mycoses,231,OTHER THERAPEUTIC PRCS,385,"Other skin, subcutaneous tissue & breast disorders",09,"Diseases and Disorders of the Skin, Subcutaneous Tissue and Breast",2,Moderate,Minor,Medical,Medicaid,Medicaid,,,N,Y,26002.88,16765.30
New York City,Manhattan,7002001,001438,Bellevue Hospital Center,0 to 17,112,M,Other Race,Not Span/Hispanic,2,Emergency,Home or Self Care,2017,253,Allergic reactions,231,OTHER THERAPEUTIC PRCS,385,"Other skin, subcutaneous tissue & breast disorders",09,"Diseases and Disorders of the Skin, Subcutaneous Tissue and Breast",2,Moderate,Minor,Medical,Medicaid,Medicaid,,,N,Y,12995.88,8379.07
New York City,Manhattan,7002001,001438,Bellevue Hospital Center,18 to 29,113,F,Other Race,Spanish/Hispanic,2,Emergency,Home or Self Care,2017,253,Allergic reactions,222,BLOOD TRANSFUSION,385,"Other skin, subcutaneous tissue & breast disorders",09,"Diseases and Disorders of the Skin, Subcutaneous Tissue and Breast",1,Minor,Minor,Medical,Medicaid,Medicaid,,,N,Y,13662.60,8808.93
New York City,Manhattan,7002001,001438,Bellevue Hospital Center,50 to 69,113,M,Other Race,Not Span/Hispanic,1,Emergency,Home or Self Care,2017,047,Other and unspecified benign neoplasm,175,OT OR THER PRC SKN/BRST,385,"Other skin, subcutaneous tissue & breast disorders",09,"Diseases and Disorders of the Skin, Subcutaneous Tissue and Breast",1,Minor,Minor,Medical,Medicaid,,,,N,N,6989.17,4506.25
New York City,Manhattan,7002001,001438,Bellevue Hospital Center,50 to 69,113,F,Other Race,Not Span/Hispanic,5,Emergency,Home or Self Care,2017,167,Nonmalignant breast conditions,000,NO PROC,385,"Other skin, subcutaneous tissue & breast disorders",09,"Diseases and Disorders of the Skin, Subcutaneous Tissue and Breast",1,Minor,Minor,Medical,Medicaid,,,,N,Y,28624.27,18455.44
New York City,Manhattan,7002001,001438,Bellevue Hospital Center,50 to 69,113,M,White,Not Span/Hispanic,1,Emergency,Home or Self Care,2017,047,Other and unspecified benign neoplasm,175,OT OR THER PRC SKN/BRST,385,"Other skin, subcutaneous tissue & breast disorders",09,"Diseases and Disorders of the Skin, Subcutaneous Tissue and Breast",1,Minor,Minor,Medical,Department of Corrections,,,,N,N,6599.64,4255.10
New York City,Manhattan,7002001,001438,Bellevue Hospital Center,18 to 29,114,F,Other Race,Not Span/Hispanic,2,Emergency,Home or Self Care,2017,198,Other inflammatory condition of skin,173,OT DX PRC SKIN/SUBCUTAN,385,"Other skin, subcutaneous tissue & breast disorders",09,"Diseases and Disorders of the Skin, Subcutaneous Tissue and Breast",1,Minor,Minor,Medical,Medicaid,Medicaid,,,N,N,13673.78,8816.14
New York City,Manhattan,7002001,001438,Bellevue Hospital Center,50 to 69,100,M,Other Race,Not Span/Hispanic,9,Emergency,Left Against Medical Advice,2017,008,Other infections; including parasitic,231,OTHER THERAPEUTIC PRCS,385,"Other skin, subcutaneous tissue & breast disorders",09,"Diseases and Disorders of the Skin, Subcutaneous Tissue and Breast",2,Moderate,Minor,Medical,Medicaid,,,,N,Y,55021.26,35474.85
New York City,Manhattan,7002001,001438,Bellevue Hospital Center,0 to 17,100,M,Other Race,Spanish/Hispanic,4,Emergency,Home or Self Care,2017,047,Other and unspecified benign neoplasm,198,MAG RESONANCE IMAGING,385,"Other skin, subcutaneous tissue & breast disorders",09,"Diseases and Disorders of the Skin, Subcutaneous Tissue and Breast",1,Minor,Minor,Medical,Medicaid,Medicaid,,02500,N,Y,34629.18,22327.09
New York City,Manhattan,7002001,001438,Bellevue Hospital Center,30 to 49,100,M,Other Race,Not Span/Hispanic,3,Emergency,Home or Self Care,2017,253,Allergic reactions,032,OT NON-OR THER PRC NOSE,385,"Other skin, subcutaneous tissue & breast disorders",09,"Diseases and Disorders of the Skin, Subcutaneous Tissue and Breast",2,Moderate,Minor,Medical,Medicare,Medicaid,,,N,Y,18869.23,12165.90
New York City,Manhattan,7002001,001438,Bellevue Hospital Center,30 to 49,114,M,Other Race,Not Span/Hispanic,5,Emergency,Home or Self Care,2017,198,Other inflammatory condition of skin,228,PROPHYLACTIC VAC/INOCUL,385,"Other skin, subcutaneous tissue & breast disorders",09,"Diseases and Disorders of the Skin, Subcutaneous Tissue and Breast",2,Moderate,Minor,Medical,Medicaid,,,,N,Y,29400.15,18955.69
New York City,Manhattan,7002001,001438,Bellevue Hospital Center,50 to 69,114,F,Other Race,Not Span/Hispanic,2,Emergency,Home or Self Care,2017,253,Allergic reactions,108,INDWELLING CATHETER,385,"Other skin, subcutaneous tissue & breast disorders",09,"Diseases and Disorders of the Skin, Subcutaneous Tissue and Breast",2,Moderate,Moderate,Medical,Medicare,Medicaid,,,N,Y,13322.85,8589.88
New York City,Manhattan,7002001,001438,Bellevue Hospital Center,18 to 29,113,F,Other Race,Spanish/Hispanic,3,Emergency,Home w/ Home Health Services,2017,167,Nonmalignant breast conditions,231,OTHER THERAPEUTIC PRCS,385,"Other skin, subcutaneous tissue & breast disorders",09,"Diseases and Disorders of the Skin, Subcutaneous Tissue and Breast",1,Minor,Minor,Medical,Medicaid,Medicaid,,,N,Y,18570.97,11973.60
New York City,Manhattan,7002001,001438,Bellevue Hospital Center,0 to 17,107,M,Black/African American,Not Span/Hispanic,1,Emergency,Home or Self Care,2017,200,Other skin disorders,000,NO PROC,385,"Other skin, subcutaneous tissue & breast disorders",09,"Diseases and Disorders of the Skin, Subcutaneous Tissue and Breast",1,Minor,Minor,Medical,Medicaid,Medicaid,,,N,Y,6682.83,4308.74
New York City,Manhattan,7002001,001438,Bellevue Hospital Center,18 to 29,100,M,Other Race,Not Span/Hispanic,1,Emergency,Home or Self Care,2017,253,Allergic reactions,032,OT NON-OR THER PRC NOSE,385,"Other skin, subcutaneous tissue & breast disorders",09,"Diseases and Disorders of the Skin, Subcutaneous Tissue and Breast",1,Minor,Minor,Medical,Medicaid,,,,N,Y,7547.58,4866.29
New York City,Manhattan,7002001,001438,Bellevue Hospital Center,30 to 49,113,F,Other Race,Spanish/Hispanic,8,Emergency,Home or Self Care,2017,167,Nonmalignant breast conditions,174,OT NON-OR THER PRC SKIN,385,"Other skin, subcutaneous tissue & breast disorders",09,"Diseases and Disorders of the Skin, Subcutaneous Tissue and Breast",1,Minor,Minor,Medical,Medicaid,,,,N,Y,42558.21,27439.32
New York City,Manhattan,7002001,001438,Bellevue Hospital Center,0 to 17,112,F,Other Race,Spanish/Hispanic,1,Emergency,Home or Self Care,2017,217,Other congenital anomalies,175,OT OR THER PRC SKN/BRST,385,"Other skin, subcutaneous tissue & breast disorders",09,"Diseases and Disorders of the Skin, Subcutaneous Tissue and Breast",1,Minor,Minor,Medical,Medicaid,Medicaid,,,N,N,3057.02,1971.01
New York City,Manhattan,7002001,001438,Bellevue Hospital Center,30 to 49,113,M,Other Race,Not Span/Hispanic,1,Elective,Home or Self Care,2017,047,Other and unspecified benign neoplasm,175,OT OR THER PRC SKN/BRST,385,"Other skin, subcutaneous tissue & breast disorders",09,"Diseases and Disorders of the Skin, Subcutaneous Tissue and Breast",1,Minor,Minor,Medical,Department of Corrections,,,,N,N,6538.05,4215.39
New York City,Manhattan,7002001,001438,Bellevue Hospital Center,50 to 69,112,F,Other Race,Spanish/Hispanic,3,Emergency,Home or Self Care,2017,167,Nonmalignant breast conditions,000,NO PROC,385,"Other skin, subcutaneous tissue & breast disorders",09,"Diseases and Disorders of the Skin, Subcutaneous Tissue and Breast",1,Minor,Minor,Medical,Medicaid,Medicaid,,,N,Y,17698.37,11410.99
New York City,Manhattan,7002001,001438,Bellevue Hospital Center,30 to 49,112,F,Other Race,Not Span/Hispanic,2,Emergency,Home w/ Home Health Services,2017,121,Other diseases of veins and lymphatics,175,OT OR THER PRC SKN/BRST,385,"Other skin, subcutaneous tissue & breast disorders",09,"Diseases and Disorders of the Skin, Subcutaneous Tissue and Breast",2,Moderate,Minor,Medical,Medicaid,,,,N,N,13421.87,8653.72
New York City,Manhattan,7002001,001438,Bellevue Hospital Center,50 to 69,100,M,Other Race,Not Span/Hispanic,2,Emergency,Home or Self Care,2017,253,Allergic reactions,000,NO PROC,385,"Other skin, subcutaneous tissue & breast disorders",09,"Diseases and Disorders of the Skin, Subcutaneous Tissue and Breast",2,Moderate,Minor,Medical,Blue Cross/Blue Shield,,,,N,Y,14913.02,9615.14
New York City,Manhattan,7002001,001438,Bellevue Hospital Center,50 to 69,112,M,Black/African American,Not Span/Hispanic,3,Emergency,Home or Self Care,2017,200,Other skin disorders,069,ESOPHAGEAL DILATATION,385,"Other skin, subcutaneous tissue & breast disorders",09,"Diseases and Disorders of the Skin, Subcutaneous Tissue and Breast",3,Major,Minor,Medical,Medicare,Medicare,,,N,Y,22613.31,14579.89
New York City,Manhattan,7002001,001438,Bellevue Hospital Center,18 to 29,100,F,Other Race,Not Span/Hispanic,1,Emergency,Home or Self Care,2017,167,Nonmalignant breast conditions,231,OTHER THERAPEUTIC PRCS,385,"Other skin, subcutaneous tissue & breast disorders",09,"Diseases and Disorders of the Skin, Subcutaneous Tissue and Breast",1,Minor,Minor,Medical,Medicaid,Medicaid,,,N,Y,7115.88,4587.95
New York City,Manhattan,7002001,001438,Bellevue Hospital Center,50 to 69,100,M,Black/African American,Not Span/Hispanic,12,Emergency,Skilled Nursing Home,2017,253,Allergic reactions,173,OT DX PRC SKIN/SUBCUTAN,385,"Other skin, subcutaneous tissue & breast disorders",09,"Diseases and Disorders of the Skin, Subcutaneous Tissue and Breast",2,Moderate,Minor,Medical,Medicaid,,,,N,Y,62788.99,40483.08
New York City,Manhattan,7002001,001438,Bellevue Hospital Center,70 or Older,100,M,Other Race,Not Span/Hispanic,5,Emergency,Home or Self Care,2017,004,Mycoses,174,OT NON-OR THER PRC SKIN,385,"Other skin, subcutaneous tissue & breast disorders",09,"Diseases and Disorders of the Skin, Subcutaneous Tissue and Breast",2,Moderate,Moderate,Medical,Medicaid,,,,N,Y,30304.69,19538.89
New York City,Manhattan,7002001,001438,Bellevue Hospital Center,70 or Older,100,F,Other Race,Spanish/Hispanic,12,Emergency,Home w/ Home Health Services,2017,253,Allergic reactions,177,COMP AXIAL TOMOGR (CT),385,"Other skin, subcutaneous tissue & breast disorders",09,"Diseases and Disorders of the Skin, Subcutaneous Tissue and Breast",3,Major,Moderate,Medical,Medicare,Medicare,,,N,Y,66198.03,42681.05
New York City,Manhattan,7002001,001438,Bellevue Hospital Center,30 to 49,113,F,Other Race,Spanish/Hispanic,1,Emergency,Home or Self Care,2017,058,Other nutritional; endocrine; and metabolic disorders,175,OT OR THER PRC SKN/BRST,385,"Other skin, subcutaneous tissue & breast disorders",09,"Diseases and Disorders of the Skin, Subcutaneous Tissue and Breast",1,Minor,Minor,Medical,Self-Pay,,,,N,N,2520.00,1624.76
New York City,Manhattan,7002001,001438,Bellevue Hospital Center,50 to 69,112,F,Other Race,Not Span/Hispanic,1,Emergency,Home or Self Care,2017,121,Other diseases of veins and lymphatics,222,BLOOD TRANSFUSION,385,"Other skin, subcutaneous tissue & breast disorders",09,"Diseases and Disorders of the Skin, Subcutaneous Tissue and Breast",2,Moderate,Moderate,Medical,Medicaid,,,,N,Y,10151.05,6544.87
New York City,Manhattan,7002001,001438,Bellevue Hospital Center,70 or Older,100,M,White,Not Span/Hispanic,3,Emergency,Skilled Nursing Home,2017,008,Other infections; including parasitic,222,BLOOD TRANSFUSION,385,"Other skin, subcutaneous tissue & breast disorders",09,"Diseases and Disorders of the Skin, Subcutaneous Tissue and Breast",2,Moderate,Moderate,Medical,Medicare,Medicare,Medicaid,,N,Y,19251.80,12412.56
New York City,Manhattan,7002001,001438,Bellevue Hospital Center,0 to 17,104,F,Other Race,Not Span/Hispanic,3,Emergency,Home or Self Care,2017,239,Superficial injury; contusion,231,OTHER THERAPEUTIC PRCS,385,"Other skin, subcutaneous tissue & breast disorders",09,"Diseases and Disorders of the Skin, Subcutaneous Tissue and Breast",1,Minor,Minor,Medical,Medicaid,Medicaid,,,N,N,18970.51,12231.20
New York City,Manhattan,7002001,001438,Bellevue Hospital Center,50 to 69,104,F,Other Race,Spanish/Hispanic,6,Emergency,Home w/ Home Health Services,2017,167,Nonmalignant breast conditions,165,BREAST BIOPSY & DX PRCS,385,"Other skin, subcutaneous tissue & breast disorders",09,"Diseases and Disorders of the Skin, Subcutaneous Tissue and Breast",1,Minor,Minor,Medical,Blue Cross/Blue Shield,,,,N,Y,34658.07,22345.72