Hospital Service Area,Hospital County,Operating Certificate Number,Permanent Facility Id,Facility Name,Age Group,Zip Code - 3 digits,Gender,Race,Ethnicity,Length of Stay,Type of Admission,Patient Disposition,Discharge Year,CCS Diagnosis Code,CCS Diagnosis Description,CCS Procedure Code,CCS Procedure Description,APR DRG Code,APR DRG Description,APR MDC Code,APR MDC Description,APR Severity of Illness Code,APR Severity of Illness Description,APR Risk of Mortality,APR Medical Surgical Description,Payment Typology 1,Payment Typology 2,Payment Typology 3,Birth Weight,Abortion Edit Indicator,Emergency Department Indicator,Total Charges,Total Costs
New York City,Manhattan,7002053,001463,NYU Langone Hospitals,0 to 17,100,M,White,Unknown,1,Emergency,Home or Self Care,2019,PNL013,OTHER SPECIFIED AND UNSPECIFIED PERINATAL CONDITIONS,ADM021,"ADMINISTRATION OF THERAPEUTIC SUBSTANCES, NEC",385,"OTHER SKIN, SUBCUTANEOUS TISSUE & BREAST DISORDERS",09,"DISEASES AND DISORDERS OF THE SKIN, SUBCUTANEOUS TISSUE AND BREAST",2,Moderate,Minor,Medical,Self-Pay,,,03500,,true,23097.71,4976.59
New York City,Manhattan,7002053,001463,NYU Langone Hospitals,0 to 17,100,M,Other Race,Spanish/Hispanic,2,Emergency,Home or Self Care,2019,INF009,"PARASITIC, OTHER SPECIFIED AND UNSPECIFIED INFECTIONS",,,385,"OTHER SKIN, SUBCUTANEOUS TISSUE & BREAST DISORDERS",09,"DISEASES AND DISORDERS OF THE SKIN, SUBCUTANEOUS TISSUE AND BREAST",2,Moderate,Minor,Medical,Medicaid,,,,,true,22452.24,6482.87
New York City,Manhattan,7002053,001463,NYU Langone Hospitals,50 to 69,114,F,White,Not Span/Hispanic,1,Emergency,Home or Self Care,2019,SKN002,OTHER SPECIFIED INFLAMMATORY CONDITION OF SKIN,,,385,"OTHER SKIN, SUBCUTANEOUS TISSUE & BREAST DISORDERS",09,"DISEASES AND DISORDERS OF THE SKIN, SUBCUTANEOUS TISSUE AND BREAST",1,Minor,Minor,Medical,Medicare,Medicaid,,,,true,19446,5146.87
New York City,Manhattan,7002053,001463,NYU Langone Hospitals,18 to 29,100,F,Other Race,Unknown,2,Emergency,Home or Self Care,2019,SKN002,OTHER SPECIFIED INFLAMMATORY CONDITION OF SKIN,OTR004,ISOLATION PROCEDURES,385,"OTHER SKIN, SUBCUTANEOUS TISSUE & BREAST DISORDERS",09,"DISEASES AND DISORDERS OF THE SKIN, SUBCUTANEOUS TISSUE AND BREAST",3,Major,Minor,Medical,Private Health Insurance,,,,,true,30539.73,8560.4
New York City,Manhattan,7002053,001463,NYU Langone Hospitals,50 to 69,114,M,Other Race,Not Span/Hispanic,7,Emergency,Home or Self Care,2019,SKN002,OTHER SPECIFIED INFLAMMATORY CONDITION OF SKIN,SKB001,SKIN BIOPSY AND DIAGNOSTIC DRAINAGE,385,"OTHER SKIN, SUBCUTANEOUS TISSUE & BREAST DISORDERS",09,"DISEASES AND DISORDERS OF THE SKIN, SUBCUTANEOUS TISSUE AND BREAST",3,Major,Moderate,Medical,Private Health Insurance,,,,,true,76102.55,26870.33
New York City,Manhattan,7002053,001463,NYU Langone Hospitals,50 to 69,100,F,White,Not Span/Hispanic,2,Emergency,Home w/ Home Health Services,2019,SKN002,OTHER SPECIFIED INFLAMMATORY CONDITION OF SKIN,,,385,"OTHER SKIN, SUBCUTANEOUS TISSUE & BREAST DISORDERS",09,"DISEASES AND DISORDERS OF THE SKIN, SUBCUTANEOUS TISSUE AND BREAST",4,Extreme,Moderate,Medical,Medicare,Private Health Insurance,,,,true,39961.21,15715.4
New York City,Manhattan,7002053,001463,NYU Langone Hospitals,50 to 69,100,F,Other Race,Not Span/Hispanic,17,Emergency,Home w/ Home Health Services,2019,SKN002,OTHER SPECIFIED INFLAMMATORY CONDITION OF SKIN,SKB001,SKIN BIOPSY AND DIAGNOSTIC DRAINAGE,385,"OTHER SKIN, SUBCUTANEOUS TISSUE & BREAST DISORDERS",09,"DISEASES AND DISORDERS OF THE SKIN, SUBCUTANEOUS TISSUE AND BREAST",2,Moderate,Moderate,Medical,Private Health Insurance,,,,,true,373385.61,68796.44
New York City,Manhattan,7002053,001463,NYU Langone Hospitals,70 or Older,100,M,White,Not Span/Hispanic,9,Emergency,Skilled Nursing Home,2019,INF009,"PARASITIC, OTHER SPECIFIED AND UNSPECIFIED INFECTIONS",OTR004,ISOLATION PROCEDURES,385,"OTHER SKIN, SUBCUTANEOUS TISSUE & BREAST DISORDERS",09,"DISEASES AND DISORDERS OF THE SKIN, SUBCUTANEOUS TISSUE AND BREAST",3,Major,Major,Medical,Medicare,,,,,true,104797.76,35365.38
New York City,Manhattan,7002053,001463,NYU Langone Hospitals,50 to 69,100,M,Black/African American,Not Span/Hispanic,3,Emergency,Home w/ Home Health Services,2019,CIR039,OTHER SPECIFIED DISEASES OF VEINS AND LYMPHATICS,,,385,"OTHER SKIN, SUBCUTANEOUS TISSUE & BREAST DISORDERS",09,"DISEASES AND DISORDERS OF THE SKIN, SUBCUTANEOUS TISSUE AND BREAST",3,Major,Moderate,Medical,Medicare,Medicaid,,,,true,47898.91,15216.55
New York City,Manhattan,7002053,001463,NYU Langone Hospitals,50 to 69,,F,Other Race,Not Span/Hispanic,1,Emergency,Home or Self Care,2019,SKN002,OTHER SPECIFIED INFLAMMATORY CONDITION OF SKIN,,,385,"OTHER SKIN, SUBCUTANEOUS TISSUE & BREAST DISORDERS",09,"DISEASES AND DISORDERS OF THE SKIN, SUBCUTANEOUS TISSUE AND BREAST",1,Minor,Minor,Medical,Private Health Insurance,,,,,true,10895.55,3943.82
New York City,Manhattan,7002053,001463,NYU Langone Hospitals,18 to 29,100,M,Other Race,Not Span/Hispanic,1,Emergency,Skilled Nursing Home,2019,SKN007,OTHER SPECIFIED AND UNSPECIFIED SKIN DISORDERS,,,385,"OTHER SKIN, SUBCUTANEOUS TISSUE & BREAST DISORDERS",09,"DISEASES AND DISORDERS OF THE SKIN, SUBCUTANEOUS TISSUE AND BREAST",1,Minor,Minor,Medical,Private Health Insurance,,,,,true,38059.88,12588.59
New York City,Manhattan,7002053,001463,NYU Langone Hospitals,30 to 49,112,F,White,Unknown,3,Emergency,Home or Self Care,2019,SKN002,OTHER SPECIFIED INFLAMMATORY CONDITION OF SKIN,MST020,SUBCUTANEOUS TISSUE AND FASCIA EXCISION,385,"OTHER SKIN, SUBCUTANEOUS TISSUE & BREAST DISORDERS",09,"DISEASES AND DISORDERS OF THE SKIN, SUBCUTANEOUS TISSUE AND BREAST",1,Minor,Minor,Medical,Blue Cross/Blue Shield,,,,,true,40424.25,12092.81
New York City,Manhattan,7002053,001463,NYU Langone Hospitals,70 or Older,113,M,Other Race,Not Span/Hispanic,1,Emergency,Home or Self Care,2019,SKN002,OTHER SPECIFIED INFLAMMATORY CONDITION OF SKIN,SKB001,SKIN BIOPSY AND DIAGNOSTIC DRAINAGE,385,"OTHER SKIN, SUBCUTANEOUS TISSUE & BREAST DISORDERS",09,"DISEASES AND DISORDERS OF THE SKIN, SUBCUTANEOUS TISSUE AND BREAST",3,Major,Moderate,Medical,Medicare,Medicaid,,,,false,50313.15,16186.57
New York City,Manhattan,7002053,001463,NYU Langone Hospitals,50 to 69,111,F,White,Not Span/Hispanic,1,Emergency,Home or Self Care,2019,SKN002,OTHER SPECIFIED INFLAMMATORY CONDITION OF SKIN,,,385,"OTHER SKIN, SUBCUTANEOUS TISSUE & BREAST DISORDERS",09,"DISEASES AND DISORDERS OF THE SKIN, SUBCUTANEOUS TISSUE AND BREAST",1,Minor,Minor,Medical,Private Health Insurance,,,,,true,21134.29,5211.32
New York City,Manhattan,7002053,001463,NYU Langone Hospitals,50 to 69,113,M,Other Race,Spanish/Hispanic,3,Urgent,Home or Self Care,2019,INF009,"PARASITIC, OTHER SPECIFIED AND UNSPECIFIED INFECTIONS",,,385,"OTHER SKIN, SUBCUTANEOUS TISSUE & BREAST DISORDERS",09,"DISEASES AND DISORDERS OF THE SKIN, SUBCUTANEOUS TISSUE AND BREAST",2,Moderate,Minor,Medical,Medicaid,,,,,false,35245.8,11631.47
New York City,Manhattan,7002053,001463,NYU Langone Hospitals,50 to 69,100,M,Other Race,Not Span/Hispanic,1,Emergency,Home or Self Care,2019,SKN007,OTHER SPECIFIED AND UNSPECIFIED SKIN DISORDERS,SKB001,SKIN BIOPSY AND DIAGNOSTIC DRAINAGE,385,"OTHER SKIN, SUBCUTANEOUS TISSUE & BREAST DISORDERS",09,"DISEASES AND DISORDERS OF THE SKIN, SUBCUTANEOUS TISSUE AND BREAST",1,Minor,Minor,Medical,Private Health Insurance,,,,,true,22514.4,5312.48
New York City,Manhattan,7002053,001463,NYU Langone Hospitals,30 to 49,OOS,M,Black/African American,Not Span/Hispanic,2,Elective,Home or Self Care,2019,NEO027,SKIN CANCERS - SQUAMOUS CELL CARCINOMA,MST020,SUBCUTANEOUS TISSUE AND FASCIA EXCISION,385,"OTHER SKIN, SUBCUTANEOUS TISSUE & BREAST DISORDERS",09,"DISEASES AND DISORDERS OF THE SKIN, SUBCUTANEOUS TISSUE AND BREAST",1,Minor,Minor,Medical,Blue Cross/Blue Shield,,,,,false,156646.74,27049.6
New York City,Manhattan,7002053,001463,NYU Langone Hospitals,70 or Older,100,F,White,Not Span/Hispanic,1,Emergency,Home w/ Home Health Services,2019,SKN005,CONTACT DERMATITIS,,,385,"OTHER SKIN, SUBCUTANEOUS TISSUE & BREAST DISORDERS",09,"DISEASES AND DISORDERS OF THE SKIN, SUBCUTANEOUS TISSUE AND BREAST",2,Moderate,Moderate,Medical,Medicare,Blue Cross/Blue Shield,,,,true,34762.38,12545.43
New York City,Manhattan,7002053,001463,NYU Langone Hospitals,50 to 69,117,M,White,Not Span/Hispanic,4,Emergency,Home w/ Home Health Services,2019,SKN002,OTHER SPECIFIED INFLAMMATORY CONDITION OF SKIN,,,385,"OTHER SKIN, SUBCUTANEOUS TISSUE & BREAST DISORDERS",09,"DISEASES AND DISORDERS OF THE SKIN, SUBCUTANEOUS TISSUE AND BREAST",2,Moderate,Minor,Medical,Medicare,Blue Cross/Blue Shield,,,,true,41836.57,16707.23
New York City,Manhattan,7002053,001463,NYU Langone Hospitals,30 to 49,100,F,Other Race,Spanish/Hispanic,1,Emergency,Home or Self Care,2019,SKN005,CONTACT DERMATITIS,GIS006,PARACENTESIS,385,"OTHER SKIN, SUBCUTANEOUS TISSUE & BREAST DISORDERS",09,"DISEASES AND DISORDERS OF THE SKIN, SUBCUTANEOUS TISSUE AND BREAST",3,Major,Moderate,Medical,Medicare,Medicaid,,,,true,37375.37,8073.77
New York City,Manhattan,7002053,001463,NYU Langone Hospitals,50 to 69,100,M,Other Race,Spanish/Hispanic,1,Emergency,Home or Self Care,2019,NEO073,BENIGN NEOPLASMS,,,385,"OTHER SKIN, SUBCUTANEOUS TISSUE & BREAST DISORDERS",09,"DISEASES AND DISORDERS OF THE SKIN, SUBCUTANEOUS TISSUE AND BREAST",3,Major,Major,Medical,Medicare,Medicaid,,,,true,27270.9,6243.27
New York City,Manhattan,7002053,001463,NYU Langone Hospitals,50 to 69,114,M,Other Race,Unknown,3,Emergency,Home or Self Care,2019,SKN007,OTHER SPECIFIED AND UNSPECIFIED SKIN DISORDERS,,,385,"OTHER SKIN, SUBCUTANEOUS TISSUE & BREAST DISORDERS",09,"DISEASES AND DISORDERS OF THE SKIN, SUBCUTANEOUS TISSUE AND BREAST",3,Major,Major,Medical,Medicaid,,,,,true,45202.58,12156.46
New York City,Manhattan,7002053,001463,NYU Langone Hospitals,70 or Older,100,F,White,Not Span/Hispanic,9,Emergency,Home or Self Care,2019,GEN017,NONMALIGNANT BREAST CONDITIONS,IMG008,ULTRASONOGRAPHY,385,"OTHER SKIN, SUBCUTANEOUS TISSUE & BREAST DISORDERS",09,"DISEASES AND DISORDERS OF THE SKIN, SUBCUTANEOUS TISSUE AND BREAST",3,Major,Major,Medical,Medicare,,,,,true,102872.09,35407.57
New York City,Manhattan,7002053,001463,NYU Langone Hospitals,30 to 49,112,M,White,Not Span/Hispanic,1,Emergency,Home or Self Care,2019,SYM014,SKIN/SUBCUTANEOUS SIGNS AND SYMPTOMS,,,385,"OTHER SKIN, SUBCUTANEOUS TISSUE & BREAST DISORDERS",09,"DISEASES AND DISORDERS OF THE SKIN, SUBCUTANEOUS TISSUE AND BREAST",1,Minor,Minor,Medical,Blue Cross/Blue Shield,,,,,true,14010.62,4417.33
New York City,Manhattan,7002053,001463,NYU Langone Hospitals,50 to 69,114,M,White,Not Span/Hispanic,1,Emergency,Home or Self Care,2019,SKN002,OTHER SPECIFIED INFLAMMATORY CONDITION OF SKIN,,,385,"OTHER SKIN, SUBCUTANEOUS TISSUE & BREAST DISORDERS",09,"DISEASES AND DISORDERS OF THE SKIN, SUBCUTANEOUS TISSUE AND BREAST",3,Major,Moderate,Medical,Private Health Insurance,,,,,true,18723.56,4955.65
New York City,Manhattan,7002053,001463,NYU Langone Hospitals,50 to 69,113,F,White,Not Span/Hispanic,1,Emergency,Home w/ Home Health Services,2019,SKN002,OTHER SPECIFIED INFLAMMATORY CONDITION OF SKIN,,,385,"OTHER SKIN, SUBCUTANEOUS TISSUE & BREAST DISORDERS",09,"DISEASES AND DISORDERS OF THE SKIN, SUBCUTANEOUS TISSUE AND BREAST",2,Moderate,Minor,Medical,Medicaid,,,,,true,27832.42,6010.31
New York City,Manhattan,7002053,001463,NYU Langone Hospitals,50 to 69,100,F,Black/African American,Not Span/Hispanic,2,Emergency,Home or Self Care,2019,INF009,"PARASITIC, OTHER SPECIFIED AND UNSPECIFIED INFECTIONS",,,385,"OTHER SKIN, SUBCUTANEOUS TISSUE & BREAST DISORDERS",09,"DISEASES AND DISORDERS OF THE SKIN, SUBCUTANEOUS TISSUE AND BREAST",3,Major,Moderate,Medical,Medicaid,,,,,true,21384.52,7722.98
New York City,Manhattan,7002053,001463,NYU Langone Hospitals,30 to 49,112,M,White,Not Span/Hispanic,3,Emergency,Home or Self Care,2019,SKN005,CONTACT DERMATITIS,,,385,"OTHER SKIN, SUBCUTANEOUS TISSUE & BREAST DISORDERS",09,"DISEASES AND DISORDERS OF THE SKIN, SUBCUTANEOUS TISSUE AND BREAST",1,Minor,Minor,Medical,Medicaid,,,,,true,40315.03,11999.83
New York City,Manhattan,7002053,001463,NYU Langone Hospitals,50 to 69,104,F,Black/African American,Not Span/Hispanic,1,Emergency,Home or Self Care,2019,SKN002,OTHER SPECIFIED INFLAMMATORY CONDITION OF SKIN,SKB001,SKIN BIOPSY AND DIAGNOSTIC DRAINAGE,385,"OTHER SKIN, SUBCUTANEOUS TISSUE & BREAST DISORDERS",09,"DISEASES AND DISORDERS OF THE SKIN, SUBCUTANEOUS TISSUE AND BREAST",2,Moderate,Minor,Medical,Private Health Insurance,,,,,true,26325.12,9531.18
New York City,Manhattan,7002053,001463,NYU Langone Hospitals,70 or Older,104,F,Other Race,Not Span/Hispanic,1,Emergency,Home or Self Care,2019,SYM014,SKIN/SUBCUTANEOUS SIGNS AND SYMPTOMS,,,385,"OTHER SKIN, SUBCUTANEOUS TISSUE & BREAST DISORDERS",09,"DISEASES AND DISORDERS OF THE SKIN, SUBCUTANEOUS TISSUE AND BREAST",1,Minor,Minor,Medical,Medicaid,,,,,true,34566.43,7558.52
New York City,Manhattan,7002053,001463,NYU Langone Hospitals,70 or Older,103,F,White,Not Span/Hispanic,3,Emergency,Home w/ Home Health Services,2019,SYM014,SKIN/SUBCUTANEOUS SIGNS AND SYMPTOMS,,,385,"OTHER SKIN, SUBCUTANEOUS TISSUE & BREAST DISORDERS",09,"DISEASES AND DISORDERS OF THE SKIN, SUBCUTANEOUS TISSUE AND BREAST",1,Minor,Moderate,Medical,Medicaid,,,,,true,52711.32,12129.08
New York City,Manhattan,7002053,001463,NYU Langone Hospitals,50 to 69,100,M,White,Not Span/Hispanic,1,Emergency,Home w/ Home Health Services,2019,SKN002,OTHER SPECIFIED INFLAMMATORY CONDITION OF SKIN,SKB001,SKIN BIOPSY AND DIAGNOSTIC DRAINAGE,385,"OTHER SKIN, SUBCUTANEOUS TISSUE & BREAST DISORDERS",09,"DISEASES AND DISORDERS OF THE SKIN, SUBCUTANEOUS TISSUE AND BREAST",2,Moderate,Moderate,Medical,Medicare,Medicaid,,,,true,32509.22,12306.29
New York City,Manhattan,7002053,001463,NYU Langone Hospitals,30 to 49,103,M,White,Not Span/Hispanic,1,Emergency,Home or Self Care,2019,CIR039,OTHER SPECIFIED DISEASES OF VEINS AND LYMPHATICS,,,385,"OTHER SKIN, SUBCUTANEOUS TISSUE & BREAST DISORDERS",09,"DISEASES AND DISORDERS OF THE SKIN, SUBCUTANEOUS TISSUE AND BREAST",2,Moderate,Moderate,Medical,Private Health Insurance,,,,,true,23382.62,8568.23
New York City,Manhattan,7002053,001463,NYU Langone Hospitals,18 to 29,100,F,Black/African American,Not Span/Hispanic,2,Emergency,Home or Self Care,2019,GEN017,NONMALIGNANT BREAST CONDITIONS,SKB002,INCISION AND DRAINAGE OF SKIN,385,"OTHER SKIN, SUBCUTANEOUS TISSUE & BREAST DISORDERS",09,"DISEASES AND DISORDERS OF THE SKIN, SUBCUTANEOUS TISSUE AND BREAST",1,Minor,Minor,Medical,Medicaid,,,,,true,36432.42,10045.84
New York City,Manhattan,7002053,001463,NYU Langone Hospitals,30 to 49,100,F,White,Not Span/Hispanic,1,Emergency,Home or Self Care,2019,SKN002,OTHER SPECIFIED INFLAMMATORY CONDITION OF SKIN,ENT001,LARYNGOSCOPY (DIAGNOSTIC),385,"OTHER SKIN, SUBCUTANEOUS TISSUE & BREAST DISORDERS",09,"DISEASES AND DISORDERS OF THE SKIN, SUBCUTANEOUS TISSUE AND BREAST",1,Minor,Minor,Medical,Federal/State/Local/VA,,,,,true,22072.51,8294.79
New York City,Manhattan,7002053,001463,NYU Langone Hospitals,0 to 17,112,F,White,Not Span/Hispanic,1,Emergency,Home or Self Care,2019,GEN017,NONMALIGNANT BREAST CONDITIONS,,,385,"OTHER SKIN, SUBCUTANEOUS TISSUE & BREAST DISORDERS",09,"DISEASES AND DISORDERS OF THE SKIN, SUBCUTANEOUS TISSUE AND BREAST",1,Minor,Minor,Medical,Medicaid,,,,,true,15653.18,4104.48
New York City,Manhattan,7002053,001463,NYU Langone Hospitals,30 to 49,112,F,Black/African American,Not Span/Hispanic,5,Emergency,Home or Self Care,2019,SKN002,OTHER SPECIFIED INFLAMMATORY CONDITION OF SKIN,SKB001,SKIN BIOPSY AND DIAGNOSTIC DRAINAGE,385,"OTHER SKIN, SUBCUTANEOUS TISSUE & BREAST DISORDERS",09,"DISEASES AND DISORDERS OF THE SKIN, SUBCUTANEOUS TISSUE AND BREAST",4,Extreme,Major,Medical,Blue Cross/Blue Shield,,,,,true,66711.98,22540.29
New York City,Manhattan,7002053,001463,NYU Langone Hospitals,30 to 49,100,F,Other Race,Not Span/Hispanic,1,Emergency,Home or Self Care,2019,SKN002,OTHER SPECIFIED INFLAMMATORY CONDITION OF SKIN,SKB001,SKIN BIOPSY AND DIAGNOSTIC DRAINAGE,385,"OTHER SKIN, SUBCUTANEOUS TISSUE & BREAST DISORDERS",09,"DISEASES AND DISORDERS OF THE SKIN, SUBCUTANEOUS TISSUE AND BREAST",1,Minor,Minor,Medical,Private Health Insurance,,,,,true,26285.32,9765.22
New York City,Manhattan,7002053,001463,NYU Langone Hospitals,30 to 49,103,F,White,Not Span/Hispanic,9,Emergency,Home w/ Home Health Services,2019,SKN002,OTHER SPECIFIED INFLAMMATORY CONDITION OF SKIN,SKB001,SKIN BIOPSY AND DIAGNOSTIC DRAINAGE,385,"OTHER SKIN, SUBCUTANEOUS TISSUE & BREAST DISORDERS",09,"DISEASES AND DISORDERS OF THE SKIN, SUBCUTANEOUS TISSUE AND BREAST",4,Extreme,Extreme,Medical,Private Health Insurance,,,,,true,235209.72,60107.85
New York City,Manhattan,7002053,001463,NYU Langone Hospitals,70 or Older,112,F,White,Not Span/Hispanic,6,Emergency,Skilled Nursing Home,2019,SKN002,OTHER SPECIFIED INFLAMMATORY CONDITION OF SKIN,,,385,"OTHER SKIN, SUBCUTANEOUS TISSUE & BREAST DISORDERS",09,"DISEASES AND DISORDERS OF THE SKIN, SUBCUTANEOUS TISSUE AND BREAST",3,Major,Major,Medical,Medicare,,,,,true,73273.91,25382.07
New York City,Manhattan,7002053,001463,NYU Langone Hospitals,50 to 69,112,F,Other Race,Spanish/Hispanic,6,Emergency,Home or Self Care,2019,SYM014,SKIN/SUBCUTANEOUS SIGNS AND SYMPTOMS,,,385,"OTHER SKIN, SUBCUTANEOUS TISSUE & BREAST DISORDERS",09,"DISEASES AND DISORDERS OF THE SKIN, SUBCUTANEOUS TISSUE AND BREAST",1,Minor,Minor,Medical,Medicare,Medicaid,,,,true,87552.04,24276.96
New York City,Manhattan,7002053,001463,NYU Langone Hospitals,0 to 17,112,F,White,Not Span/Hispanic,2,Emergency,Home or Self Care,2019,GEN017,NONMALIGNANT BREAST CONDITIONS,SKB002,INCISION AND DRAINAGE OF SKIN,385,"OTHER SKIN, SUBCUTANEOUS TISSUE & BREAST DISORDERS",09,"DISEASES AND DISORDERS OF THE SKIN, SUBCUTANEOUS TISSUE AND BREAST",2,Moderate,Minor,Medical,Medicaid,,,,,true,37946.13,8934
New York City,Manhattan,7002053,001463,NYU Langone Hospitals,70 or Older,103,F,Other Race,Not Span/Hispanic,1,Emergency,Home or Self Care,2019,GEN017,NONMALIGNANT BREAST CONDITIONS,,,385,"OTHER SKIN, SUBCUTANEOUS TISSUE & BREAST DISORDERS",09,"DISEASES AND DISORDERS OF THE SKIN, SUBCUTANEOUS TISSUE AND BREAST",1,Minor,Moderate,Medical,Medicare,,,,,true,16127.94,4745.16
New York City,Manhattan,7002053,001463,NYU Langone Hospitals,70 or Older,114,M,Black/African American,Not Span/Hispanic,1,Emergency,Short-term Hospital,2019,SKN005,CONTACT DERMATITIS,,,385,"OTHER SKIN, SUBCUTANEOUS TISSUE & BREAST DISORDERS",09,"DISEASES AND DISORDERS OF THE SKIN, SUBCUTANEOUS TISSUE AND BREAST",1,Minor,Minor,Medical,Medicare,,,,,true,23322.95,8682.9
New York City,Manhattan,7002053,001463,NYU Langone Hospitals,70 or Older,100,M,Other Race,Not Span/Hispanic,5,Emergency,Home w/ Home Health Services,2019,SYM014,SKIN/SUBCUTANEOUS SIGNS AND SYMPTOMS,SKB001,SKIN BIOPSY AND DIAGNOSTIC DRAINAGE,385,"OTHER SKIN, SUBCUTANEOUS TISSUE & BREAST DISORDERS",09,"DISEASES AND DISORDERS OF THE SKIN, SUBCUTANEOUS TISSUE AND BREAST",3,Major,Moderate,Medical,Medicare,Medicaid,,,,true,58193.7,18735.05
New York City,Manhattan,7002053,001463,NYU Langone Hospitals,50 to 69,117,F,Other Race,Spanish/Hispanic,1,Emergency,Home or Self Care,2019,GEN017,NONMALIGNANT BREAST CONDITIONS,,,385,"OTHER SKIN, SUBCUTANEOUS TISSUE & BREAST DISORDERS",09,"DISEASES AND DISORDERS OF THE SKIN, SUBCUTANEOUS TISSUE AND BREAST",2,Moderate,Minor,Medical,Medicare,Blue Cross/Blue Shield,,,,true,42031.3,15808.31
New York City,Manhattan,7002053,001463,NYU Langone Hospitals,30 to 49,,F,White,Unknown,4,Emergency,Home or Self Care,2019,INJ017,"SUPERFICIAL INJURY; CONTUSION, INITIAL ENCOUNTER",,,385,"OTHER SKIN, SUBCUTANEOUS TISSUE & BREAST DISORDERS",09,"DISEASES AND DISORDERS OF THE SKIN, SUBCUTANEOUS TISSUE AND BREAST",2,Moderate,Minor,Medical,Private Health Insurance,,,,,false,62707.85,13640.51
New York City,Manhattan,7002053,001463,NYU Langone Hospitals,18 to 29,100,F,Black/African American,Not Span/Hispanic,2,Emergency,Home or Self Care,2019,GEN017,NONMALIGNANT BREAST CONDITIONS,,,385,"OTHER SKIN, SUBCUTANEOUS TISSUE & BREAST DISORDERS",09,"DISEASES AND DISORDERS OF THE SKIN, SUBCUTANEOUS TISSUE AND BREAST",2,Moderate,Minor,Medical,Medicaid,,,,,true,26518.06,7945.52
New York City,Manhattan,7002053,001463,NYU Langone Hospitals,70 or Older,112,M,Black/African American,Not Span/Hispanic,5,Emergency,Home w/ Home Health Services,2019,SKN007,OTHER SPECIFIED AND UNSPECIFIED SKIN DISORDERS,,,385,"OTHER SKIN, SUBCUTANEOUS TISSUE & BREAST DISORDERS",09,"DISEASES AND DISORDERS OF THE SKIN, SUBCUTANEOUS TISSUE AND BREAST",3,Major,Major,Medical,Medicare,,,,,true,72574.73,19910.53
New York City,Manhattan,7002053,001463,NYU Langone Hospitals,18 to 29,112,M,Black/African American,Not Span/Hispanic,3,Emergency,Home or Self Care,2019,SKN002,OTHER SPECIFIED INFLAMMATORY CONDITION OF SKIN,,,385,"OTHER SKIN, SUBCUTANEOUS TISSUE & BREAST DISORDERS",09,"DISEASES AND DISORDERS OF THE SKIN, SUBCUTANEOUS TISSUE AND BREAST",1,Minor,Minor,Medical,Medicaid,,,,,true,37280.04,12229.32
New York City,Manhattan,7002053,001463,NYU Langone Hospitals,70 or Older,100,F,White,Not Span/Hispanic,10,Emergency,Home w/ Home Health Services,2019,SKN002,OTHER SPECIFIED INFLAMMATORY CONDITION OF SKIN,,,385,"OTHER SKIN, SUBCUTANEOUS TISSUE & BREAST DISORDERS",09,"DISEASES AND DISORDERS OF THE SKIN, SUBCUTANEOUS TISSUE AND BREAST",3,Major,Major,Medical,Medicare,,,,,true,103076.84,36567.15
New York City,Manhattan,7002053,001463,NYU Langone Hospitals,18 to 29,112,F,White,Not Span/Hispanic,1,Emergency,Home or Self Care,2019,GEN017,NONMALIGNANT BREAST CONDITIONS,,,385,"OTHER SKIN, SUBCUTANEOUS TISSUE & BREAST DISORDERS",09,"DISEASES AND DISORDERS OF THE SKIN, SUBCUTANEOUS TISSUE AND BREAST",1,Minor,Minor,Medical,Medicaid,,,,,true,23298.83,7283.22
New York City,Manhattan,7002053,001463,NYU Langone Hospitals,30 to 49,,F,Black/African American,Unknown,8,Emergency,Expired,2019,NEO029,BREAST CANCER - DUCTAL CARCINOMA IN SITU (DCIS),RES005,CHEST TUBE PLACEMENT AND THERAPEUTIC THORACENTESIS,385,"OTHER SKIN, SUBCUTANEOUS TISSUE & BREAST DISORDERS",09,"DISEASES AND DISORDERS OF THE SKIN, SUBCUTANEOUS TISSUE AND BREAST",4,Extreme,Major,Medical,Medicaid,,,,,true,106680.32,33429.3
