Hospital Service Area,Hospital County,Operating Certificate Number,Permanent Facility Id,Facility Name,Age Group,Zip Code - 3 digits,Gender,Race,Ethnicity,Length of Stay,Type of Admission,Patient Disposition,Discharge Year,CCS Diagnosis Code,CCS Diagnosis Description,CCS Procedure Code,CCS Procedure Description,APR DRG Code,APR DRG Description,APR MDC Code,APR MDC Description,APR Severity of Illness Code,APR Severity of Illness Description,APR Risk of Mortality,APR Medical Surgical Description,Payment Typology 1,Payment Typology 2,Payment Typology 3,Birth Weight,Abortion Edit Indicator,Emergency Department Indicator,Total Charges,Total Costs
New York City,Manhattan,7002001,001438,Bellevue Hospital Center,30 to 49,104,M,Black/African American,Not Span/Hispanic,36,Emergency,Home or Self Care,2020,SKN002,OTHER SPECIFIED INFLAMMATORY CONDITION OF SKIN,ESA001,HEMODIALYSIS,385,"OTHER SKIN, SUBCUTANEOUS TISSUE & BREAST DISORDERS",09,"DISEASES AND DISORDERS OF THE SKIN, SUBCUTANEOUS TISSUE AND BREAST",3,Major,Moderate,Medical,Medicare,Medicaid,,,,Y,240043.28,138045.05
New York City,Manhattan,7002001,001438,Bellevue Hospital Center,30 to 49,113,F,Other Race,Not Span/Hispanic,3,Emergency,Home or Self Care,2020,CIR039,OTHER SPECIFIED DISEASES OF VEINS AND LYMPHATICS,RES005,CHEST TUBE PLACEMENT AND THERAPEUTIC THORACENTESIS,385,"OTHER SKIN, SUBCUTANEOUS TISSUE & BREAST DISORDERS",09,"DISEASES AND DISORDERS OF THE SKIN, SUBCUTANEOUS TISSUE AND BREAST",2,Moderate,Moderate,Medical,Medicaid,,,,,Y,36678.75,21093.36
New York City,Manhattan,7002001,001438,Bellevue Hospital Center,50 to 69,125,M,White,Not Span/Hispanic,9,Emergency,Home or Self Care,2020,SKN002,OTHER SPECIFIED INFLAMMATORY CONDITION OF SKIN,ADM021,"ADMINISTRATION OF THERAPEUTIC SUBSTANCES, NEC",385,"OTHER SKIN, SUBCUTANEOUS TISSUE & BREAST DISORDERS",09,"DISEASES AND DISORDERS OF THE SKIN, SUBCUTANEOUS TISSUE AND BREAST",1,Minor,Minor,Medical,Medicare,Medicaid,,,,Y,61078.91,35125.5
New York City,Manhattan,7002001,001438,Bellevue Hospital Center,30 to 49,112,M,Other Race,Spanish/Hispanic,1,Emergency,Left Against Medical Advice,2020,INF009,"PARASITIC, OTHER SPECIFIED AND UNSPECIFIED INFECTIONS",,,385,"OTHER SKIN, SUBCUTANEOUS TISSUE & BREAST DISORDERS",09,"DISEASES AND DISORDERS OF THE SKIN, SUBCUTANEOUS TISSUE AND BREAST",1,Minor,Minor,Medical,Medicaid,,,,,Y,7660.13,4405.22
New York City,Manhattan,7002001,001438,Bellevue Hospital Center,50 to 69,100,M,Multi-racial,Not Span/Hispanic,4,Emergency,Home or Self Care,2020,SKN002,OTHER SPECIFIED INFLAMMATORY CONDITION OF SKIN,,,385,"OTHER SKIN, SUBCUTANEOUS TISSUE & BREAST DISORDERS",09,"DISEASES AND DISORDERS OF THE SKIN, SUBCUTANEOUS TISSUE AND BREAST",2,Moderate,Moderate,Medical,Medicaid,,,,,Y,25935.12,14914.87
New York City,Manhattan,7002001,001438,Bellevue Hospital Center,50 to 69,100,M,Black/African American,Not Span/Hispanic,3,Emergency,Left Against Medical Advice,2020,SKN002,OTHER SPECIFIED INFLAMMATORY CONDITION OF SKIN,ADM015,ADMINISTRATION OF ANTIBIOTICS,385,"OTHER SKIN, SUBCUTANEOUS TISSUE & BREAST DISORDERS",09,"DISEASES AND DISORDERS OF THE SKIN, SUBCUTANEOUS TISSUE AND BREAST",2,Moderate,Moderate,Medical,Medicare,,,,,Y,26964.06,15506.6
New York City,Manhattan,7002001,001438,Bellevue Hospital Center,30 to 49,100,M,Other Race,Not Span/Hispanic,4,Emergency,Home or Self Care,2020,INF009,"PARASITIC, OTHER SPECIFIED AND UNSPECIFIED INFECTIONS",ADM010,VACCINATIONS,385,"OTHER SKIN, SUBCUTANEOUS TISSUE & BREAST DISORDERS",09,"DISEASES AND DISORDERS OF THE SKIN, SUBCUTANEOUS TISSUE AND BREAST",3,Major,Minor,Medical,Medicaid,,,,,Y,31022.36,17840.46
New York City,Manhattan,7002001,001438,Bellevue Hospital Center,50 to 69,113,F,Other Race,Unknown,3,Emergency,Home or Self Care,2020,SKN002,OTHER SPECIFIED INFLAMMATORY CONDITION OF SKIN,ADM015,ADMINISTRATION OF ANTIBIOTICS,385,"OTHER SKIN, SUBCUTANEOUS TISSUE & BREAST DISORDERS",09,"DISEASES AND DISORDERS OF THE SKIN, SUBCUTANEOUS TISSUE AND BREAST",2,Moderate,Moderate,Medical,Medicaid,,,,,Y,32181.46,18507.04
New York City,Manhattan,7002001,001438,Bellevue Hospital Center,50 to 69,112,F,Other Race,Spanish/Hispanic,1,Emergency,Home or Self Care,2020,SKN002,OTHER SPECIFIED INFLAMMATORY CONDITION OF SKIN,,,385,"OTHER SKIN, SUBCUTANEOUS TISSUE & BREAST DISORDERS",09,"DISEASES AND DISORDERS OF THE SKIN, SUBCUTANEOUS TISSUE AND BREAST",1,Minor,Minor,Medical,Self-Pay,,,,,Y,9096.24,5231.1
New York City,Manhattan,7002001,001438,Bellevue Hospital Center,30 to 49,114,F,Other Race,Spanish/Hispanic,1,Elective,Home or Self Care,2020,MUS025,OTHER SPECIFIED CONNECTIVE TISSUE DISEASE,MST020,SUBCUTANEOUS TISSUE AND FASCIA EXCISION,385,"OTHER SKIN, SUBCUTANEOUS TISSUE & BREAST DISORDERS",09,"DISEASES AND DISORDERS OF THE SKIN, SUBCUTANEOUS TISSUE AND BREAST",2,Moderate,Minor,Medical,Private Health Insurance,,,,,N,31676.8,18216.82
New York City,Manhattan,7002001,001438,Bellevue Hospital Center,50 to 69,112,F,Multi-racial,Not Span/Hispanic,1,Emergency,Home or Self Care,2020,GEN017,NONMALIGNANT BREAST CONDITIONS,ADM015,ADMINISTRATION OF ANTIBIOTICS,385,"OTHER SKIN, SUBCUTANEOUS TISSUE & BREAST DISORDERS",09,"DISEASES AND DISORDERS OF THE SKIN, SUBCUTANEOUS TISSUE AND BREAST",2,Moderate,Minor,Medical,Medicaid,,,,,Y,8362.12,4808.92
New York City,Manhattan,7002001,001438,Bellevue Hospital Center,30 to 49,112,F,Other Race,Spanish/Hispanic,1,Urgent,Home or Self Care,2020,MUS025,OTHER SPECIFIED CONNECTIVE TISSUE DISEASE,,,385,"OTHER SKIN, SUBCUTANEOUS TISSUE & BREAST DISORDERS",09,"DISEASES AND DISORDERS OF THE SKIN, SUBCUTANEOUS TISSUE AND BREAST",2,Moderate,Minor,Medical,Medicaid,,,,,N,26727.53,15370.57
New York City,Manhattan,7002001,001438,Bellevue Hospital Center,30 to 49,113,M,Other Race,Spanish/Hispanic,2,Elective,Home or Self Care,2020,INF010,SEXUALLY TRANSMITTED INFECTIONS (EXCLUDING HIV AND HEPATITIS),MRS001,CIRCUMCISION,385,"OTHER SKIN, SUBCUTANEOUS TISSUE & BREAST DISORDERS",09,"DISEASES AND DISORDERS OF THE SKIN, SUBCUTANEOUS TISSUE AND BREAST",2,Moderate,Minor,Medical,Medicaid,,,,,N,36244.41,20843.58
New York City,Manhattan,7002001,001438,Bellevue Hospital Center,70 or Older,112,F,Black/African American,Not Span/Hispanic,24,Elective,Inpatient Rehabilitation Facility,2020,SKN007,OTHER SPECIFIED AND UNSPECIFIED SKIN DISORDERS,,,385,"OTHER SKIN, SUBCUTANEOUS TISSUE & BREAST DISORDERS",09,"DISEASES AND DISORDERS OF THE SKIN, SUBCUTANEOUS TISSUE AND BREAST",3,Major,Major,Medical,Medicaid,,,,,N,150101.69,86321.08
New York City,Manhattan,7002001,001438,Bellevue Hospital Center,0 to 17,116,M,Other Race,Not Span/Hispanic,1,Urgent,Home or Self Care,2020,SKN002,OTHER SPECIFIED INFLAMMATORY CONDITION OF SKIN,ADM021,"ADMINISTRATION OF THERAPEUTIC SUBSTANCES, NEC",385,"OTHER SKIN, SUBCUTANEOUS TISSUE & BREAST DISORDERS",09,"DISEASES AND DISORDERS OF THE SKIN, SUBCUTANEOUS TISSUE AND BREAST",1,Minor,Minor,Medical,Medicaid,,,,,N,7748.37,4455.96
New York City,Manhattan,7002001,001438,Bellevue Hospital Center,18 to 29,113,F,Other Race,Spanish/Hispanic,2,Emergency,Home or Self Care,2020,GEN017,NONMALIGNANT BREAST CONDITIONS,ADM015,ADMINISTRATION OF ANTIBIOTICS,385,"OTHER SKIN, SUBCUTANEOUS TISSUE & BREAST DISORDERS",09,"DISEASES AND DISORDERS OF THE SKIN, SUBCUTANEOUS TISSUE AND BREAST",1,Minor,Minor,Medical,Medicaid,,,,,Y,16261.75,9351.87
New York City,Manhattan,7002001,001438,Bellevue Hospital Center,50 to 69,100,M,Black/African American,Not Span/Hispanic,6,Emergency,Home or Self Care,2020,INF009,"PARASITIC, OTHER SPECIFIED AND UNSPECIFIED INFECTIONS",IMG009,PLAIN RADIOGRAPHY,385,"OTHER SKIN, SUBCUTANEOUS TISSUE & BREAST DISORDERS",09,"DISEASES AND DISORDERS OF THE SKIN, SUBCUTANEOUS TISSUE AND BREAST",2,Moderate,Moderate,Medical,Medicaid,,,,,Y,40843.79,23488.61
New York City,Manhattan,7002001,001438,Bellevue Hospital Center,30 to 49,100,F,Other Race,Unknown,1,Elective,Home or Self Care,2020,MUS025,OTHER SPECIFIED CONNECTIVE TISSUE DISEASE,MST020,SUBCUTANEOUS TISSUE AND FASCIA EXCISION,385,"OTHER SKIN, SUBCUTANEOUS TISSUE & BREAST DISORDERS",09,"DISEASES AND DISORDERS OF THE SKIN, SUBCUTANEOUS TISSUE AND BREAST",1,Minor,Minor,Medical,Self-Pay,,,,,N,23701,13630.07
New York City,Manhattan,7002001,001438,Bellevue Hospital Center,50 to 69,100,F,Other Race,Spanish/Hispanic,1,Elective,Home or Self Care,2020,MUS025,OTHER SPECIFIED CONNECTIVE TISSUE DISEASE,MST020,SUBCUTANEOUS TISSUE AND FASCIA EXCISION,385,"OTHER SKIN, SUBCUTANEOUS TISSUE & BREAST DISORDERS",09,"DISEASES AND DISORDERS OF THE SKIN, SUBCUTANEOUS TISSUE AND BREAST",2,Moderate,Minor,Medical,Medicaid,,,,,N,29143.95,16760.22
New York City,Manhattan,7002001,001438,Bellevue Hospital Center,0 to 17,112,M,Other Race,Spanish/Hispanic,2,Urgent,Home or Self Care,2020,SKN002,OTHER SPECIFIED INFLAMMATORY CONDITION OF SKIN,,,385,"OTHER SKIN, SUBCUTANEOUS TISSUE & BREAST DISORDERS",09,"DISEASES AND DISORDERS OF THE SKIN, SUBCUTANEOUS TISSUE AND BREAST",2,Moderate,Minor,Medical,Medicaid,,,,,N,11781.2,6775.18
New York City,Manhattan,7002001,001438,Bellevue Hospital Center,50 to 69,111,M,Black/African American,Not Span/Hispanic,1,Elective,Home or Self Care,2020,NEO073,BENIGN NEOPLASMS,MST020,SUBCUTANEOUS TISSUE AND FASCIA EXCISION,385,"OTHER SKIN, SUBCUTANEOUS TISSUE & BREAST DISORDERS",09,"DISEASES AND DISORDERS OF THE SKIN, SUBCUTANEOUS TISSUE AND BREAST",1,Minor,Minor,Medical,Medicare,,,,,N,20606.53,11850.49
New York City,Manhattan,7002001,001438,Bellevue Hospital Center,50 to 69,113,M,Black/African American,Not Span/Hispanic,4,Emergency,Home or Self Care,2020,SKN005,CONTACT DERMATITIS,SKB001,SKIN BIOPSY AND DIAGNOSTIC DRAINAGE,385,"OTHER SKIN, SUBCUTANEOUS TISSUE & BREAST DISORDERS",09,"DISEASES AND DISORDERS OF THE SKIN, SUBCUTANEOUS TISSUE AND BREAST",3,Major,Major,Medical,Medicare,,,,,Y,30423.1,17495.84
New York City,Manhattan,7002001,001438,Bellevue Hospital Center,30 to 49,104,F,Multi-racial,Not Span/Hispanic,7,Elective,Home or Self Care,2020,SKN002,OTHER SPECIFIED INFLAMMATORY CONDITION OF SKIN,SKB002,INCISION AND DRAINAGE OF SKIN,385,"OTHER SKIN, SUBCUTANEOUS TISSUE & BREAST DISORDERS",09,"DISEASES AND DISORDERS OF THE SKIN, SUBCUTANEOUS TISSUE AND BREAST",1,Minor,Minor,Medical,Medicare,,,,,N,54243.95,31194.83
New York City,Manhattan,7002001,001438,Bellevue Hospital Center,50 to 69,100,M,Black/African American,Not Span/Hispanic,1,Emergency,Left Against Medical Advice,2020,SKN002,OTHER SPECIFIED INFLAMMATORY CONDITION OF SKIN,ADM015,ADMINISTRATION OF ANTIBIOTICS,385,"OTHER SKIN, SUBCUTANEOUS TISSUE & BREAST DISORDERS",09,"DISEASES AND DISORDERS OF THE SKIN, SUBCUTANEOUS TISSUE AND BREAST",2,Moderate,Minor,Medical,Medicare,Medicaid,,,,Y,11549.99,6642.21
New York City,Manhattan,7002001,001438,Bellevue Hospital Center,50 to 69,112,M,Black/African American,Not Span/Hispanic,5,Emergency,Court/Law Enforcement,2020,SKN002,OTHER SPECIFIED INFLAMMATORY CONDITION OF SKIN,IMG008,ULTRASONOGRAPHY,385,"OTHER SKIN, SUBCUTANEOUS TISSUE & BREAST DISORDERS",09,"DISEASES AND DISORDERS OF THE SKIN, SUBCUTANEOUS TISSUE AND BREAST",3,Major,Minor,Medical,Medicaid,,,,,Y,36395.59,20930.52
New York City,Manhattan,7002001,001438,Bellevue Hospital Center,18 to 29,,M,Other Race,Spanish/Hispanic,1,Emergency,Court/Law Enforcement,2020,SKN002,OTHER SPECIFIED INFLAMMATORY CONDITION OF SKIN,ADM015,ADMINISTRATION OF ANTIBIOTICS,385,"OTHER SKIN, SUBCUTANEOUS TISSUE & BREAST DISORDERS",09,"DISEASES AND DISORDERS OF THE SKIN, SUBCUTANEOUS TISSUE AND BREAST",2,Moderate,Minor,Medical,Medicaid,,,,,Y,10365.7,5961.15
New York City,Manhattan,7002001,001438,Bellevue Hospital Center,70 or Older,100,M,Other Race,Not Span/Hispanic,3,Emergency,Home or Self Care,2020,SKN002,OTHER SPECIFIED INFLAMMATORY CONDITION OF SKIN,ADM021,"ADMINISTRATION OF THERAPEUTIC SUBSTANCES, NEC",385,"OTHER SKIN, SUBCUTANEOUS TISSUE & BREAST DISORDERS",09,"DISEASES AND DISORDERS OF THE SKIN, SUBCUTANEOUS TISSUE AND BREAST",2,Moderate,Moderate,Medical,Medicare,,,,,Y,25402.46,14608.55
New York City,Manhattan,7002001,001438,Bellevue Hospital Center,50 to 69,113,M,Black/African American,Not Span/Hispanic,2,Elective,Home or Self Care,2020,SKN007,OTHER SPECIFIED AND UNSPECIFIED SKIN DISORDERS,SKB008,SKIN EXCISION AND DEBRIDEMENT,385,"OTHER SKIN, SUBCUTANEOUS TISSUE & BREAST DISORDERS",09,"DISEASES AND DISORDERS OF THE SKIN, SUBCUTANEOUS TISSUE AND BREAST",1,Minor,Minor,Medical,Medicaid,,,,,N,25098.05,14433.49
New York City,Manhattan,7002001,001438,Bellevue Hospital Center,30 to 49,104,M,Other Race,Unknown,2,Emergency,Court/Law Enforcement,2020,SYM014,SKIN/SUBCUTANEOUS SIGNS AND SYMPTOMS,IMG008,ULTRASONOGRAPHY,385,"OTHER SKIN, SUBCUTANEOUS TISSUE & BREAST DISORDERS",09,"DISEASES AND DISORDERS OF THE SKIN, SUBCUTANEOUS TISSUE AND BREAST",1,Minor,Minor,Medical,Medicaid,,,,,Y,16766.76,9642.3
New York City,Manhattan,7002001,001438,Bellevue Hospital Center,50 to 69,100,M,Other Race,Not Span/Hispanic,7,Emergency,Home or Self Care,2020,INF009,"PARASITIC, OTHER SPECIFIED AND UNSPECIFIED INFECTIONS",ADM021,"ADMINISTRATION OF THERAPEUTIC SUBSTANCES, NEC",385,"OTHER SKIN, SUBCUTANEOUS TISSUE & BREAST DISORDERS",09,"DISEASES AND DISORDERS OF THE SKIN, SUBCUTANEOUS TISSUE AND BREAST",1,Minor,Minor,Medical,Medicaid,,,,,Y,59052.24,33960
New York City,Manhattan,7002001,001438,Bellevue Hospital Center,50 to 69,100,M,White,Not Span/Hispanic,1,Emergency,Home or Self Care,2020,INJ017,"SUPERFICIAL INJURY; CONTUSION, INITIAL ENCOUNTER",ADM015,ADMINISTRATION OF ANTIBIOTICS,385,"OTHER SKIN, SUBCUTANEOUS TISSUE & BREAST DISORDERS",09,"DISEASES AND DISORDERS OF THE SKIN, SUBCUTANEOUS TISSUE AND BREAST",1,Minor,Minor,Medical,Medicare,,,,,Y,10392.23,5976.41
New York City,Manhattan,7002001,001438,Bellevue Hospital Center,30 to 49,100,M,Black/African American,Not Span/Hispanic,1,Emergency,Home or Self Care,2020,SKN005,CONTACT DERMATITIS,,,385,"OTHER SKIN, SUBCUTANEOUS TISSUE & BREAST DISORDERS",09,"DISEASES AND DISORDERS OF THE SKIN, SUBCUTANEOUS TISSUE AND BREAST",1,Minor,Minor,Medical,Private Health Insurance,,,,,Y,9482.03,5452.96
New York City,Manhattan,7002001,001438,Bellevue Hospital Center,50 to 69,112,M,Black/African American,Not Span/Hispanic,1,Elective,Home or Self Care,2020,END016,OTHER SPECIFIED AND UNSPECIFIED NUTRITIONAL AND METABOLIC DISORDERS,MST020,SUBCUTANEOUS TISSUE AND FASCIA EXCISION,385,"OTHER SKIN, SUBCUTANEOUS TISSUE & BREAST DISORDERS",09,"DISEASES AND DISORDERS OF THE SKIN, SUBCUTANEOUS TISSUE AND BREAST",2,Moderate,Minor,Medical,Private Health Insurance,,,,,N,30643.85,17622.79
New York City,Manhattan,7002001,001438,Bellevue Hospital Center,30 to 49,112,F,Other Race,Spanish/Hispanic,1,Elective,Home or Self Care,2020,END016,OTHER SPECIFIED AND UNSPECIFIED NUTRITIONAL AND METABOLIC DISORDERS,MST020,SUBCUTANEOUS TISSUE AND FASCIA EXCISION,385,"OTHER SKIN, SUBCUTANEOUS TISSUE & BREAST DISORDERS",09,"DISEASES AND DISORDERS OF THE SKIN, SUBCUTANEOUS TISSUE AND BREAST",2,Moderate,Minor,Medical,Medicaid,,,,,N,27914.66,16053.27
New York City,Manhattan,7002001,001438,Bellevue Hospital Center,70 or Older,100,M,Black/African American,Not Span/Hispanic,6,Emergency,Home or Self Care,2020,INF009,"PARASITIC, OTHER SPECIFIED AND UNSPECIFIED INFECTIONS",ADM021,"ADMINISTRATION OF THERAPEUTIC SUBSTANCES, NEC",385,"OTHER SKIN, SUBCUTANEOUS TISSUE & BREAST DISORDERS",09,"DISEASES AND DISORDERS OF THE SKIN, SUBCUTANEOUS TISSUE AND BREAST",3,Major,Minor,Medical,Self-Pay,,,,,Y,48649.5,27977.55
New York City,Manhattan,7002001,001438,Bellevue Hospital Center,50 to 69,100,M,White,Not Span/Hispanic,12,Elective,Home or Self Care,2020,INF009,"PARASITIC, OTHER SPECIFIED AND UNSPECIFIED INFECTIONS",ADM015,ADMINISTRATION OF ANTIBIOTICS,385,"OTHER SKIN, SUBCUTANEOUS TISSUE & BREAST DISORDERS",09,"DISEASES AND DISORDERS OF THE SKIN, SUBCUTANEOUS TISSUE AND BREAST",3,Major,Major,Medical,Medicaid,,,,,Y,99597.3,57276.81
New York City,Manhattan,7002001,001438,Bellevue Hospital Center,30 to 49,100,M,Other Race,Unknown,2,Urgent,Court/Law Enforcement,2020,NEO073,BENIGN NEOPLASMS,MST020,SUBCUTANEOUS TISSUE AND FASCIA EXCISION,385,"OTHER SKIN, SUBCUTANEOUS TISSUE & BREAST DISORDERS",09,"DISEASES AND DISORDERS OF THE SKIN, SUBCUTANEOUS TISSUE AND BREAST",1,Minor,Minor,Medical,Medicaid,,,,,N,16819.04,9672.36
New York City,Manhattan,7002001,001438,Bellevue Hospital Center,70 or Older,112,M,Black/African American,Not Span/Hispanic,1,Elective,Home or Self Care,2020,NEO073,BENIGN NEOPLASMS,MST003,"SUBCUTANEOUS TISSUE, FASCIA, AND MUSCLE BIOPSY",385,"OTHER SKIN, SUBCUTANEOUS TISSUE & BREAST DISORDERS",09,"DISEASES AND DISORDERS OF THE SKIN, SUBCUTANEOUS TISSUE AND BREAST",1,Minor,Minor,Medical,Self-Pay,,,,,N,20600.39,11846.95
New York City,Manhattan,7002001,001438,Bellevue Hospital Center,50 to 69,118,F,Other Race,Not Span/Hispanic,6,Emergency,Home or Self Care,2020,SKN002,OTHER SPECIFIED INFLAMMATORY CONDITION OF SKIN,HEP001,LIVER BIOPSY,385,"OTHER SKIN, SUBCUTANEOUS TISSUE & BREAST DISORDERS",09,"DISEASES AND DISORDERS OF THE SKIN, SUBCUTANEOUS TISSUE AND BREAST",2,Moderate,Minor,Medical,Medicaid,,,,,Y,49589.98,28518.4
New York City,Manhattan,7002001,001438,Bellevue Hospital Center,18 to 29,113,M,Black/African American,Not Span/Hispanic,1,Emergency,Home or Self Care,2020,SKN002,OTHER SPECIFIED INFLAMMATORY CONDITION OF SKIN,ADM015,ADMINISTRATION OF ANTIBIOTICS,385,"OTHER SKIN, SUBCUTANEOUS TISSUE & BREAST DISORDERS",09,"DISEASES AND DISORDERS OF THE SKIN, SUBCUTANEOUS TISSUE AND BREAST",1,Minor,Minor,Medical,Medicaid,,,,,Y,9407.07,5409.86
New York City,Manhattan,7002001,001438,Bellevue Hospital Center,50 to 69,112,F,Other Race,Spanish/Hispanic,1,Elective,Home or Self Care,2020,END016,OTHER SPECIFIED AND UNSPECIFIED NUTRITIONAL AND METABOLIC DISORDERS,MST020,SUBCUTANEOUS TISSUE AND FASCIA EXCISION,385,"OTHER SKIN, SUBCUTANEOUS TISSUE & BREAST DISORDERS",09,"DISEASES AND DISORDERS OF THE SKIN, SUBCUTANEOUS TISSUE AND BREAST",1,Minor,Minor,Medical,Medicare,Medicaid,,,,N,24797.85,14260.85
New York City,Manhattan,7002001,001438,Bellevue Hospital Center,0 to 17,112,M,Other Race,Spanish/Hispanic,7,Emergency,Home or Self Care,2020,SKN007,OTHER SPECIFIED AND UNSPECIFIED SKIN DISORDERS,CNS002,LUMBAR PUNCTURE,385,"OTHER SKIN, SUBCUTANEOUS TISSUE & BREAST DISORDERS",09,"DISEASES AND DISORDERS OF THE SKIN, SUBCUTANEOUS TISSUE AND BREAST",3,Major,Moderate,Medical,Medicaid,,,,,N,68487.4,39386.01
