Hospital Service Area,Hospital County,Operating Certificate Number,Permanent Facility Id,Facility Name,Age Group,Zip Code - 3 digits,Gender,Race,Ethnicity,Length of Stay,Type of Admission,Patient Disposition,Discharge Year,CCS Diagnosis Code,CCS Diagnosis Description,CCS Procedure Code,CCS Procedure Description,APR DRG Code,APR DRG Description,APR MDC Code,APR MDC Description,APR Severity of Illness Code,APR Severity of Illness Description,APR Risk of Mortality,APR Medical Surgical Description,Payment Typology 1,Payment Typology 2,Payment Typology 3,Birth Weight,Abortion Edit Indicator,Emergency Department Indicator,Total Charges,Total Costs
Long Island,Nassau,2908000,000511,NYU Langone Hospital-Long Island,50 to 69,115,F,White,Not Span/Hispanic,4,Emergency,Home or Self Care,2020,SKN002,OTHER SPECIFIED INFLAMMATORY CONDITION OF SKIN,SKB001,SKIN BIOPSY AND DIAGNOSTIC DRAINAGE,385,"OTHER SKIN, SUBCUTANEOUS TISSUE & BREAST DISORDERS",09,"DISEASES AND DISORDERS OF THE SKIN, SUBCUTANEOUS TISSUE AND BREAST",2,Moderate,Moderate,Medical,Private Health Insurance,,,,,Y,73625.9,17219.57
Long Island,Nassau,2908000,000511,NYU Langone Hospital-Long Island,50 to 69,115,F,White,Not Span/Hispanic,7,Emergency,Home or Self Care,2020,SKN002,OTHER SPECIFIED INFLAMMATORY CONDITION OF SKIN,,,385,"OTHER SKIN, SUBCUTANEOUS TISSUE & BREAST DISORDERS",09,"DISEASES AND DISORDERS OF THE SKIN, SUBCUTANEOUS TISSUE AND BREAST",2,Moderate,Major,Medical,Blue Cross/Blue Shield,,,,,Y,105527.25,27373.07
Long Island,Nassau,2908000,000511,NYU Langone Hospital-Long Island,70 or Older,110,F,White,Not Span/Hispanic,1,Emergency,Skilled Nursing Home,2020,SKN002,OTHER SPECIFIED INFLAMMATORY CONDITION OF SKIN,,,385,"OTHER SKIN, SUBCUTANEOUS TISSUE & BREAST DISORDERS",09,"DISEASES AND DISORDERS OF THE SKIN, SUBCUTANEOUS TISSUE AND BREAST",2,Moderate,Minor,Medical,Medicare,Medicaid,,,,Y,31333.02,9946.69
Long Island,Nassau,2908000,000511,NYU Langone Hospital-Long Island,50 to 69,115,F,Black/African American,Not Span/Hispanic,2,Emergency,Home or Self Care,2020,SKN002,OTHER SPECIFIED INFLAMMATORY CONDITION OF SKIN,,,385,"OTHER SKIN, SUBCUTANEOUS TISSUE & BREAST DISORDERS",09,"DISEASES AND DISORDERS OF THE SKIN, SUBCUTANEOUS TISSUE AND BREAST",2,Moderate,Minor,Medical,Private Health Insurance,,,,,Y,42342.87,8945.2
Long Island,Nassau,2908000,000511,NYU Langone Hospital-Long Island,70 or Older,115,M,White,Not Span/Hispanic,9,Emergency,Home or Self Care,2020,CIR039,OTHER SPECIFIED DISEASES OF VEINS AND LYMPHATICS,,,385,"OTHER SKIN, SUBCUTANEOUS TISSUE & BREAST DISORDERS",09,"DISEASES AND DISORDERS OF THE SKIN, SUBCUTANEOUS TISSUE AND BREAST",3,Major,Moderate,Medical,Medicare,,,,,Y,85192.36,30871.25
Long Island,Nassau,2908000,000511,NYU Langone Hospital-Long Island,30 to 49,115,M,Other Race,Spanish/Hispanic,3,Emergency,Home or Self Care,2020,MUS025,OTHER SPECIFIED CONNECTIVE TISSUE DISEASE,,,385,"OTHER SKIN, SUBCUTANEOUS TISSUE & BREAST DISORDERS",09,"DISEASES AND DISORDERS OF THE SKIN, SUBCUTANEOUS TISSUE AND BREAST",3,Major,Minor,Medical,Medicare,,,,,Y,66531.63,13494.31
Long Island,Nassau,2908000,000511,NYU Langone Hospital-Long Island,50 to 69,115,F,White,Not Span/Hispanic,2,Emergency,Home w/ Home Health Services,2020,SKN002,OTHER SPECIFIED INFLAMMATORY CONDITION OF SKIN,,,385,"OTHER SKIN, SUBCUTANEOUS TISSUE & BREAST DISORDERS",09,"DISEASES AND DISORDERS OF THE SKIN, SUBCUTANEOUS TISSUE AND BREAST",2,Moderate,Moderate,Medical,Private Health Insurance,,,,,Y,34166.03,10592.18
Long Island,Nassau,2908000,000511,NYU Langone Hospital-Long Island,70 or Older,114,F,White,Not Span/Hispanic,2,Emergency,Home w/ Home Health Services,2020,SKN002,OTHER SPECIFIED INFLAMMATORY CONDITION OF SKIN,,,385,"OTHER SKIN, SUBCUTANEOUS TISSUE & BREAST DISORDERS",09,"DISEASES AND DISORDERS OF THE SKIN, SUBCUTANEOUS TISSUE AND BREAST",2,Moderate,Moderate,Medical,Medicare,Medicare,,,,Y,41061.75,11610.9
Long Island,Nassau,2908000,000511,NYU Langone Hospital-Long Island,30 to 49,115,M,Black/African American,Unknown,5,Emergency,Home or Self Care,2020,SKN002,OTHER SPECIFIED INFLAMMATORY CONDITION OF SKIN,,,385,"OTHER SKIN, SUBCUTANEOUS TISSUE & BREAST DISORDERS",09,"DISEASES AND DISORDERS OF THE SKIN, SUBCUTANEOUS TISSUE AND BREAST",2,Moderate,Minor,Medical,Medicaid,,,,,Y,81717.92,24903.42
Long Island,Nassau,2908000,000511,NYU Langone Hospital-Long Island,70 or Older,110,M,White,Not Span/Hispanic,1,Emergency,Home or Self Care,2020,NEO028,SKIN CANCERS - ALL OTHER TYPES,MST020,SUBCUTANEOUS TISSUE AND FASCIA EXCISION,385,"OTHER SKIN, SUBCUTANEOUS TISSUE & BREAST DISORDERS",09,"DISEASES AND DISORDERS OF THE SKIN, SUBCUTANEOUS TISSUE AND BREAST",2,Moderate,Minor,Medical,Medicare,Medicare,,,,Y,41430.53,8674.99
Long Island,Nassau,2908000,000511,NYU Langone Hospital-Long Island,50 to 69,115,M,White,Not Span/Hispanic,1,Emergency,Home or Self Care,2020,SKN002,OTHER SPECIFIED INFLAMMATORY CONDITION OF SKIN,,,385,"OTHER SKIN, SUBCUTANEOUS TISSUE & BREAST DISORDERS",09,"DISEASES AND DISORDERS OF THE SKIN, SUBCUTANEOUS TISSUE AND BREAST",2,Moderate,Moderate,Medical,Blue Cross/Blue Shield,,,,,Y,28415.19,6390.72
Long Island,Nassau,2908000,000511,NYU Langone Hospital-Long Island,50 to 69,114,F,Black/African American,Not Span/Hispanic,1,Emergency,Home or Self Care,2020,SKN002,OTHER SPECIFIED INFLAMMATORY CONDITION OF SKIN,,,385,"OTHER SKIN, SUBCUTANEOUS TISSUE & BREAST DISORDERS",09,"DISEASES AND DISORDERS OF THE SKIN, SUBCUTANEOUS TISSUE AND BREAST",1,Minor,Moderate,Medical,Blue Cross/Blue Shield,,,,,Y,19145.31,5708.32
Long Island,Nassau,2908000,000511,NYU Langone Hospital-Long Island,18 to 29,115,M,White,Not Span/Hispanic,5,Emergency,Home or Self Care,2020,SKN005,CONTACT DERMATITIS,SKB001,SKIN BIOPSY AND DIAGNOSTIC DRAINAGE,385,"OTHER SKIN, SUBCUTANEOUS TISSUE & BREAST DISORDERS",09,"DISEASES AND DISORDERS OF THE SKIN, SUBCUTANEOUS TISSUE AND BREAST",1,Minor,Minor,Medical,Private Health Insurance,,,,,Y,48367.46,14861.66
Long Island,Nassau,2908000,000511,NYU Langone Hospital-Long Island,50 to 69,115,M,Black/African American,Not Span/Hispanic,8,Emergency,Skilled Nursing Home,2020,SKN002,OTHER SPECIFIED INFLAMMATORY CONDITION OF SKIN,MST020,SUBCUTANEOUS TISSUE AND FASCIA EXCISION,385,"OTHER SKIN, SUBCUTANEOUS TISSUE & BREAST DISORDERS",09,"DISEASES AND DISORDERS OF THE SKIN, SUBCUTANEOUS TISSUE AND BREAST",2,Moderate,Minor,Medical,Medicare,,,,,Y,144103.27,42651.89
Long Island,Nassau,2908000,000511,NYU Langone Hospital-Long Island,70 or Older,115,F,White,Not Span/Hispanic,2,Emergency,Home or Self Care,2020,SKN002,OTHER SPECIFIED INFLAMMATORY CONDITION OF SKIN,MAM004,CARDIAC STRESS TESTS,385,"OTHER SKIN, SUBCUTANEOUS TISSUE & BREAST DISORDERS",09,"DISEASES AND DISORDERS OF THE SKIN, SUBCUTANEOUS TISSUE AND BREAST",2,Moderate,Moderate,Medical,Medicare,Medicare,,,,Y,53745.68,13465.96
Long Island,Nassau,2908000,000511,NYU Langone Hospital-Long Island,18 to 29,115,F,Black/African American,Not Span/Hispanic,2,Emergency,Home or Self Care,2020,GEN017,NONMALIGNANT BREAST CONDITIONS,,,385,"OTHER SKIN, SUBCUTANEOUS TISSUE & BREAST DISORDERS",09,"DISEASES AND DISORDERS OF THE SKIN, SUBCUTANEOUS TISSUE AND BREAST",1,Minor,Minor,Medical,Self-Pay,,,,,Y,18653.24,5721.2
Long Island,Nassau,2908000,000511,NYU Langone Hospital-Long Island,50 to 69,115,F,White,Not Span/Hispanic,8,Emergency,Home w/ Home Health Services,2020,SKN002,OTHER SPECIFIED INFLAMMATORY CONDITION OF SKIN,OTR004,ISOLATION PROCEDURES,385,"OTHER SKIN, SUBCUTANEOUS TISSUE & BREAST DISORDERS",09,"DISEASES AND DISORDERS OF THE SKIN, SUBCUTANEOUS TISSUE AND BREAST",1,Minor,Minor,Medical,Medicare,Medicare,,,,Y,106884.54,37604.81
Long Island,Nassau,2908000,000511,NYU Langone Hospital-Long Island,50 to 69,100,F,Other Race,Spanish/Hispanic,5,Emergency,Home w/ Home Health Services,2020,GEN017,NONMALIGNANT BREAST CONDITIONS,,,385,"OTHER SKIN, SUBCUTANEOUS TISSUE & BREAST DISORDERS",09,"DISEASES AND DISORDERS OF THE SKIN, SUBCUTANEOUS TISSUE AND BREAST",1,Minor,Minor,Medical,Medicare,,,,,Y,72382.72,25058.15
Long Island,Nassau,2908000,000511,NYU Langone Hospital-Long Island,30 to 49,115,M,White,Unknown,3,Emergency,Home or Self Care,2020,SYM014,SKIN/SUBCUTANEOUS SIGNS AND SYMPTOMS,OTR004,ISOLATION PROCEDURES,385,"OTHER SKIN, SUBCUTANEOUS TISSUE & BREAST DISORDERS",09,"DISEASES AND DISORDERS OF THE SKIN, SUBCUTANEOUS TISSUE AND BREAST",2,Moderate,Moderate,Medical,Medicaid,,,,,Y,65422.86,17658.1
Long Island,Nassau,2908000,000511,NYU Langone Hospital-Long Island,0 to 17,115,M,Other Race,Spanish/Hispanic,2,Emergency,Home or Self Care,2020,SKN002,OTHER SPECIFIED INFLAMMATORY CONDITION OF SKIN,IMG008,ULTRASONOGRAPHY,385,"OTHER SKIN, SUBCUTANEOUS TISSUE & BREAST DISORDERS",09,"DISEASES AND DISORDERS OF THE SKIN, SUBCUTANEOUS TISSUE AND BREAST",1,Minor,Minor,Medical,Blue Cross/Blue Shield,,,,,Y,30597.05,7291.48
Long Island,Nassau,2908000,000511,NYU Langone Hospital-Long Island,18 to 29,115,F,Black/African American,Not Span/Hispanic,1,Emergency,Home or Self Care,2020,INJ030,DRUG INDUCED OR TOXIC RELATED CONDITION,OTR004,ISOLATION PROCEDURES,385,"OTHER SKIN, SUBCUTANEOUS TISSUE & BREAST DISORDERS",09,"DISEASES AND DISORDERS OF THE SKIN, SUBCUTANEOUS TISSUE AND BREAST",2,Moderate,Minor,Medical,Private Health Insurance,,,,,Y,25473.4,6282.24
Long Island,Nassau,2908000,000511,NYU Langone Hospital-Long Island,70 or Older,115,F,White,Not Span/Hispanic,3,Emergency,Skilled Nursing Home,2020,CIR039,OTHER SPECIFIED DISEASES OF VEINS AND LYMPHATICS,ADM010,VACCINATIONS,385,"OTHER SKIN, SUBCUTANEOUS TISSUE & BREAST DISORDERS",09,"DISEASES AND DISORDERS OF THE SKIN, SUBCUTANEOUS TISSUE AND BREAST",2,Moderate,Moderate,Medical,Medicare,Medicare,,,,Y,48713.66,16261.9
