Hospital Service Area,Hospital County,Operating Certificate Number,Permanent Facility Id,Facility Name,Age Group,Zip Code - 3 digits,Gender,Race,Ethnicity,Length of Stay,Type of Admission,Patient Disposition,Discharge Year,CCS Diagnosis Code,CCS Diagnosis Description,CCS Procedure Code,CCS Procedure Description,APR DRG Code,APR DRG Description,APR MDC Code,APR MDC Description,APR Severity of Illness Code,APR Severity of Illness Description,APR Risk of Mortality,APR Medical Surgical Description,Payment Typology 1,Payment Typology 2,Payment Typology 3,Birth Weight,Abortion Edit Indicator,Emergency Department Indicator,Total Charges,Total Costs
Long Island,Nassau,2908000,000511,NYU Langone Hospital-Long Island,70 or Older,110,F,White,Not Span/Hispanic,32,Emergency,Expired,2019,INF002,SEPTICEMIA,GIS009,COLECTOMY,004,TRACHEOSTOMY W MV 96+ HOURS W EXTENSIVE PROCEDURE,18,INFECTIOUS AND PARASITIC DISEASES (SYSTEMIC OR UNSPECIFIED SITES),4,Extreme,Extreme,Surgical,Medicare,Medicare,Blue Cross/Blue Shield,,,true,1138497.04,167781.23
Long Island,Nassau,2908000,000511,NYU Langone Hospital-Long Island,70 or Older,117,M,White,Not Span/Hispanic,37,Urgent,Expired,2019,CIR003,NONRHEUMATIC AND UNSPECIFIED VALVE DISORDERS,CAR023,HEART VALVE REPLACEMENT AND OTHER VALVE PROCEDURES (ENDOVASCULAR),004,TRACHEOSTOMY W MV 96+ HOURS W EXTENSIVE PROCEDURE,05,DISEASES AND DISORDERS OF THE CIRCULATORY SYSTEM,4,Extreme,Extreme,Surgical,Medicare,Medicare,,,,false,1239702.81,199360.67
Long Island,Nassau,2908000,000511,NYU Langone Hospital-Long Island,50 to 69,115,M,White,Not Span/Hispanic,34,Emergency,Skilled Nursing Home,2019,INJ008,"TRAUMATIC BRAIN INJURY (TBI); CONCUSSION, INITIAL ENCOUNTER",CNS014,"CNS PROCEDURES, NEC",004,TRACHEOSTOMY W MV 96+ HOURS W EXTENSIVE PROCEDURE,01,DISEASES AND DISORDERS OF THE NERVOUS SYSTEM,4,Extreme,Major,Surgical,Private Health Insurance,Medicaid,,,,true,887382.76,132808.22
Long Island,Nassau,2908000,000511,NYU Langone Hospital-Long Island,18 to 29,115,F,White,Not Span/Hispanic,35,Trauma,Expired,2019,INJ008,"TRAUMATIC BRAIN INJURY (TBI); CONCUSSION, INITIAL ENCOUNTER",CNS004,INTRACRANIAL EPIDURAL AND SUBDURAL SPACE DRAINAGE,004,TRACHEOSTOMY W MV 96+ HOURS W EXTENSIVE PROCEDURE,01,DISEASES AND DISORDERS OF THE NERVOUS SYSTEM,4,Extreme,Extreme,Surgical,Private Health Insurance,Medicaid,,,,true,1190116.07,149272.92
Long Island,Nassau,2908000,000511,NYU Langone Hospital-Long Island,70 or Older,110,F,White,Not Span/Hispanic,31,Elective,Skilled Nursing Home,2019,CIR003,NONRHEUMATIC AND UNSPECIFIED VALVE DISORDERS,CAR022,HEART VALVE REPLACEMENT AND OTHER VALVE PROCEDURES (NON-ENDOVASCULAR),004,TRACHEOSTOMY W MV 96+ HOURS W EXTENSIVE PROCEDURE,05,DISEASES AND DISORDERS OF THE CIRCULATORY SYSTEM,4,Extreme,Extreme,Surgical,Medicare,Medicare,,,,false,1183338.56,174317.13
Long Island,Nassau,2908000,000511,NYU Langone Hospital-Long Island,50 to 69,117,M,White,Not Span/Hispanic,43,Emergency,Inpatient Rehabilitation Facility,2019,INJ008,"TRAUMATIC BRAIN INJURY (TBI); CONCUSSION, INITIAL ENCOUNTER",RES010,TRACHEOSTOMY,004,TRACHEOSTOMY W MV 96+ HOURS W EXTENSIVE PROCEDURE,01,DISEASES AND DISORDERS OF THE NERVOUS SYSTEM,4,Extreme,Extreme,Surgical,Medicare,Medicare,,,,true,1282840.98,153785.31
Long Island,Nassau,2908000,000511,NYU Langone Hospital-Long Island,70 or Older,113,M,White,Not Span/Hispanic,59,Elective,Expired,2019,END003,DIABETES MELLITUS WITH COMPLICATION,MST019,"MUSCLE, TENDON, BURSA, AND LIGAMENT EXCISION",004,TRACHEOSTOMY W MV 96+ HOURS W EXTENSIVE PROCEDURE,05,DISEASES AND DISORDERS OF THE CIRCULATORY SYSTEM,4,Extreme,Extreme,Surgical,Medicare,Medicare,,,,false,1111886.21,201610.8
Long Island,Nassau,2908000,000511,NYU Langone Hospital-Long Island,70 or Older,115,F,White,Not Span/Hispanic,22,Urgent,Expired,2019,CIR003,NONRHEUMATIC AND UNSPECIFIED VALVE DISORDERS,CAR023,HEART VALVE REPLACEMENT AND OTHER VALVE PROCEDURES (ENDOVASCULAR),004,TRACHEOSTOMY W MV 96+ HOURS W EXTENSIVE PROCEDURE,05,DISEASES AND DISORDERS OF THE CIRCULATORY SYSTEM,4,Extreme,Extreme,Surgical,Medicare,Medicare,Private Health Insurance,,,false,1517356.55,230716.52
Long Island,Nassau,2908000,000511,NYU Langone Hospital-Long Island,50 to 69,117,F,Black/African American,Not Span/Hispanic,23,Elective,Skilled Nursing Home,2019,NEO035,FEMALE REPRODUCTIVE SYSTEM CANCERS - ENDOMETRIUM,RES010,TRACHEOSTOMY,004,TRACHEOSTOMY W MV 96+ HOURS W EXTENSIVE PROCEDURE,13,DISEASES AND DISORDERS OF THE FEMALE REPRODUCTIVE SYSTEM,3,Major,Moderate,Surgical,Blue Cross/Blue Shield,,,,,false,512441.61,101060.1
Long Island,Nassau,2908000,000511,NYU Langone Hospital-Long Island,70 or Older,115,F,Other Race,Unknown,38,Emergency,Skilled Nursing Home,2019,CIR021,ACUTE HEMORRHAGIC CEREBROVASCULAR DISEASE,RES010,TRACHEOSTOMY,004,TRACHEOSTOMY W MV 96+ HOURS W EXTENSIVE PROCEDURE,01,DISEASES AND DISORDERS OF THE NERVOUS SYSTEM,4,Extreme,Extreme,Surgical,Medicare,Medicare,Private Health Insurance,,,true,1197172.37,193347.07
Long Island,Nassau,2908000,000511,NYU Langone Hospital-Long Island,70 or Older,115,M,Black/African American,Not Span/Hispanic,11,Emergency,Inpatient Rehabilitation Facility,2019,CIR021,ACUTE HEMORRHAGIC CEREBROVASCULAR DISEASE,RES010,TRACHEOSTOMY,004,TRACHEOSTOMY W MV 96+ HOURS W EXTENSIVE PROCEDURE,01,DISEASES AND DISORDERS OF THE NERVOUS SYSTEM,4,Extreme,Extreme,Surgical,Medicare,Medicare,,,,true,284348.36,46375.47
Long Island,Nassau,2908000,000511,NYU Langone Hospital-Long Island,70 or Older,115,M,Other Race,Not Span/Hispanic,57,Emergency,Skilled Nursing Home,2019,INF002,SEPTICEMIA,ESA003,MECHANICAL VENTILATION,004,TRACHEOSTOMY W MV 96+ HOURS W EXTENSIVE PROCEDURE,18,INFECTIOUS AND PARASITIC DISEASES (SYSTEMIC OR UNSPECIFIED SITES),4,Extreme,Extreme,Surgical,Medicare,Medicare,Medicaid,,,true,1396523.62,219831.5
Long Island,Nassau,2908000,000511,NYU Langone Hospital-Long Island,70 or Older,115,F,Black/African American,Not Span/Hispanic,21,Emergency,Skilled Nursing Home,2019,CIR021,ACUTE HEMORRHAGIC CEREBROVASCULAR DISEASE,RES010,TRACHEOSTOMY,004,TRACHEOSTOMY W MV 96+ HOURS W EXTENSIVE PROCEDURE,01,DISEASES AND DISORDERS OF THE NERVOUS SYSTEM,4,Extreme,Extreme,Surgical,Medicare,Medicare,,,,true,733240.82,109565.03
Long Island,Nassau,2908000,000511,NYU Langone Hospital-Long Island,50 to 69,115,F,Black/African American,Not Span/Hispanic,39,Emergency,Skilled Nursing Home,2019,RSP012,RESPIRATORY FAILURE; INSUFFICIENCY; ARREST,CAR003,CORONARY ARTERY BYPASS GRAFTS (CABG),004,TRACHEOSTOMY W MV 96+ HOURS W EXTENSIVE PROCEDURE,04,DISEASES AND DISORDERS OF THE RESPIRATORY SYSTEM,4,Extreme,Extreme,Surgical,Medicare,Medicare,Medicaid,,,true,2073568.82,319584.78
Long Island,Nassau,2908000,000511,NYU Langone Hospital-Long Island,50 to 69,110,M,White,Not Span/Hispanic,14,Emergency,Expired,2019,INJ009,"SPINAL CORD INJURY (SCI), INITIAL ENCOUNTER",RES010,TRACHEOSTOMY,004,TRACHEOSTOMY W MV 96+ HOURS W EXTENSIVE PROCEDURE,01,DISEASES AND DISORDERS OF THE NERVOUS SYSTEM,4,Extreme,Extreme,Surgical,Medicare,Medicare,,,,true,1032978.14,141478.63
Long Island,Nassau,2908000,000511,NYU Langone Hospital-Long Island,30 to 49,117,M,Black/African American,Not Span/Hispanic,63,Urgent,Skilled Nursing Home,2019,NEO072,NEOPLASMS OF UNSPECIFIED NATURE OR UNCERTAIN BEHAVIOR,ADM021,"ADMINISTRATION OF THERAPEUTIC SUBSTANCES, NEC",004,TRACHEOSTOMY W MV 96+ HOURS W EXTENSIVE PROCEDURE,10,"ENDOCRINE, NUTRITIONAL AND METABOLIC DISEASES AND DISORDERS",4,Extreme,Extreme,Surgical,Blue Cross/Blue Shield,Federal/State/Local/VA,,,,false,2127869.03,326839.39
Long Island,Nassau,2908000,000511,NYU Langone Hospital-Long Island,70 or Older,116,F,Black/African American,Not Span/Hispanic,52,Urgent,Skilled Nursing Home,2019,CIR003,NONRHEUMATIC AND UNSPECIFIED VALVE DISORDERS,CAR023,HEART VALVE REPLACEMENT AND OTHER VALVE PROCEDURES (ENDOVASCULAR),004,TRACHEOSTOMY W MV 96+ HOURS W EXTENSIVE PROCEDURE,05,DISEASES AND DISORDERS OF THE CIRCULATORY SYSTEM,4,Extreme,Extreme,Surgical,Medicare,Medicare,Private Health Insurance,,,false,1379707.3,235388.87
Long Island,Nassau,2908000,000511,NYU Langone Hospital-Long Island,70 or Older,110,M,White,Not Span/Hispanic,26,Emergency,Hospice - Medical Facility,2019,CIR003,NONRHEUMATIC AND UNSPECIFIED VALVE DISORDERS,RES010,TRACHEOSTOMY,004,TRACHEOSTOMY W MV 96+ HOURS W EXTENSIVE PROCEDURE,05,DISEASES AND DISORDERS OF THE CIRCULATORY SYSTEM,4,Extreme,Extreme,Surgical,Medicare,Medicare,,,,true,927652.24,147395.36
Long Island,Nassau,2908000,000511,NYU Langone Hospital-Long Island,70 or Older,115,M,Black/African American,Not Span/Hispanic,65,Elective,Expired,2019,CIR001,CHRONIC RHEUMATIC HEART DISEASE,CAR022,HEART VALVE REPLACEMENT AND OTHER VALVE PROCEDURES (NON-ENDOVASCULAR),004,TRACHEOSTOMY W MV 96+ HOURS W EXTENSIVE PROCEDURE,05,DISEASES AND DISORDERS OF THE CIRCULATORY SYSTEM,4,Extreme,Extreme,Surgical,Medicare,Medicaid,,,,false,2886219.16,430034.26
Long Island,Nassau,2908000,000511,NYU Langone Hospital-Long Island,50 to 69,115,M,White,Not Span/Hispanic,44,Emergency,Skilled Nursing Home,2019,CIR021,ACUTE HEMORRHAGIC CEREBROVASCULAR DISEASE,CAR010,LIGATION AND EMBOLIZATION OF VESSELS,004,TRACHEOSTOMY W MV 96+ HOURS W EXTENSIVE PROCEDURE,01,DISEASES AND DISORDERS OF THE NERVOUS SYSTEM,4,Extreme,Extreme,Surgical,Blue Cross/Blue Shield,,,,,true,1499453.2,201007.03
Long Island,Nassau,2908000,000511,NYU Langone Hospital-Long Island,70 or Older,119,F,White,Not Span/Hispanic,58,Urgent,Expired,2019,CIR019,HEART FAILURE,CAR022,HEART VALVE REPLACEMENT AND OTHER VALVE PROCEDURES (NON-ENDOVASCULAR),004,TRACHEOSTOMY W MV 96+ HOURS W EXTENSIVE PROCEDURE,05,DISEASES AND DISORDERS OF THE CIRCULATORY SYSTEM,4,Extreme,Extreme,Surgical,Medicare,Medicare,,,,false,2784989.95,421554.34
Long Island,Nassau,2908000,000511,NYU Langone Hospital-Long Island,70 or Older,117,F,Black/African American,Not Span/Hispanic,47,Emergency,Skilled Nursing Home,2019,INF002,SEPTICEMIA,ESA003,MECHANICAL VENTILATION,004,TRACHEOSTOMY W MV 96+ HOURS W EXTENSIVE PROCEDURE,18,INFECTIOUS AND PARASITIC DISEASES (SYSTEMIC OR UNSPECIFIED SITES),4,Extreme,Extreme,Surgical,Medicare,Medicaid,,,,true,916795.31,161309.78
Long Island,Nassau,2908000,000511,NYU Langone Hospital-Long Island,50 to 69,117,M,White,Not Span/Hispanic,69,Emergency,Skilled Nursing Home,2019,INF002,SEPTICEMIA,RES010,TRACHEOSTOMY,004,TRACHEOSTOMY W MV 96+ HOURS W EXTENSIVE PROCEDURE,18,INFECTIOUS AND PARASITIC DISEASES (SYSTEMIC OR UNSPECIFIED SITES),4,Extreme,Extreme,Surgical,Medicare,Blue Cross/Blue Shield,,,,true,1723249.38,290894.93
Long Island,Nassau,2908000,000511,NYU Langone Hospital-Long Island,50 to 69,115,F,Other Race,Spanish/Hispanic,57,Emergency,Skilled Nursing Home,2019,DIG011,REGIONAL ENTERITIS AND ULCERATIVE COLITIS,RES010,TRACHEOSTOMY,004,TRACHEOSTOMY W MV 96+ HOURS W EXTENSIVE PROCEDURE,06,DISEASES AND DISORDERS OF THE DIGESTIVE SYSTEM,4,Extreme,Extreme,Surgical,Medicaid,,,,,true,1368301.1,230664.73
Long Island,Nassau,2908000,000511,NYU Langone Hospital-Long Island,50 to 69,115,F,Other Race,Not Span/Hispanic,28,Elective,Expired,2019,NEO015,GASTROINTESTINAL CANCERS - COLORECTAL,RES010,TRACHEOSTOMY,004,TRACHEOSTOMY W MV 96+ HOURS W EXTENSIVE PROCEDURE,06,DISEASES AND DISORDERS OF THE DIGESTIVE SYSTEM,4,Extreme,Extreme,Surgical,Blue Cross/Blue Shield,,,,,false,1600906.9,233124.03
Long Island,Nassau,2908000,000511,NYU Langone Hospital-Long Island,70 or Older,115,M,White,Not Span/Hispanic,22,Emergency,Skilled Nursing Home,2019,CIR021,ACUTE HEMORRHAGIC CEREBROVASCULAR DISEASE,CNS006,OTHER CNS DRAINAGE AND RELATED PROCEDURES,004,TRACHEOSTOMY W MV 96+ HOURS W EXTENSIVE PROCEDURE,01,DISEASES AND DISORDERS OF THE NERVOUS SYSTEM,4,Extreme,Extreme,Surgical,Medicare,,,,,true,897678.44,126629.31
Long Island,Nassau,2908000,000511,NYU Langone Hospital-Long Island,70 or Older,117,M,White,Not Span/Hispanic,22,Urgent,Expired,2019,CIR011,CORONARY ATHEROSCLEROSIS AND OTHER HEART DISEASE,CAR027,HEART ASSIST DEVICE PROCEDURES,004,TRACHEOSTOMY W MV 96+ HOURS W EXTENSIVE PROCEDURE,05,DISEASES AND DISORDERS OF THE CIRCULATORY SYSTEM,4,Extreme,Extreme,Surgical,Medicare,,,,,false,2137391.34,331105.83
Long Island,Nassau,2908000,000511,NYU Langone Hospital-Long Island,18 to 29,115,F,Other Race,Not Span/Hispanic,51,Emergency,Expired,2019,MBD012,SUICIDAL IDEATION/ATTEMPT/INTENTIONAL SELF-HARM,ESA002,EXTRACORPOREAL MEMBRANE OXYGENATION,004,TRACHEOSTOMY W MV 96+ HOURS W EXTENSIVE PROCEDURE,21,"INJURIES, POISONINGS AND TOXIC EFFECTS OF DRUGS",4,Extreme,Extreme,Surgical,Medicaid,,,,,true,3232485.96,472497.67
Long Island,Nassau,2908000,000511,NYU Langone Hospital-Long Island,50 to 69,115,F,White,Not Span/Hispanic,109,Emergency,Skilled Nursing Home,2019,RSP017,POSTPROCEDURAL OR POSTOPERATIVE RESPIRATORY SYSTEM COMPLICATION,RES007,AIRWAY INTUBATION,004,TRACHEOSTOMY W MV 96+ HOURS W EXTENSIVE PROCEDURE,04,DISEASES AND DISORDERS OF THE RESPIRATORY SYSTEM,3,Major,Major,Surgical,Medicare,Medicaid,,,,true,1108256.46,230857.63
