Hospital Service Area,Hospital County,Operating Certificate Number,Permanent Facility Id,Facility Name,Age Group,Zip Code - 3 digits,Gender,Race,Ethnicity,Length of Stay,Type of Admission,Patient Disposition,Discharge Year,CCS Diagnosis Code,CCS Diagnosis Description,CCS Procedure Code,CCS Procedure Description,APR DRG Code,APR DRG Description,APR MDC Code,APR MDC Description,APR Severity of Illness Code,APR Severity of Illness Description,APR Risk of Mortality,APR Medical Surgical Description,Payment Typology 1,Payment Typology 2,Payment Typology 3,Birth Weight,Abortion Edit Indicator,Emergency Department Indicator,Total Charges,Total Costs
Long Island,Nassau,2908000,000511,NYU Langone Hospital-Long Island,70 or Older,115,F,Black/African American,Not Span/Hispanic,30,Emergency,Inpatient Rehabilitation Facility,2020,INF002,SEPTICEMIA,GIS022,GI SYSTEM LYSIS OF ADHESIONS,004,TRACHEOSTOMY W MV 96+ HOURS W EXTENSIVE PROCEDURE,18,INFECTIOUS AND PARASITIC DISEASES (SYSTEMIC OR UNSPECIFIED SITES),4,Extreme,Extreme,Surgical,Medicare,,,,,Y,696712.65,216112.22
Long Island,Nassau,2908000,000511,NYU Langone Hospital-Long Island,30 to 49,115,F,Other Race,Not Span/Hispanic,58,Emergency,Medicare Cert Long Term Care Hospital,2020,NVS002,ENCEPHALITIS,RES010,TRACHEOSTOMY,004,TRACHEOSTOMY W MV 96+ HOURS W EXTENSIVE PROCEDURE,01,DISEASES AND DISORDERS OF THE NERVOUS SYSTEM,3,Major,Major,Surgical,Private Health Insurance,,,,,Y,2541481.92,467656.59
Long Island,Nassau,2908000,000511,NYU Langone Hospital-Long Island,0 to 17,115,M,White,Not Span/Hispanic,52,Urgent,Skilled Nursing Home,2020,END003,DIABETES MELLITUS WITH COMPLICATION,RES010,TRACHEOSTOMY,004,TRACHEOSTOMY W MV 96+ HOURS W EXTENSIVE PROCEDURE,10,"ENDOCRINE, NUTRITIONAL AND METABOLIC DISEASES AND DISORDERS",4,Extreme,Extreme,Surgical,Medicaid,,,,,N,1399101.46,280888.21
Long Island,Nassau,2908000,000511,NYU Langone Hospital-Long Island,0 to 17,115,M,Other Race,Spanish/Hispanic,54,Trauma,Medicare Cert Long Term Care Hospital,2020,INJ008,"TRAUMATIC BRAIN INJURY (TBI); CONCUSSION, INITIAL ENCOUNTER",RES010,TRACHEOSTOMY,004,TRACHEOSTOMY W MV 96+ HOURS W EXTENSIVE PROCEDURE,01,DISEASES AND DISORDERS OF THE NERVOUS SYSTEM,4,Extreme,Extreme,Surgical,Miscellaneous/Other,Medicaid,,,,Y,1644250,438558.24
Long Island,Nassau,2908000,000511,NYU Langone Hospital-Long Island,50 to 69,115,F,White,Not Span/Hispanic,18,Elective,Skilled Nursing Home,2020,MUS006,OSTEOARTHRITIS,MST006,KNEE ARTHROPLASTY,004,TRACHEOSTOMY W MV 96+ HOURS W EXTENSIVE PROCEDURE,08,DISEASES AND DISORDERS OF THE MUSCULOSKELETAL SYSTEM AND CONNECTIVE TISSUE,3,Major,Major,Surgical,Medicare,Medicare,,,,N,449755.54,122033.93
Long Island,Nassau,2908000,000511,NYU Langone Hospital-Long Island,70 or Older,115,F,White,Not Span/Hispanic,37,Emergency,Skilled Nursing Home,2020,CIR021,ACUTE HEMORRHAGIC CEREBROVASCULAR DISEASE,RES010,TRACHEOSTOMY,004,TRACHEOSTOMY W MV 96+ HOURS W EXTENSIVE PROCEDURE,01,DISEASES AND DISORDERS OF THE NERVOUS SYSTEM,4,Extreme,Extreme,Surgical,Medicare,Medicare,,,,Y,1387816.7,333910.24
Long Island,Nassau,2908000,000511,NYU Langone Hospital-Long Island,70 or Older,110,M,Other Race,Unknown,14,Trauma,Skilled Nursing Home,2020,INJ009,"SPINAL CORD INJURY (SCI), INITIAL ENCOUNTER",CNS008,SPINAL CORD DECOMPRESSION,004,TRACHEOSTOMY W MV 96+ HOURS W EXTENSIVE PROCEDURE,01,DISEASES AND DISORDERS OF THE NERVOUS SYSTEM,3,Major,Major,Surgical,Medicare,,,,,Y,708680.28,145634.73
Long Island,Nassau,2908000,000511,NYU Langone Hospital-Long Island,50 to 69,115,M,Other Race,Not Span/Hispanic,38,Emergency,Expired,2020,INF002,SEPTICEMIA,RES010,TRACHEOSTOMY,004,TRACHEOSTOMY W MV 96+ HOURS W EXTENSIVE PROCEDURE,18,INFECTIOUS AND PARASITIC DISEASES (SYSTEMIC OR UNSPECIFIED SITES),4,Extreme,Extreme,Surgical,Medicare,,,,,Y,1193767.38,355093.06
Long Island,Nassau,2908000,000511,NYU Langone Hospital-Long Island,70 or Older,114,F,White,Not Span/Hispanic,28,Trauma,Home w/ Home Health Services,2020,INJ008,"TRAUMATIC BRAIN INJURY (TBI); CONCUSSION, INITIAL ENCOUNTER",RES010,TRACHEOSTOMY,004,TRACHEOSTOMY W MV 96+ HOURS W EXTENSIVE PROCEDURE,01,DISEASES AND DISORDERS OF THE NERVOUS SYSTEM,4,Extreme,Extreme,Surgical,Medicare,Private Health Insurance,,,,Y,638314.09,191002.45
Long Island,Nassau,2908000,000511,NYU Langone Hospital-Long Island,50 to 69,110,M,White,Not Span/Hispanic,35,Emergency,Expired,2020,INF012,CORONAVIRUS DISEASE 2019 (COVID-19),RES010,TRACHEOSTOMY,004,TRACHEOSTOMY W MV 96+ HOURS W EXTENSIVE PROCEDURE,04,DISEASES AND DISORDERS OF THE RESPIRATORY SYSTEM,4,Extreme,Extreme,Surgical,Medicare,,,,,Y,1378274.9,329522.44
Long Island,Nassau,2908000,000511,NYU Langone Hospital-Long Island,30 to 49,117,F,White,Unknown,63,Emergency,Skilled Nursing Home,2020,INF002,SEPTICEMIA,RES010,TRACHEOSTOMY,004,TRACHEOSTOMY W MV 96+ HOURS W EXTENSIVE PROCEDURE,18,INFECTIOUS AND PARASITIC DISEASES (SYSTEMIC OR UNSPECIFIED SITES),4,Extreme,Extreme,Surgical,Medicaid,,,,,Y,1447680.44,449065.01
Long Island,Nassau,2908000,000511,NYU Langone Hospital-Long Island,30 to 49,116,F,Black/African American,Not Span/Hispanic,58,Emergency,Skilled Nursing Home,2020,INF002,SEPTICEMIA,RES010,TRACHEOSTOMY,004,TRACHEOSTOMY W MV 96+ HOURS W EXTENSIVE PROCEDURE,18,INFECTIOUS AND PARASITIC DISEASES (SYSTEMIC OR UNSPECIFIED SITES),4,Extreme,Extreme,Surgical,Private Health Insurance,,,,,Y,1483129.48,372387.64
Long Island,Nassau,2908000,000511,NYU Langone Hospital-Long Island,18 to 29,118,M,Other Race,Not Span/Hispanic,23,Trauma,Skilled Nursing Home,2020,INJ008,"TRAUMATIC BRAIN INJURY (TBI); CONCUSSION, INITIAL ENCOUNTER",MST018,BONE EXCISION,004,TRACHEOSTOMY W MV 96+ HOURS W EXTENSIVE PROCEDURE,01,DISEASES AND DISORDERS OF THE NERVOUS SYSTEM,3,Major,Moderate,Surgical,Medicaid,,,,,Y,962372.64,142257.2
Long Island,Nassau,2908000,000511,NYU Langone Hospital-Long Island,30 to 49,118,M,White,Not Span/Hispanic,75,Emergency,Inpatient Rehabilitation Facility,2020,INF002,SEPTICEMIA,RES010,TRACHEOSTOMY,004,TRACHEOSTOMY W MV 96+ HOURS W EXTENSIVE PROCEDURE,18,INFECTIOUS AND PARASITIC DISEASES (SYSTEMIC OR UNSPECIFIED SITES),4,Extreme,Extreme,Surgical,Private Health Insurance,,,,,Y,2198426.38,662807.2
Long Island,Nassau,2908000,000511,NYU Langone Hospital-Long Island,50 to 69,115,M,Other Race,Spanish/Hispanic,82,Emergency,Hospice - Medical Facility,2020,INF002,SEPTICEMIA,RES010,TRACHEOSTOMY,004,TRACHEOSTOMY W MV 96+ HOURS W EXTENSIVE PROCEDURE,18,INFECTIOUS AND PARASITIC DISEASES (SYSTEMIC OR UNSPECIFIED SITES),4,Extreme,Extreme,Surgical,Medicaid,,,,,Y,1830579.95,530375.22
Long Island,Nassau,2908000,000511,NYU Langone Hospital-Long Island,50 to 69,115,F,Other Race,Not Span/Hispanic,102,Emergency,Skilled Nursing Home,2020,INF002,SEPTICEMIA,RES010,TRACHEOSTOMY,004,TRACHEOSTOMY W MV 96+ HOURS W EXTENSIVE PROCEDURE,18,INFECTIOUS AND PARASITIC DISEASES (SYSTEMIC OR UNSPECIFIED SITES),4,Extreme,Extreme,Surgical,Medicare,,,,,Y,2453458.91,696333.6
Long Island,Nassau,2908000,000511,NYU Langone Hospital-Long Island,30 to 49,115,M,White,Not Span/Hispanic,23,Trauma,Inpatient Rehabilitation Facility,2020,INJ008,"TRAUMATIC BRAIN INJURY (TBI); CONCUSSION, INITIAL ENCOUNTER",RES010,TRACHEOSTOMY,004,TRACHEOSTOMY W MV 96+ HOURS W EXTENSIVE PROCEDURE,01,DISEASES AND DISORDERS OF THE NERVOUS SYSTEM,3,Major,Major,Surgical,Miscellaneous/Other,Private Health Insurance,,,,Y,821663.27,223572.48
Long Island,Nassau,2908000,000511,NYU Langone Hospital-Long Island,30 to 49,115,M,Other Race,Not Span/Hispanic,58,Emergency,Home w/ Home Health Services,2020,DIG020,PANCREATIC DISORDERS (EXCLUDING DIABETES),RES010,TRACHEOSTOMY,004,TRACHEOSTOMY W MV 96+ HOURS W EXTENSIVE PROCEDURE,07,DISEASES AND DISORDERS OF THE HEPATOBILIARY SYSTEM AND PANCREAS,4,Extreme,Extreme,Surgical,Blue Cross/Blue Shield,,,,,Y,1896186.24,522620.31
Long Island,Nassau,2908000,000511,NYU Langone Hospital-Long Island,70 or Older,115,M,Black/African American,Not Span/Hispanic,22,Emergency,Skilled Nursing Home,2020,CIR009,ACUTE MYOCARDIAL INFARCTION,CAR003,CORONARY ARTERY BYPASS GRAFTS (CABG),004,TRACHEOSTOMY W MV 96+ HOURS W EXTENSIVE PROCEDURE,05,DISEASES AND DISORDERS OF THE CIRCULATORY SYSTEM,4,Extreme,Extreme,Surgical,Medicare,,,,,Y,935790.49,235826.53
Long Island,Nassau,2908000,000511,NYU Langone Hospital-Long Island,30 to 49,115,F,Other Race,Unknown,101,Emergency,Home w/ Home Health Services,2020,CIR021,ACUTE HEMORRHAGIC CEREBROVASCULAR DISEASE,RES010,TRACHEOSTOMY,004,TRACHEOSTOMY W MV 96+ HOURS W EXTENSIVE PROCEDURE,01,DISEASES AND DISORDERS OF THE NERVOUS SYSTEM,3,Major,Extreme,Surgical,Medicaid,,,,,Y,2520431.11,613614.09
Long Island,Nassau,2908000,000511,NYU Langone Hospital-Long Island,30 to 49,117,M,White,Not Span/Hispanic,19,Emergency,Inpatient Rehabilitation Facility,2020,CIR020,CEREBRAL INFARCTION,RES010,TRACHEOSTOMY,004,TRACHEOSTOMY W MV 96+ HOURS W EXTENSIVE PROCEDURE,01,DISEASES AND DISORDERS OF THE NERVOUS SYSTEM,3,Major,Major,Surgical,Private Health Insurance,,,,,Y,837654.31,195386.38
Long Island,Nassau,2908000,000511,NYU Langone Hospital-Long Island,50 to 69,115,M,White,Not Span/Hispanic,41,Emergency,Skilled Nursing Home,2020,CIR021,ACUTE HEMORRHAGIC CEREBROVASCULAR DISEASE,RES010,TRACHEOSTOMY,004,TRACHEOSTOMY W MV 96+ HOURS W EXTENSIVE PROCEDURE,01,DISEASES AND DISORDERS OF THE NERVOUS SYSTEM,4,Extreme,Extreme,Surgical,Private Health Insurance,Medicare,,,,N,1268036.7,359705.72
Long Island,Nassau,2908000,000511,NYU Langone Hospital-Long Island,30 to 49,115,M,White,Not Span/Hispanic,120 +,Emergency,Medicare Cert Long Term Care Hospital,2020,INF012,CORONAVIRUS DISEASE 2019 (COVID-19),ESA002,EXTRACORPOREAL MEMBRANE OXYGENATION,004,TRACHEOSTOMY W MV 96+ HOURS W EXTENSIVE PROCEDURE,04,DISEASES AND DISORDERS OF THE RESPIRATORY SYSTEM,4,Extreme,Extreme,Surgical,Medicare,,,,,Y,5805654.66,1433371.25
Long Island,Nassau,2908000,000511,NYU Langone Hospital-Long Island,30 to 49,110,M,White,Not Span/Hispanic,51,Emergency,Inpatient Rehabilitation Facility,2020,CIR027,ARTERIAL DISSECTIONS,ESA003,MECHANICAL VENTILATION,004,TRACHEOSTOMY W MV 96+ HOURS W EXTENSIVE PROCEDURE,05,DISEASES AND DISORDERS OF THE CIRCULATORY SYSTEM,4,Extreme,Extreme,Surgical,Private Health Insurance,,,,,Y,1987584.27,507236.42
Long Island,Nassau,2908000,000511,NYU Langone Hospital-Long Island,70 or Older,115,M,Other Race,Not Span/Hispanic,120 +,Emergency,Expired,2020,INF002,SEPTICEMIA,RES010,TRACHEOSTOMY,004,TRACHEOSTOMY W MV 96+ HOURS W EXTENSIVE PROCEDURE,18,INFECTIOUS AND PARASITIC DISEASES (SYSTEMIC OR UNSPECIFIED SITES),4,Extreme,Extreme,Surgical,Blue Cross/Blue Shield,Medicare,,,,Y,2620467.27,948891.46
Long Island,Nassau,2908000,000511,NYU Langone Hospital-Long Island,70 or Older,115,F,Multi-racial,Spanish/Hispanic,36,Emergency,Skilled Nursing Home,2020,CIR020,CEREBRAL INFARCTION,RES010,TRACHEOSTOMY,004,TRACHEOSTOMY W MV 96+ HOURS W EXTENSIVE PROCEDURE,01,DISEASES AND DISORDERS OF THE NERVOUS SYSTEM,4,Extreme,Extreme,Surgical,Medicare,,,,,Y,1267868.74,294366.95
Long Island,Nassau,2908000,000511,NYU Langone Hospital-Long Island,70 or Older,117,M,Black/African American,Not Span/Hispanic,69,Elective,Medicare Cert Long Term Care Hospital,2020,NEO015,GASTROINTESTINAL CANCERS - COLORECTAL,RES010,TRACHEOSTOMY,004,TRACHEOSTOMY W MV 96+ HOURS W EXTENSIVE PROCEDURE,06,DISEASES AND DISORDERS OF THE DIGESTIVE SYSTEM,4,Extreme,Extreme,Surgical,Medicare,,,,,N,1922909.11,603908.83
Long Island,Nassau,2908000,000511,NYU Langone Hospital-Long Island,50 to 69,115,M,White,Not Span/Hispanic,15,Elective,Home w/ Home Health Services,2020,MUS011,SPONDYLOPATHIES/SPONDYLOARTHROPATHY (INCLUDING INFECTIVE),MST013,SPINE FUSION,004,TRACHEOSTOMY W MV 96+ HOURS W EXTENSIVE PROCEDURE,08,DISEASES AND DISORDERS OF THE MUSCULOSKELETAL SYSTEM AND CONNECTIVE TISSUE,4,Extreme,Extreme,Surgical,Blue Cross/Blue Shield,,,,,N,911117.93,162446.79
Long Island,Nassau,2908000,000511,NYU Langone Hospital-Long Island,70 or Older,115,F,White,Not Span/Hispanic,16,Emergency,Expired,2020,CIR001,CHRONIC RHEUMATIC HEART DISEASE,RES010,TRACHEOSTOMY,004,TRACHEOSTOMY W MV 96+ HOURS W EXTENSIVE PROCEDURE,05,DISEASES AND DISORDERS OF THE CIRCULATORY SYSTEM,4,Extreme,Extreme,Surgical,Medicare,Blue Cross/Blue Shield,,,,N,559198.83,116784.38
Long Island,Nassau,2908000,000511,NYU Langone Hospital-Long Island,70 or Older,115,M,White,Spanish/Hispanic,29,Trauma,Skilled Nursing Home,2020,INJ008,"TRAUMATIC BRAIN INJURY (TBI); CONCUSSION, INITIAL ENCOUNTER",RES010,TRACHEOSTOMY,004,TRACHEOSTOMY W MV 96+ HOURS W EXTENSIVE PROCEDURE,01,DISEASES AND DISORDERS OF THE NERVOUS SYSTEM,4,Extreme,Extreme,Surgical,Medicare,,,,,Y,1105507.84,176303.33
Long Island,Nassau,2908000,000511,NYU Langone Hospital-Long Island,70 or Older,117,M,White,Not Span/Hispanic,44,Elective,Skilled Nursing Home,2020,CIR001,CHRONIC RHEUMATIC HEART DISEASE,CAR022,HEART VALVE REPLACEMENT AND OTHER VALVE PROCEDURES (NON-ENDOVASCULAR),004,TRACHEOSTOMY W MV 96+ HOURS W EXTENSIVE PROCEDURE,05,DISEASES AND DISORDERS OF THE CIRCULATORY SYSTEM,4,Extreme,Extreme,Surgical,Medicare,Blue Cross/Blue Shield,,,,N,1560916.07,437808.01
Long Island,Nassau,2908000,000511,NYU Langone Hospital-Long Island,50 to 69,115,M,Multi-racial,Not Span/Hispanic,47,Emergency,Medicare Cert Long Term Care Hospital,2020,CIR009,ACUTE MYOCARDIAL INFARCTION,RES010,TRACHEOSTOMY,004,TRACHEOSTOMY W MV 96+ HOURS W EXTENSIVE PROCEDURE,05,DISEASES AND DISORDERS OF THE CIRCULATORY SYSTEM,4,Extreme,Extreme,Surgical,Private Health Insurance,,,,,Y,1629406.57,373834.19
Long Island,Nassau,2908000,000511,NYU Langone Hospital-Long Island,50 to 69,115,M,White,Not Span/Hispanic,120 +,Emergency,Medicare Cert Long Term Care Hospital,2020,INF002,SEPTICEMIA,RES010,TRACHEOSTOMY,004,TRACHEOSTOMY W MV 96+ HOURS W EXTENSIVE PROCEDURE,18,INFECTIOUS AND PARASITIC DISEASES (SYSTEMIC OR UNSPECIFIED SITES),4,Extreme,Extreme,Surgical,Blue Cross/Blue Shield,Blue Cross/Blue Shield,,,,Y,3702752.67,898889.01
