Hospital Service Area,Hospital County,Operating Certificate Number,Permanent Facility Id,Facility Name,Age Group,Zip Code - 3 digits,Gender,Race,Ethnicity,Length of Stay,Type of Admission,Patient Disposition,Discharge Year,CCS Diagnosis Code,CCS Diagnosis Description,CCS Procedure Code,CCS Procedure Description,APR DRG Code,APR DRG Description,APR MDC Code,APR MDC Description,APR Severity of Illness Code,APR Severity of Illness Description,APR Risk of Mortality,APR Medical Surgical Description,Payment Typology 1,Payment Typology 2,Payment Typology 3,Birth Weight,Abortion Edit Indicator,Emergency Department Indicator,Total Charges,Total Costs
Hudson Valley,Putnam,3950000,000752,Putnam Hospital,70 or Older,125,F,White,Not Span/Hispanic,3,Emergency,Skilled Nursing Home,2019,INJ009,"SPINAL CORD INJURY (SCI), INITIAL ENCOUNTER",,,040,SPINAL DISORDERS & INJURIES,01,DISEASES AND DISORDERS OF THE NERVOUS SYSTEM,2,Moderate,Moderate,Medical,Medicare,Federal/State/Local/VA,,,,true,19952.86,6182.08
New York City,Bronx,7000002,001165,Jacobi Medical Center,30 to 49,104,F,Other Race,Unknown,10,Elective,Home or Self Care,2019,NVS020,OTHER SPECIFIED NERVOUS SYSTEM DISORDERS,RHB002,"PHYSICAL, OCCUPATIONAL, AND RESPIRATORY THERAPY TREATMENT",040,SPINAL DISORDERS & INJURIES,01,DISEASES AND DISORDERS OF THE NERVOUS SYSTEM,2,Moderate,Minor,Medical,Medicaid,Medicaid,,,,false,14389.93,8513.8
New York City,Manhattan,7002017,001450,Lenox Hill Hospital,18 to 29,100,F,White,Not Span/Hispanic,9,Emergency,Home or Self Care,2019,NVS020,OTHER SPECIFIED NERVOUS SYSTEM DISORDERS,CNS002,LUMBAR PUNCTURE,040,SPINAL DISORDERS & INJURIES,01,DISEASES AND DISORDERS OF THE NERVOUS SYSTEM,1,Minor,Minor,Medical,Blue Cross/Blue Shield,,,,,true,150647.11,24599.61
New York City,Manhattan,7002053,001463,NYU Langone Hospitals,0 to 17,103,F,Other Race,Not Span/Hispanic,11,Emergency,Inpatient Rehabilitation Facility,2019,NVS020,OTHER SPECIFIED NERVOUS SYSTEM DISORDERS,CNS002,LUMBAR PUNCTURE,040,SPINAL DISORDERS & INJURIES,01,DISEASES AND DISORDERS OF THE NERVOUS SYSTEM,3,Major,Moderate,Medical,Blue Cross/Blue Shield,Medicaid,,,,false,204198.41,43530.32
New York City,Kings,7001021,001306,New York - Presbyterian Brooklyn Methodist Hospital,50 to 69,112,F,Black/African American,Not Span/Hispanic,3,Elective,Home w/ Home Health Services,2019,NVS020,OTHER SPECIFIED NERVOUS SYSTEM DISORDERS,EST001,PHERESIS THERAPY,040,SPINAL DISORDERS & INJURIES,01,DISEASES AND DISORDERS OF THE NERVOUS SYSTEM,3,Major,Major,Medical,Medicaid,Self-Pay,,,,false,22319.29,5232.99
New York City,Richmond,7004003,001740,Staten Island University Hosp-North,18 to 29,103,F,Other Race,Spanish/Hispanic,96,Elective,Home or Self Care,2019,NVS008,PARALYSIS (OTHER THAN CEREBRAL PALSY),RHB002,"PHYSICAL, OCCUPATIONAL, AND RESPIRATORY THERAPY TREATMENT",040,SPINAL DISORDERS & INJURIES,01,DISEASES AND DISORDERS OF THE NERVOUS SYSTEM,4,Extreme,Major,Medical,Private Health Insurance,Medicaid,Medicaid,,,false,645367.36,281308.88
New York City,Kings,7001002,001286,Brookdale Hospital Medical Center,70 or Older,112,M,Black/African American,Not Span/Hispanic,3,Trauma,Home w/ Home Health Services,2019,INJ009,"SPINAL CORD INJURY (SCI), INITIAL ENCOUNTER",,,040,SPINAL DISORDERS & INJURIES,01,DISEASES AND DISORDERS OF THE NERVOUS SYSTEM,2,Moderate,Moderate,Medical,Miscellaneous/Other,Self-Pay,Medicare,,,true,26128.08,12987.24
Long Island,Nassau,2951001,000541,North Shore University Hospital,70 or Older,110,F,Other Race,Not Span/Hispanic,17,Emergency,Inpatient Rehabilitation Facility,2019,INJ009,"SPINAL CORD INJURY (SCI), INITIAL ENCOUNTER",,,040,SPINAL DISORDERS & INJURIES,01,DISEASES AND DISORDERS OF THE NERVOUS SYSTEM,2,Moderate,Moderate,Medical,Self-Pay,,,,,true,168603.84,31209.07
New York City,Manhattan,7002054,001437,New York-Presbyterian/Lower Manhattan Hospital,18 to 29,112,F,White,Not Span/Hispanic,2,Emergency,Home or Self Care,2019,NVS020,OTHER SPECIFIED NERVOUS SYSTEM DISORDERS,ADM016,ADMINISTRATION OF ANTI-INFLAMMATORY AGENTS,040,SPINAL DISORDERS & INJURIES,01,DISEASES AND DISORDERS OF THE NERVOUS SYSTEM,2,Moderate,Minor,Medical,Private Health Insurance,Self-Pay,,,,true,41833.28,8529.66
Hudson Valley,Westchester,5902002,001046,Winifred Masterson Burke Rehabilitation Hospital,50 to 69,106,M,Black/African American,Not Span/Hispanic,40,Elective,Short-term Hospital,2019,NVS008,PARALYSIS (OTHER THAN CEREBRAL PALSY),,,040,SPINAL DISORDERS & INJURIES,01,DISEASES AND DISORDERS OF THE NERVOUS SYSTEM,3,Major,Major,Medical,Medicaid,,,,,false,117906.05,53517.21
Finger Lakes,Monroe,2701005,000413,Strong Memorial Hospital,70 or Older,145,M,White,Not Span/Hispanic,4,Emergency,Home or Self Care,2019,INJ009,"SPINAL CORD INJURY (SCI), INITIAL ENCOUNTER",,,040,SPINAL DISORDERS & INJURIES,01,DISEASES AND DISORDERS OF THE NERVOUS SYSTEM,3,Major,Moderate,Medical,Medicare,,,,,true,30359.01,10134.33
Long Island,Suffolk,5154000,000924,South Shore University Hospital,30 to 49,117,F,Other Race,Spanish/Hispanic,14,Emergency,Cancer Center or Children's Hospital,2019,NVS020,OTHER SPECIFIED NERVOUS SYSTEM DISORDERS,,,040,SPINAL DISORDERS & INJURIES,01,DISEASES AND DISORDERS OF THE NERVOUS SYSTEM,3,Major,Major,Medical,Private Health Insurance,,,,,true,206203.97,53832.18
Long Island,Nassau,2951001,000541,North Shore University Hospital,70 or Older,113,F,White,Not Span/Hispanic,6,Emergency,Skilled Nursing Home,2019,NVS020,OTHER SPECIFIED NERVOUS SYSTEM DISORDERS,,,040,SPINAL DISORDERS & INJURIES,01,DISEASES AND DISORDERS OF THE NERVOUS SYSTEM,2,Moderate,Moderate,Medical,Medicare,Blue Cross/Blue Shield,,,,true,64986.1,10924.84
Finger Lakes,Monroe,2701003,000411,Rochester General Hospital,70 or Older,146,F,White,Not Span/Hispanic,5,Emergency,Skilled Nursing Home,2019,NVS008,PARALYSIS (OTHER THAN CEREBRAL PALSY),,,040,SPINAL DISORDERS & INJURIES,01,DISEASES AND DISORDERS OF THE NERVOUS SYSTEM,3,Major,Moderate,Medical,Medicare,Blue Cross/Blue Shield,,,,true,13022.34,6503.25
New York City,Manhattan,7002054,001464,New York-Presbyterian Hospital - Columbia Presbyterian Center,0 to 17,125,F,White,Not Span/Hispanic,6,Emergency,Home or Self Care,2019,NVS020,OTHER SPECIFIED NERVOUS SYSTEM DISORDERS,CNS002,LUMBAR PUNCTURE,040,SPINAL DISORDERS & INJURIES,01,DISEASES AND DISORDERS OF THE NERVOUS SYSTEM,2,Moderate,Minor,Medical,Blue Cross/Blue Shield,Self-Pay,,,,true,104751.05,22800.05
New York City,Manhattan,7002053,001463,NYU Langone Hospitals,30 to 49,100,F,White,Not Span/Hispanic,3,Emergency,Home or Self Care,2019,NVS020,OTHER SPECIFIED NERVOUS SYSTEM DISORDERS,CNS002,LUMBAR PUNCTURE,040,SPINAL DISORDERS & INJURIES,01,DISEASES AND DISORDERS OF THE NERVOUS SYSTEM,1,Minor,Minor,Medical,Blue Cross/Blue Shield,Medicaid,,,,true,84849.09,15394.62
Central NY,Jefferson,2201000,000367,Samaritan Medical Center,18 to 29,136,M,White,Not Span/Hispanic,21,Urgent,Left Against Medical Advice,2019,NVS008,PARALYSIS (OTHER THAN CEREBRAL PALSY),,,040,SPINAL DISORDERS & INJURIES,01,DISEASES AND DISORDERS OF THE NERVOUS SYSTEM,3,Major,Major,Medical,Medicaid,,,,,false,85992.19,37130.74
New York City,Richmond,7004003,001740,Staten Island University Hosp-North,50 to 69,103,M,Black/African American,Not Span/Hispanic,14,Emergency,Skilled Nursing Home,2019,NVS020,OTHER SPECIFIED NERVOUS SYSTEM DISORDERS,,,040,SPINAL DISORDERS & INJURIES,01,DISEASES AND DISORDERS OF THE NERVOUS SYSTEM,2,Moderate,Minor,Medical,Medicaid,Medicaid,,,,true,89620.66,22954.84
New York City,Manhattan,7002053,001463,NYU Langone Hospitals,50 to 69,113,F,Other Race,Not Span/Hispanic,6,Emergency,Home or Self Care,2019,NVS020,OTHER SPECIFIED NERVOUS SYSTEM DISORDERS,CNS002,LUMBAR PUNCTURE,040,SPINAL DISORDERS & INJURIES,01,DISEASES AND DISORDERS OF THE NERVOUS SYSTEM,2,Moderate,Minor,Medical,Blue Cross/Blue Shield,,,,,true,111140.07,26477.26
New York City,Manhattan,7002054,001464,New York-Presbyterian Hospital - Columbia Presbyterian Center,50 to 69,OOS,M,White,Not Span/Hispanic,9,Emergency,Inpatient Rehabilitation Facility,2019,NVS008,PARALYSIS (OTHER THAN CEREBRAL PALSY),,,040,SPINAL DISORDERS & INJURIES,01,DISEASES AND DISORDERS OF THE NERVOUS SYSTEM,3,Major,Moderate,Medical,Medicare,Medicare,Self-Pay,,,true,124454.89,26567.57
Hudson Valley,Westchester,5902002,001046,Winifred Masterson Burke Rehabilitation Hospital,50 to 69,104,F,Other Race,Spanish/Hispanic,18,Elective,Home w/ Home Health Services,2019,NVS020,OTHER SPECIFIED NERVOUS SYSTEM DISORDERS,,,040,SPINAL DISORDERS & INJURIES,01,DISEASES AND DISORDERS OF THE NERVOUS SYSTEM,2,Moderate,Minor,Medical,Medicaid,,,,,false,55096.73,25142.5
New York City,Manhattan,7002032,001469,Mount Sinai Morningside,70 or Older,103,M,Other Race,Unknown,9,Elective,Skilled Nursing Home,2019,NVS020,OTHER SPECIFIED NERVOUS SYSTEM DISORDERS,RHB002,"PHYSICAL, OCCUPATIONAL, AND RESPIRATORY THERAPY TREATMENT",040,SPINAL DISORDERS & INJURIES,01,DISEASES AND DISORDERS OF THE NERVOUS SYSTEM,3,Major,Major,Medical,Medicare,Medicaid,Self-Pay,,,false,76197.52,27077.54
Long Island,Nassau,2951001,000541,North Shore University Hospital,50 to 69,114,F,Black/African American,Not Span/Hispanic,13,Emergency,Another Type Not Listed,2019,NVS020,OTHER SPECIFIED NERVOUS SYSTEM DISORDERS,EST001,PHERESIS THERAPY,040,SPINAL DISORDERS & INJURIES,01,DISEASES AND DISORDERS OF THE NERVOUS SYSTEM,2,Moderate,Minor,Medical,Medicare,Medicaid,,,,true,162912.35,32250.86
Finger Lakes,Monroe,2754001,000471,The Unity Hospital of Rochester,50 to 69,145,M,White,Not Span/Hispanic,35,Urgent,Home or Self Care,2019,NVS008,PARALYSIS (OTHER THAN CEREBRAL PALSY),ADM014,REGIONAL ANESTHESIA,040,SPINAL DISORDERS & INJURIES,01,DISEASES AND DISORDERS OF THE NERVOUS SYSTEM,3,Major,Major,Medical,Blue Cross/Blue Shield,,,,,false,95419.68,27895.11
New York City,Manhattan,7002053,001446,NYU Langone Orthopedic Hospital,50 to 69,103,M,White,Not Span/Hispanic,20,Elective,Skilled Nursing Home,2019,NVS008,PARALYSIS (OTHER THAN CEREBRAL PALSY),RHB002,"PHYSICAL, OCCUPATIONAL, AND RESPIRATORY THERAPY TREATMENT",040,SPINAL DISORDERS & INJURIES,01,DISEASES AND DISORDERS OF THE NERVOUS SYSTEM,3,Major,Major,Medical,Private Health Insurance,,,,,false,236413.14,68593.64
Central NY,Onondaga,3301007,000635,University Hospital SUNY Health Science Center,30 to 49,131,M,White,Not Span/Hispanic,3,Elective,Short-term Hospital,2019,NVS008,PARALYSIS (OTHER THAN CEREBRAL PALSY),RHB002,"PHYSICAL, OCCUPATIONAL, AND RESPIRATORY THERAPY TREATMENT",040,SPINAL DISORDERS & INJURIES,01,DISEASES AND DISORDERS OF THE NERVOUS SYSTEM,4,Extreme,Major,Medical,Medicaid,,,,,false,27881.9,8252.97
New York City,Manhattan,7002024,001456,Mount Sinai Hospital,50 to 69,112,F,Black/African American,Not Span/Hispanic,27,Urgent,Home w/ Home Health Services,2019,NVS008,PARALYSIS (OTHER THAN CEREBRAL PALSY),RHB002,"PHYSICAL, OCCUPATIONAL, AND RESPIRATORY THERAPY TREATMENT",040,SPINAL DISORDERS & INJURIES,01,DISEASES AND DISORDERS OF THE NERVOUS SYSTEM,2,Moderate,Minor,Medical,Private Health Insurance,Self-Pay,,,,false,201325.51,67466.37
Western NY,Erie,1401014,000207,Buffalo General Medical Center,50 to 69,147,M,White,Not Span/Hispanic,21,Elective,Short-term Hospital,2019,NVS008,PARALYSIS (OTHER THAN CEREBRAL PALSY),,,040,SPINAL DISORDERS & INJURIES,01,DISEASES AND DISORDERS OF THE NERVOUS SYSTEM,3,Major,Major,Medical,Blue Cross/Blue Shield,Self-Pay,,,,false,66092.66,22899.52
New York City,Queens,7003010,001637,New York - Presbyterian/Queens,70 or Older,113,F,Other Race,Not Span/Hispanic,6,Emergency,Skilled Nursing Home,2019,INJ009,"SPINAL CORD INJURY (SCI), INITIAL ENCOUNTER",CAR024,VENOUS AND ARTERIAL CATHETER PLACEMENT,040,SPINAL DISORDERS & INJURIES,01,DISEASES AND DISORDERS OF THE NERVOUS SYSTEM,3,Major,Major,Medical,Medicare,Medicaid,Self-Pay,,,true,77935.83,17574.08
Long Island,Nassau,2951001,000541,North Shore University Hospital,70 or Older,115,M,Other Race,Not Span/Hispanic,1,Emergency,Home w/ Home Health Services,2019,NVS020,OTHER SPECIFIED NERVOUS SYSTEM DISORDERS,,,040,SPINAL DISORDERS & INJURIES,01,DISEASES AND DISORDERS OF THE NERVOUS SYSTEM,3,Major,Moderate,Medical,Medicaid,Medicaid,,,,true,25929.36,3495.39
Capital/Adirond,Albany,0101000,000001,Albany Medical Center Hospital,50 to 69,121,F,White,Not Span/Hispanic,1,Emergency,Home or Self Care,2019,NVS020,OTHER SPECIFIED NERVOUS SYSTEM DISORDERS,,,040,SPINAL DISORDERS & INJURIES,01,DISEASES AND DISORDERS OF THE NERVOUS SYSTEM,1,Minor,Minor,Medical,"Managed Care, Unspecified",Medicare,,,,true,16883.12,3463.13
New York City,Manhattan,7002054,001464,New York-Presbyterian Hospital - Columbia Presbyterian Center,50 to 69,109,M,Black/African American,Not Span/Hispanic,3,Emergency,Home or Self Care,2019,NVS020,OTHER SPECIFIED NERVOUS SYSTEM DISORDERS,CNS002,LUMBAR PUNCTURE,040,SPINAL DISORDERS & INJURIES,01,DISEASES AND DISORDERS OF THE NERVOUS SYSTEM,2,Moderate,Moderate,Medical,Medicare,Private Health Insurance,Self-Pay,,,true,76702.56,15807.37
Long Island,Suffolk,5123000,000885,Long Island Community Hospital,30 to 49,119,M,White,Not Span/Hispanic,6,Emergency,Home w/ Home Health Services,2019,NVS020,OTHER SPECIFIED NERVOUS SYSTEM DISORDERS,,,040,SPINAL DISORDERS & INJURIES,01,DISEASES AND DISORDERS OF THE NERVOUS SYSTEM,1,Minor,Minor,Medical,Medicare,Medicare,,,,true,103444.86,14714.22
Hudson Valley,Westchester,5902002,001046,Winifred Masterson Burke Rehabilitation Hospital,50 to 69,112,F,Black/African American,Not Span/Hispanic,28,Elective,Home w/ Home Health Services,2019,NVS020,OTHER SPECIFIED NERVOUS SYSTEM DISORDERS,,,040,SPINAL DISORDERS & INJURIES,01,DISEASES AND DISORDERS OF THE NERVOUS SYSTEM,3,Major,Moderate,Medical,Private Health Insurance,Medicaid,,,,false,77391.5,35662.2
Central NY,Onondaga,3301007,000635,University Hospital SUNY Health Science Center,70 or Older,136,M,White,Not Span/Hispanic,1,Emergency,Home or Self Care,2019,INJ009,"SPINAL CORD INJURY (SCI), INITIAL ENCOUNTER",,,040,SPINAL DISORDERS & INJURIES,01,DISEASES AND DISORDERS OF THE NERVOUS SYSTEM,2,Moderate,Minor,Medical,Medicare,Blue Cross/Blue Shield,,,,true,20180.56,4181.67
Western NY,Erie,1401010,000216,Roswell Park Cancer Institute,50 to 69,142,F,White,Not Span/Hispanic,1,Urgent,Home w/ Home Health Services,2019,NVS020,OTHER SPECIFIED NERVOUS SYSTEM DISORDERS,ADM016,ADMINISTRATION OF ANTI-INFLAMMATORY AGENTS,040,SPINAL DISORDERS & INJURIES,01,DISEASES AND DISORDERS OF THE NERVOUS SYSTEM,2,Moderate,Moderate,Medical,Medicare,Blue Cross/Blue Shield,,,,false,13911.27,3014.46
Long Island,Suffolk,5154000,000924,South Shore University Hospital,50 to 69,117,M,White,Not Span/Hispanic,3,Emergency,Home or Self Care,2019,NVS020,OTHER SPECIFIED NERVOUS SYSTEM DISORDERS,CNS002,LUMBAR PUNCTURE,040,SPINAL DISORDERS & INJURIES,01,DISEASES AND DISORDERS OF THE NERVOUS SYSTEM,2,Moderate,Moderate,Medical,Medicare,Medicare,,,,true,58443.26,12782.57
New York City,Bronx,7000006,001169,Montefiore Medical Center - Henry & Lucy Moses Div,0 to 17,104,F,Other Race,Spanish/Hispanic,1,Emergency,Home or Self Care,2019,INJ009,"SPINAL CORD INJURY (SCI), INITIAL ENCOUNTER",,,040,SPINAL DISORDERS & INJURIES,01,DISEASES AND DISORDERS OF THE NERVOUS SYSTEM,2,Moderate,Minor,Medical,Medicaid,,,,,true,20822,3634.86
New York City,Bronx,7000006,001169,Montefiore Medical Center - Henry & Lucy Moses Div,0 to 17,107,F,Black/African American,Not Span/Hispanic,2,Emergency,Skilled Nursing Home,2019,NVS008,PARALYSIS (OTHER THAN CEREBRAL PALSY),CNS002,LUMBAR PUNCTURE,040,SPINAL DISORDERS & INJURIES,01,DISEASES AND DISORDERS OF THE NERVOUS SYSTEM,2,Moderate,Minor,Medical,Medicaid,,,,,false,51593.21,11949.46
Long Island,Nassau,2901000,000490,Glen Cove Hospital,50 to 69,117,F,White,Not Span/Hispanic,3,Emergency,Short-term Hospital,2019,INJ009,"SPINAL CORD INJURY (SCI), INITIAL ENCOUNTER",,,040,SPINAL DISORDERS & INJURIES,01,DISEASES AND DISORDERS OF THE NERVOUS SYSTEM,3,Major,Minor,Medical,Blue Cross/Blue Shield,,,,,true,45800.83,8733.85
Long Island,Nassau,2908000,000511,NYU Langone Hospital-Long Island,50 to 69,114,M,Black/African American,Not Span/Hispanic,5,Emergency,Skilled Nursing Home,2019,NVS020,OTHER SPECIFIED NERVOUS SYSTEM DISORDERS,,,040,SPINAL DISORDERS & INJURIES,01,DISEASES AND DISORDERS OF THE NERVOUS SYSTEM,2,Moderate,Minor,Medical,Private Health Insurance,Blue Cross/Blue Shield,,,,true,46939.22,10395.74
New York City,Manhattan,7002021,001454,Metropolitan Hospital Center,50 to 69,100,M,Black/African American,Not Span/Hispanic,1,Emergency,Left Against Medical Advice,2019,INJ073,"INJURY, SEQUELA",RHB001,"PHYSICAL, OCCUPATIONAL, AND RESPIRATORY THERAPY EVALUATION",040,SPINAL DISORDERS & INJURIES,01,DISEASES AND DISORDERS OF THE NERVOUS SYSTEM,2,Moderate,Minor,Medical,Medicaid,Medicaid,,,,true,7428.98,6002.24
Finger Lakes,Monroe,2754001,000471,The Unity Hospital of Rochester,30 to 49,145,M,White,Not Span/Hispanic,8,Urgent,Home w/ Home Health Services,2019,NVS008,PARALYSIS (OTHER THAN CEREBRAL PALSY),,,040,SPINAL DISORDERS & INJURIES,01,DISEASES AND DISORDERS OF THE NERVOUS SYSTEM,2,Moderate,Minor,Medical,Blue Cross/Blue Shield,,,,,false,29495.86,8672.47
New York City,Manhattan,7002053,001446,NYU Langone Orthopedic Hospital,30 to 49,,F,White,Unknown,29,Elective,Skilled Nursing Home,2019,NVS020,OTHER SPECIFIED NERVOUS SYSTEM DISORDERS,RHB002,"PHYSICAL, OCCUPATIONAL, AND RESPIRATORY THERAPY TREATMENT",040,SPINAL DISORDERS & INJURIES,01,DISEASES AND DISORDERS OF THE NERVOUS SYSTEM,3,Major,Moderate,Medical,Blue Cross/Blue Shield,,,,,false,343939.29,95872.08
New York City,Bronx,7000006,001169,Montefiore Medical Center - Henry & Lucy Moses Div,70 or Older,,M,Multi-racial,Spanish/Hispanic,16,Emergency,Home or Self Care,2019,NVS020,OTHER SPECIFIED NERVOUS SYSTEM DISORDERS,ADM017,ADMINISTRATION OF NUTRITIONAL AND ELECTROLYTIC SUBSTANCES,040,SPINAL DISORDERS & INJURIES,01,DISEASES AND DISORDERS OF THE NERVOUS SYSTEM,3,Major,Major,Medical,Medicare,,,,,true,180925.03,34335.39
Long Island,Nassau,2951001,000541,North Shore University Hospital,30 to 49,117,M,Black/African American,Not Span/Hispanic,2,Emergency,Home or Self Care,2019,NVS020,OTHER SPECIFIED NERVOUS SYSTEM DISORDERS,,,040,SPINAL DISORDERS & INJURIES,01,DISEASES AND DISORDERS OF THE NERVOUS SYSTEM,3,Major,Minor,Medical,Medicaid,Medicaid,,,,true,34224.93,5400.65
Western NY,Erie,1404000,000267,Kenmore Mercy Hospital,70 or Older,140,M,White,Not Span/Hispanic,16,Emergency,Skilled Nursing Home,2019,NVS020,OTHER SPECIFIED NERVOUS SYSTEM DISORDERS,,,040,SPINAL DISORDERS & INJURIES,01,DISEASES AND DISORDERS OF THE NERVOUS SYSTEM,3,Major,Moderate,Medical,Medicare,Medicare,,,,false,50910.24,19934.6
Western NY,Erie,1404000,000267,Kenmore Mercy Hospital,50 to 69,140,F,White,Not Span/Hispanic,20,Elective,Home w/ Home Health Services,2019,NVS020,OTHER SPECIFIED NERVOUS SYSTEM DISORDERS,,,040,SPINAL DISORDERS & INJURIES,01,DISEASES AND DISORDERS OF THE NERVOUS SYSTEM,2,Moderate,Minor,Medical,Private Health Insurance,,,,,false,62290.26,24325.71
Capital/Adirond,Otsego,3824000,000746,Mary Imogene Bassett Hospital,70 or Older,138,M,White,Not Span/Hispanic,5,Emergency,Skilled Nursing Home,2019,NVS020,OTHER SPECIFIED NERVOUS SYSTEM DISORDERS,,,040,SPINAL DISORDERS & INJURIES,01,DISEASES AND DISORDERS OF THE NERVOUS SYSTEM,2,Moderate,Moderate,Medical,Medicare,Private Health Insurance,,,,true,24758.58,13362.57
New York City,Queens,7003010,001637,New York - Presbyterian/Queens,70 or Older,113,M,White,Not Span/Hispanic,5,Emergency,Home w/ Home Health Services,2019,INJ009,"SPINAL CORD INJURY (SCI), INITIAL ENCOUNTER",IMG005,MAGNETIC RESONANCE IMAGING (MRI),040,SPINAL DISORDERS & INJURIES,01,DISEASES AND DISORDERS OF THE NERVOUS SYSTEM,3,Major,Moderate,Medical,Medicare,Private Health Insurance,Self-Pay,,,true,46250.13,12225.44
New York City,Bronx,7000006,003058,Montefiore Med Center - Jack D Weiler Hosp of A Einstein College Div,70 or Older,104,F,Black/African American,Not Span/Hispanic,14,Emergency,Home w/ Home Health Services,2019,SYM010,NERVOUS SYSTEM SIGNS AND SYMPTOMS,ADM021,"ADMINISTRATION OF THERAPEUTIC SUBSTANCES, NEC",040,SPINAL DISORDERS & INJURIES,01,DISEASES AND DISORDERS OF THE NERVOUS SYSTEM,2,Moderate,Moderate,Medical,Medicare,Private Health Insurance,,,,true,109679.96,22340.74
Long Island,Nassau,2953000,000563,St. Francis Hospital & Heart Center,50 to 69,115,F,Black/African American,Not Span/Hispanic,11,Emergency,Home or Self Care,2019,NVS020,OTHER SPECIFIED NERVOUS SYSTEM DISORDERS,EST001,PHERESIS THERAPY,040,SPINAL DISORDERS & INJURIES,01,DISEASES AND DISORDERS OF THE NERVOUS SYSTEM,1,Minor,Minor,Medical,Blue Cross/Blue Shield,,,,,true,88212,19604.36
New York City,Manhattan,7002054,001464,New York-Presbyterian Hospital - Columbia Presbyterian Center,70 or Older,OOS,F,Other Race,Not Span/Hispanic,4,Urgent,Inpatient Rehabilitation Facility,2019,NVS020,OTHER SPECIFIED NERVOUS SYSTEM DISORDERS,,,040,SPINAL DISORDERS & INJURIES,01,DISEASES AND DISORDERS OF THE NERVOUS SYSTEM,1,Minor,Minor,Medical,Medicare,Private Health Insurance,Self-Pay,,,false,69655.16,15746.58
New York City,Manhattan,7002054,001458,New York-Presbyterian Hospital - New York Weill Cornell Center,50 to 69,OOS,M,Other Race,Not Span/Hispanic,8,Elective,Inpatient Rehabilitation Facility,2019,NVS008,PARALYSIS (OTHER THAN CEREBRAL PALSY),MST028,"SUBCUTANEOUS TISSUE AND FASCIA PROCEDURES, NEC",040,SPINAL DISORDERS & INJURIES,01,DISEASES AND DISORDERS OF THE NERVOUS SYSTEM,2,Moderate,Moderate,Medical,Medicare,Blue Cross/Blue Shield,Self-Pay,,,false,193904.76,92924.43
Hudson Valley,Westchester,5902002,001046,Winifred Masterson Burke Rehabilitation Hospital,70 or Older,104,F,Black/African American,Not Span/Hispanic,17,Elective,Home or Self Care,2019,NVS020,OTHER SPECIFIED NERVOUS SYSTEM DISORDERS,,,040,SPINAL DISORDERS & INJURIES,01,DISEASES AND DISORDERS OF THE NERVOUS SYSTEM,2,Moderate,Moderate,Medical,Medicare,,,,,false,50769.77,22943.71
Long Island,Nassau,2951001,000541,North Shore University Hospital,50 to 69,110,F,Black/African American,Not Span/Hispanic,5,Emergency,Home or Self Care,2019,NVS020,OTHER SPECIFIED NERVOUS SYSTEM DISORDERS,CNS002,LUMBAR PUNCTURE,040,SPINAL DISORDERS & INJURIES,01,DISEASES AND DISORDERS OF THE NERVOUS SYSTEM,1,Minor,Minor,Medical,Private Health Insurance,,,,,true,99296.56,14783.87
New York City,Richmond,7004003,001740,Staten Island University Hosp-North,70 or Older,103,M,White,Not Span/Hispanic,14,Emergency,Inpatient Rehabilitation Facility,2019,INJ009,"SPINAL CORD INJURY (SCI), INITIAL ENCOUNTER",,,040,SPINAL DISORDERS & INJURIES,01,DISEASES AND DISORDERS OF THE NERVOUS SYSTEM,3,Major,Major,Medical,Miscellaneous/Other,Medicare,Medicare,,,true,97180.71,23829.47
New York City,Manhattan,7002024,001456,Mount Sinai Hospital,50 to 69,104,M,Other Race,Not Span/Hispanic,13,Urgent,Home w/ Home Health Services,2019,NVS020,OTHER SPECIFIED NERVOUS SYSTEM DISORDERS,RHB002,"PHYSICAL, OCCUPATIONAL, AND RESPIRATORY THERAPY TREATMENT",040,SPINAL DISORDERS & INJURIES,01,DISEASES AND DISORDERS OF THE NERVOUS SYSTEM,2,Moderate,Minor,Medical,Medicaid,Medicaid,Self-Pay,,,false,94894.57,31812.07
Long Island,Nassau,2951001,000541,North Shore University Hospital,50 to 69,119,M,White,Not Span/Hispanic,2,Trauma,Home w/ Home Health Services,2019,INJ009,"SPINAL CORD INJURY (SCI), INITIAL ENCOUNTER",,,040,SPINAL DISORDERS & INJURIES,01,DISEASES AND DISORDERS OF THE NERVOUS SYSTEM,1,Minor,Minor,Medical,Medicare,,,,,true,49406.18,9791.86
New York City,Bronx,7000002,001165,Jacobi Medical Center,50 to 69,100,M,Other Race,Spanish/Hispanic,7,Emergency,Home or Self Care,2019,INJ009,"SPINAL CORD INJURY (SCI), INITIAL ENCOUNTER",,,040,SPINAL DISORDERS & INJURIES,01,DISEASES AND DISORDERS OF THE NERVOUS SYSTEM,3,Major,Minor,Medical,Medicare,Medicaid,,,,true,51800.61,30647.83