Hospital Service Area,Hospital County,Operating Certificate Number,Permanent Facility Id,Facility Name,Age Group,Zip Code - 3 digits,Gender,Race,Ethnicity,Length of Stay,Type of Admission,Patient Disposition,Discharge Year,CCS Diagnosis Code,CCS Diagnosis Description,CCS Procedure Code,CCS Procedure Description,APR DRG Code,APR DRG Description,APR MDC Code,APR MDC Description,APR Severity of Illness Code,APR Severity of Illness Description,APR Risk of Mortality,APR Medical Surgical Description,Payment Typology 1,Payment Typology 2,Payment Typology 3,Birth Weight,Abortion Edit Indicator,Emergency Department Indicator,Total Charges,Total Costs
New York City,Manhattan,7002053,001463,NYU Langone Hospitals,50 to 69,OOS,F,Black/African American,Spanish/Hispanic,7,Emergency,Inpatient Rehabilitation Facility,2020,NVS008,PARALYSIS (OTHER THAN CEREBRAL PALSY),ADM003,ADMINISTRATION OF ALBUMIN AND GLOBULIN,040,SPINAL DISORDERS & INJURIES,01,DISEASES AND DISORDERS OF THE NERVOUS SYSTEM,2,Moderate,Minor,Medical,Private Health Insurance,,,,,N,199342.53,39939.13
New York City,Manhattan,7002053,001463,NYU Langone Hospitals,70 or Older,100,F,White,Not Span/Hispanic,17,Emergency,Hospice - Medical Facility,2020,NVS020,OTHER SPECIFIED NERVOUS SYSTEM DISORDERS,RES005,CHEST TUBE PLACEMENT AND THERAPEUTIC THORACENTESIS,040,SPINAL DISORDERS & INJURIES,01,DISEASES AND DISORDERS OF THE NERVOUS SYSTEM,3,Major,Major,Medical,Medicare,Blue Cross/Blue Shield,,,,Y,388425.21,97823.91
New York City,Manhattan,7002053,001463,NYU Langone Hospitals,50 to 69,100,F,White,Not Span/Hispanic,3,Emergency,Home or Self Care,2020,NVS020,OTHER SPECIFIED NERVOUS SYSTEM DISORDERS,CNS002,LUMBAR PUNCTURE,040,SPINAL DISORDERS & INJURIES,01,DISEASES AND DISORDERS OF THE NERVOUS SYSTEM,1,Minor,Minor,Medical,Private Health Insurance,,,,,Y,92154.06,18153.14
New York City,Manhattan,7002053,001463,NYU Langone Hospitals,70 or Older,OOS,F,White,Not Span/Hispanic,14,Emergency,Inpatient Rehabilitation Facility,2020,NVS020,OTHER SPECIFIED NERVOUS SYSTEM DISORDERS,EST001,PHERESIS THERAPY,040,SPINAL DISORDERS & INJURIES,01,DISEASES AND DISORDERS OF THE NERVOUS SYSTEM,2,Moderate,Minor,Medical,Medicare,,,,,Y,354250.27,86526.45
New York City,Manhattan,7002053,001463,NYU Langone Hospitals,70 or Older,112,F,Black/African American,Not Span/Hispanic,4,Emergency,Home or Self Care,2020,NVS008,PARALYSIS (OTHER THAN CEREBRAL PALSY),ADM003,ADMINISTRATION OF ALBUMIN AND GLOBULIN,040,SPINAL DISORDERS & INJURIES,01,DISEASES AND DISORDERS OF THE NERVOUS SYSTEM,3,Major,Moderate,Medical,Medicare,,,,,N,171139.47,24843.37
New York City,Manhattan,7002053,001463,NYU Langone Hospitals,50 to 69,112,F,Black/African American,Not Span/Hispanic,9,Emergency,Inpatient Rehabilitation Facility,2020,NVS020,OTHER SPECIFIED NERVOUS SYSTEM DISORDERS,CAR024,VENOUS AND ARTERIAL CATHETER PLACEMENT,040,SPINAL DISORDERS & INJURIES,01,DISEASES AND DISORDERS OF THE NERVOUS SYSTEM,2,Moderate,Moderate,Medical,Medicaid,,,,,Y,208905.94,50102.96
New York City,Manhattan,7002053,001463,NYU Langone Hospitals,50 to 69,100,F,Other Race,Spanish/Hispanic,2,Emergency,Home or Self Care,2020,NVS020,OTHER SPECIFIED NERVOUS SYSTEM DISORDERS,,,040,SPINAL DISORDERS & INJURIES,01,DISEASES AND DISORDERS OF THE NERVOUS SYSTEM,1,Minor,Minor,Medical,Medicare,Medicaid,,,,N,68279.78,12273.25
New York City,Manhattan,7002053,001463,NYU Langone Hospitals,30 to 49,103,F,White,Not Span/Hispanic,3,Emergency,Skilled Nursing Home,2020,NVS008,PARALYSIS (OTHER THAN CEREBRAL PALSY),,,040,SPINAL DISORDERS & INJURIES,01,DISEASES AND DISORDERS OF THE NERVOUS SYSTEM,1,Minor,Minor,Medical,Medicare,Medicaid,,,,Y,92399.05,26973.53
