Hospital Service Area,Hospital County,Operating Certificate Number,Permanent Facility Id,Facility Name,Age Group,Zip Code - 3 digits,Gender,Race,Ethnicity,Length of Stay,Type of Admission,Patient Disposition,Discharge Year,CCS Diagnosis Code,CCS Diagnosis Description,CCS Procedure Code,CCS Procedure Description,APR DRG Code,APR DRG Description,APR MDC Code,APR MDC Description,APR Severity of Illness Code,APR Severity of Illness Description,APR Risk of Mortality,APR Medical Surgical Description,Payment Typology 1,Payment Typology 2,Payment Typology 3,Birth Weight,Abortion Edit Indicator,Emergency Department Indicator,Total Charges,Total Costs
Long Island,Nassau,2908000,000511,NYU Langone Hospital-Long Island,70 or Older,110,F,White,Not Span/Hispanic,10,Emergency,Home w/ Home Health Services,2020,NVS020,OTHER SPECIFIED NERVOUS SYSTEM DISORDERS,RAD001,BEAM RADIATION,040,SPINAL DISORDERS & INJURIES,01,DISEASES AND DISORDERS OF THE NERVOUS SYSTEM,2,Moderate,Major,Medical,Medicare,Medicaid,,,,Y,151804.91,46580.67
Long Island,Nassau,2908000,000511,NYU Langone Hospital-Long Island,70 or Older,115,M,White,Not Span/Hispanic,9,Urgent,Inpatient Rehabilitation Facility,2020,NVS020,OTHER SPECIFIED NERVOUS SYSTEM DISORDERS,ADM006,INFUSION OF VASOPRESSOR,040,SPINAL DISORDERS & INJURIES,01,DISEASES AND DISORDERS OF THE NERVOUS SYSTEM,3,Major,Major,Medical,Medicare,Medicare,,,,N,191865.75,59943.4
Long Island,Nassau,2908000,000511,NYU Langone Hospital-Long Island,18 to 29,117,M,White,Not Span/Hispanic,1,Elective,Home or Self Care,2020,NVS008,PARALYSIS (OTHER THAN CEREBRAL PALSY),CNS013,SPINAL EPIDURAL CATHETER PLACEMENT,040,SPINAL DISORDERS & INJURIES,01,DISEASES AND DISORDERS OF THE NERVOUS SYSTEM,1,Minor,Minor,Medical,Private Health Insurance,,,,,N,178800.45,29247.2
Long Island,Nassau,2908000,000511,NYU Langone Hospital-Long Island,70 or Older,115,M,White,Not Span/Hispanic,3,Emergency,Inpatient Rehabilitation Facility,2020,NVS020,OTHER SPECIFIED NERVOUS SYSTEM DISORDERS,,,040,SPINAL DISORDERS & INJURIES,01,DISEASES AND DISORDERS OF THE NERVOUS SYSTEM,3,Major,Major,Medical,Medicare,Medicare,,,,Y,62018.8,16078.08
Long Island,Nassau,2908000,000511,NYU Langone Hospital-Long Island,18 to 29,115,F,Black/African American,Not Span/Hispanic,3,Emergency,Home or Self Care,2020,NVS020,OTHER SPECIFIED NERVOUS SYSTEM DISORDERS,CNS002,LUMBAR PUNCTURE,040,SPINAL DISORDERS & INJURIES,01,DISEASES AND DISORDERS OF THE NERVOUS SYSTEM,1,Minor,Minor,Medical,Medicaid,,,,,Y,114202.66,20487.76
Long Island,Nassau,2908000,000511,NYU Langone Hospital-Long Island,50 to 69,115,F,White,Unknown,6,Emergency,Home w/ Home Health Services,2020,NVS020,OTHER SPECIFIED NERVOUS SYSTEM DISORDERS,CNS002,LUMBAR PUNCTURE,040,SPINAL DISORDERS & INJURIES,01,DISEASES AND DISORDERS OF THE NERVOUS SYSTEM,2,Moderate,Moderate,Medical,Medicare,Blue Cross/Blue Shield,,,,Y,208191.35,40716.81
Long Island,Nassau,2908000,000511,NYU Langone Hospital-Long Island,70 or Older,115,M,White,Not Span/Hispanic,3,Emergency,Home or Self Care,2020,INJ009,"SPINAL CORD INJURY (SCI), INITIAL ENCOUNTER",ADM001,TRANSFUSION OF BLOOD AND BLOOD PRODUCTS,040,SPINAL DISORDERS & INJURIES,01,DISEASES AND DISORDERS OF THE NERVOUS SYSTEM,3,Major,Moderate,Medical,Medicare,,,,,Y,129235.89,27844.82
Long Island,Nassau,2908000,000511,NYU Langone Hospital-Long Island,30 to 49,115,M,Other Race,Spanish/Hispanic,3,Trauma,Home or Self Care,2020,INJ009,"SPINAL CORD INJURY (SCI), INITIAL ENCOUNTER",,,040,SPINAL DISORDERS & INJURIES,01,DISEASES AND DISORDERS OF THE NERVOUS SYSTEM,2,Moderate,Moderate,Medical,Miscellaneous/Other,,,,,Y,105165.25,17095.2
Long Island,Nassau,2908000,000511,NYU Langone Hospital-Long Island,50 to 69,115,F,Black/African American,Not Span/Hispanic,8,Emergency,Inpatient Rehabilitation Facility,2020,INJ009,"SPINAL CORD INJURY (SCI), INITIAL ENCOUNTER",,,040,SPINAL DISORDERS & INJURIES,01,DISEASES AND DISORDERS OF THE NERVOUS SYSTEM,3,Major,Moderate,Medical,Medicare,Blue Cross/Blue Shield,,,,Y,158919.31,54841.68
Long Island,Nassau,2908000,000511,NYU Langone Hospital-Long Island,70 or Older,115,M,White,Not Span/Hispanic,2,Emergency,Short-term Hospital,2020,INJ009,"SPINAL CORD INJURY (SCI), INITIAL ENCOUNTER",MAM011,ELECTROENCEPHALOGRAM (EEG),040,SPINAL DISORDERS & INJURIES,01,DISEASES AND DISORDERS OF THE NERVOUS SYSTEM,2,Moderate,Minor,Medical,Medicare,Blue Cross/Blue Shield,,,,Y,81063.8,13606.42
