Hospital Service Area,Hospital County,Operating Certificate Number,Permanent Facility Id,Facility Name,Age Group,Zip Code - 3 digits,Gender,Race,Ethnicity,Length of Stay,Type of Admission,Patient Disposition,Discharge Year,CCS Diagnosis Code,CCS Diagnosis Description,CCS Procedure Code,CCS Procedure Description,APR DRG Code,APR DRG Description,APR MDC Code,APR MDC Description,APR Severity of Illness Code,APR Severity of Illness Description,APR Risk of Mortality,APR Medical Surgical Description,Payment Typology 1,Payment Typology 2,Payment Typology 3,Birth Weight,Abortion Edit Indicator,Emergency Department Indicator,Total Charges,Total Costs
New York City,Manhattan,7002032,001466,Mount Sinai West,50 to 69,113,F,Other Race,Not Span/Hispanic,4,Emergency,Home or Self Care,2017,047,Other and unspecified benign neoplasm,012,OT THER ENDOCRINE PRCS,401,Pituitary & adrenal procedures,10,"Endocrine, Nutritional and Metabolic Diseases and Disorders",3,Major,Minor,Surgical,Medicaid,Self-Pay,,,N,Y,72184.04,24963.61
New York City,Bronx,7000006,001169,Montefiore Medical Center - Henry & Lucy Moses Div,18 to 29,104,F,Other Race,Spanish/Hispanic,3,Elective,Home or Self Care,2017,047,Other and unspecified benign neoplasm,012,OT THER ENDOCRINE PRCS,401,Pituitary & adrenal procedures,10,"Endocrine, Nutritional and Metabolic Diseases and Disorders",1,Minor,Minor,Surgical,Private Health Insurance,,,,N,N,70237.72,12691.26
New York City,Manhattan,7002002,001439,Mount Sinai Beth Israel,70 or Older,111,M,White,Not Span/Hispanic,1,Elective,Home or Self Care,2017,047,Other and unspecified benign neoplasm,012,OT THER ENDOCRINE PRCS,401,Pituitary & adrenal procedures,10,"Endocrine, Nutritional and Metabolic Diseases and Disorders",1,Minor,Minor,Surgical,Medicare,Blue Cross/Blue Shield,Self-Pay,,N,N,40001.94,13323.88
New York City,Manhattan,7002024,001456,Mount Sinai Hospital,50 to 69,104,M,Black/African American,Not Span/Hispanic,57,Emergency,Inpatient Rehabilitation Facility,2017,047,Other and unspecified benign neoplasm,001,INCISION & EXCISION CNS,401,Pituitary & adrenal procedures,10,"Endocrine, Nutritional and Metabolic Diseases and Disorders",4,Extreme,Major,Surgical,"Managed Care, Unspecified",Medicaid,Self-Pay,,N,Y,775398.55,290577.28
New York City,Manhattan,7002002,001439,Mount Sinai Beth Israel,50 to 69,112,M,Other Race,Not Span/Hispanic,1,Elective,Home or Self Care,2017,044,Neoplasms of unspecified nature or uncertain behavior,012,OT THER ENDOCRINE PRCS,401,Pituitary & adrenal procedures,10,"Endocrine, Nutritional and Metabolic Diseases and Disorders",1,Minor,Minor,Surgical,Medicaid,Medicaid,Self-Pay,,N,N,39047.73,11730.06
New York City,Manhattan,7002024,001456,Mount Sinai Hospital,18 to 29,104,F,Other Race,Not Span/Hispanic,2,Elective,Home or Self Care,2017,047,Other and unspecified benign neoplasm,009,OTHER OR THER NERV SYS,401,Pituitary & adrenal procedures,10,"Endocrine, Nutritional and Metabolic Diseases and Disorders",2,Moderate,Moderate,Surgical,Medicaid,Medicaid,Self-Pay,,N,N,31337.66,11765.14
New York City,Manhattan,7002024,001456,Mount Sinai Hospital,18 to 29,112,F,White,Not Span/Hispanic,2,Elective,Home or Self Care,2017,047,Other and unspecified benign neoplasm,175,OT OR THER PRC SKN/BRST,401,Pituitary & adrenal procedures,10,"Endocrine, Nutritional and Metabolic Diseases and Disorders",2,Moderate,Minor,Surgical,Private Health Insurance,Self-Pay,,,N,N,31772.45,11918.97
New York City,Manhattan,7002024,001456,Mount Sinai Hospital,50 to 69,113,F,White,Not Span/Hispanic,2,Elective,Home or Self Care,2017,047,Other and unspecified benign neoplasm,175,OT OR THER PRC SKN/BRST,401,Pituitary & adrenal procedures,10,"Endocrine, Nutritional and Metabolic Diseases and Disorders",3,Major,Moderate,Surgical,Blue Cross/Blue Shield,Medicare,Self-Pay,,N,N,32852.36,12507.05
New York City,Manhattan,7002024,001456,Mount Sinai Hospital,50 to 69,112,M,Black/African American,Not Span/Hispanic,1,Elective,Home or Self Care,2017,047,Other and unspecified benign neoplasm,012,OT THER ENDOCRINE PRCS,401,Pituitary & adrenal procedures,10,"Endocrine, Nutritional and Metabolic Diseases and Disorders",1,Minor,Minor,Surgical,Private Health Insurance,Self-Pay,,,N,N,22384.84,8613.16
New York City,Manhattan,7002024,001456,Mount Sinai Hospital,30 to 49,117,F,Other Race,Not Span/Hispanic,2,Elective,Home or Self Care,2017,047,Other and unspecified benign neoplasm,012,OT THER ENDOCRINE PRCS,401,Pituitary & adrenal procedures,10,"Endocrine, Nutritional and Metabolic Diseases and Disorders",2,Moderate,Minor,Surgical,Blue Cross/Blue Shield,Self-Pay,,,N,N,29615.33,11203.90
New York City,Manhattan,7002024,001456,Mount Sinai Hospital,50 to 69,OOS,F,White,Not Span/Hispanic,3,Elective,Home or Self Care,2017,047,Other and unspecified benign neoplasm,198,MAG RESONANCE IMAGING,401,Pituitary & adrenal procedures,10,"Endocrine, Nutritional and Metabolic Diseases and Disorders",2,Moderate,Moderate,Surgical,Medicare,Private Health Insurance,Self-Pay,,N,N,57705.79,20592.14
New York City,Manhattan,7002032,001466,Mount Sinai West,18 to 29,104,F,White,Spanish/Hispanic,2,Elective,Home or Self Care,2017,047,Other and unspecified benign neoplasm,012,OT THER ENDOCRINE PRCS,401,Pituitary & adrenal procedures,10,"Endocrine, Nutritional and Metabolic Diseases and Disorders",2,Moderate,Moderate,Surgical,Private Health Insurance,Medicaid,Self-Pay,,N,N,44058.42,16486.65
New York City,Kings,7001021,001306,New York - Presbyterian Brooklyn Methodist Hospital,18 to 29,112,F,Other Race,Not Span/Hispanic,3,Elective,Home or Self Care,2017,047,Other and unspecified benign neoplasm,011,DX ENDOCRINE PRCS,401,Pituitary & adrenal procedures,10,"Endocrine, Nutritional and Metabolic Diseases and Disorders",2,Moderate,Moderate,Surgical,Medicaid,Medicaid,Self-Pay,,N,N,41619.34,18835.18
New York City,Kings,7001021,001306,New York - Presbyterian Brooklyn Methodist Hospital,50 to 69,112,F,Black/African American,Not Span/Hispanic,6,Elective,Home or Self Care,2017,047,Other and unspecified benign neoplasm,012,OT THER ENDOCRINE PRCS,401,Pituitary & adrenal procedures,10,"Endocrine, Nutritional and Metabolic Diseases and Disorders",3,Major,Major,Surgical,Private Health Insurance,,,,N,N,60572.69,26440.47
New York City,Kings,7001021,001306,New York - Presbyterian Brooklyn Methodist Hospital,30 to 49,112,F,Black/African American,Not Span/Hispanic,1,Elective,Home or Self Care,2017,051,Other endocrine disorders,012,OT THER ENDOCRINE PRCS,401,Pituitary & adrenal procedures,10,"Endocrine, Nutritional and Metabolic Diseases and Disorders",1,Minor,Minor,Surgical,Blue Cross/Blue Shield,Self-Pay,,,N,N,27441.72,14353.96
New York City,Manhattan,7002024,001456,Mount Sinai Hospital,50 to 69,117,F,White,Not Span/Hispanic,19,Elective,Inpatient Rehabilitation Facility,2017,044,Neoplasms of unspecified nature or uncertain behavior,012,OT THER ENDOCRINE PRCS,401,Pituitary & adrenal procedures,10,"Endocrine, Nutritional and Metabolic Diseases and Disorders",3,Major,Major,Surgical,Blue Cross/Blue Shield,Self-Pay,,,N,N,276903.47,101466.58
New York City,Manhattan,7002024,001456,Mount Sinai Hospital,30 to 49,104,F,Other Race,Not Span/Hispanic,1,Urgent,Home or Self Care,2017,047,Other and unspecified benign neoplasm,012,OT THER ENDOCRINE PRCS,401,Pituitary & adrenal procedures,10,"Endocrine, Nutritional and Metabolic Diseases and Disorders",1,Minor,Minor,Surgical,Blue Cross/Blue Shield,Self-Pay,,,N,N,20974.26,9050.37
New York City,Manhattan,7002054,001458,New York Presbyterian Hospital - New York Weill Cornell Center,50 to 69,OOS,M,Other Race,Not Span/Hispanic,2,Elective,Home or Self Care,2017,047,Other and unspecified benign neoplasm,012,OT THER ENDOCRINE PRCS,401,Pituitary & adrenal procedures,10,"Endocrine, Nutritional and Metabolic Diseases and Disorders",1,Minor,Minor,Surgical,Blue Cross/Blue Shield,Self-Pay,,,N,N,40518.79,12575.93
New York City,Manhattan,7002054,001458,New York Presbyterian Hospital - New York Weill Cornell Center,50 to 69,OOS,F,Other Race,Not Span/Hispanic,6,Emergency,Home or Self Care,2017,047,Other and unspecified benign neoplasm,001,INCISION & EXCISION CNS,401,Pituitary & adrenal procedures,10,"Endocrine, Nutritional and Metabolic Diseases and Disorders",2,Moderate,Minor,Surgical,Blue Cross/Blue Shield,Self-Pay,,,N,N,109628.02,31745.53
New York City,Manhattan,7002054,001458,New York Presbyterian Hospital - New York Weill Cornell Center,50 to 69,107,F,White,Not Span/Hispanic,3,Elective,Home or Self Care,2017,047,Other and unspecified benign neoplasm,012,OT THER ENDOCRINE PRCS,401,Pituitary & adrenal procedures,10,"Endocrine, Nutritional and Metabolic Diseases and Disorders",2,Moderate,Minor,Surgical,Blue Cross/Blue Shield,Self-Pay,,,N,N,78845.18,26176.22
New York City,Manhattan,7002054,001458,New York Presbyterian Hospital - New York Weill Cornell Center,50 to 69,112,F,White,Not Span/Hispanic,5,Emergency,Home or Self Care,2017,047,Other and unspecified benign neoplasm,012,OT THER ENDOCRINE PRCS,401,Pituitary & adrenal procedures,10,"Endocrine, Nutritional and Metabolic Diseases and Disorders",2,Moderate,Moderate,Surgical,Medicaid,Medicaid,Self-Pay,,N,Y,133587.01,64635.80
New York City,Manhattan,7002054,001464,New York Presbyterian Hospital - Columbia Presbyterian Center,70 or Older,OOS,F,White,Not Span/Hispanic,6,Elective,Home or Self Care,2017,047,Other and unspecified benign neoplasm,012,OT THER ENDOCRINE PRCS,401,Pituitary & adrenal procedures,10,"Endocrine, Nutritional and Metabolic Diseases and Disorders",1,Minor,Major,Surgical,Medicare,Blue Cross/Blue Shield,Self-Pay,,N,N,132081.43,72415.26
New York City,Manhattan,7002054,001464,New York Presbyterian Hospital - Columbia Presbyterian Center,50 to 69,104,M,Other Race,Spanish/Hispanic,6,Emergency,Home or Self Care,2017,047,Other and unspecified benign neoplasm,011,DX ENDOCRINE PRCS,401,Pituitary & adrenal procedures,10,"Endocrine, Nutritional and Metabolic Diseases and Disorders",3,Major,Moderate,Surgical,Blue Cross/Blue Shield,Self-Pay,,,N,Y,93005.34,25979.60
New York City,Manhattan,7002032,001469,Mount Sinai St. Luke's,50 to 69,100,F,Black/African American,Spanish/Hispanic,9,Emergency,Home or Self Care,2017,047,Other and unspecified benign neoplasm,012,OT THER ENDOCRINE PRCS,401,Pituitary & adrenal procedures,10,"Endocrine, Nutritional and Metabolic Diseases and Disorders",1,Minor,Minor,Surgical,Medicaid,Self-Pay,,,N,Y,97245.21,31240.81
New York City,Queens,7003010,001637,New York - Presbyterian/Queens,30 to 49,114,M,Black/African American,Not Span/Hispanic,2,Elective,Home or Self Care,2017,047,Other and unspecified benign neoplasm,012,OT THER ENDOCRINE PRCS,401,Pituitary & adrenal procedures,10,"Endocrine, Nutritional and Metabolic Diseases and Disorders",1,Minor,Minor,Surgical,Private Health Insurance,Self-Pay,,,N,N,13455.33,3800.79
Hudson Valley,Rockland,4329000,000779,Good Samaritan Hospital of Suffern,50 to 69,127,M,White,Not Span/Hispanic,2,Elective,Home or Self Care,2017,047,Other and unspecified benign neoplasm,012,OT THER ENDOCRINE PRCS,401,Pituitary & adrenal procedures,10,"Endocrine, Nutritional and Metabolic Diseases and Disorders",1,Minor,Minor,Surgical,Blue Cross/Blue Shield,,,,N,N,99697.44,23915.67
New York City,Manhattan,7002024,001456,Mount Sinai Hospital,70 or Older,112,M,Other Race,Not Span/Hispanic,2,Elective,Home or Self Care,2017,047,Other and unspecified benign neoplasm,012,OT THER ENDOCRINE PRCS,401,Pituitary & adrenal procedures,10,"Endocrine, Nutritional and Metabolic Diseases and Disorders",1,Minor,Moderate,Surgical,Medicare,Medicare,Medicaid,,N,N,41163.29,15050.54
New York City,Manhattan,7002024,001456,Mount Sinai Hospital,70 or Older,100,F,White,Not Span/Hispanic,16,Elective,Skilled Nursing Home,2017,047,Other and unspecified benign neoplasm,012,OT THER ENDOCRINE PRCS,401,Pituitary & adrenal procedures,10,"Endocrine, Nutritional and Metabolic Diseases and Disorders",3,Major,Major,Surgical,Medicare,Medicare,Self-Pay,,N,N,171407.87,51629.63
New York City,Manhattan,7002024,001456,Mount Sinai Hospital,50 to 69,OOS,M,White,Not Span/Hispanic,2,Elective,Home or Self Care,2017,047,Other and unspecified benign neoplasm,012,OT THER ENDOCRINE PRCS,401,Pituitary & adrenal procedures,10,"Endocrine, Nutritional and Metabolic Diseases and Disorders",2,Moderate,Minor,Surgical,Blue Cross/Blue Shield,Medicare,Blue Cross/Blue Shield,,N,N,33700.51,12021.16
New York City,Manhattan,7002024,001456,Mount Sinai Hospital,50 to 69,112,F,Other Race,Not Span/Hispanic,1,Elective,Home or Self Care,2017,047,Other and unspecified benign neoplasm,012,OT THER ENDOCRINE PRCS,401,Pituitary & adrenal procedures,10,"Endocrine, Nutritional and Metabolic Diseases and Disorders",1,Minor,Minor,Surgical,Private Health Insurance,Self-Pay,,,N,N,27577.95,10593.39
New York City,Manhattan,7002024,001456,Mount Sinai Hospital,18 to 29,100,F,Black/African American,Not Span/Hispanic,2,Elective,Home or Self Care,2017,047,Other and unspecified benign neoplasm,012,OT THER ENDOCRINE PRCS,401,Pituitary & adrenal procedures,10,"Endocrine, Nutritional and Metabolic Diseases and Disorders",2,Moderate,Minor,Surgical,Blue Cross/Blue Shield,Self-Pay,,,N,N,30657.96,12554.51
New York City,Manhattan,7002024,001456,Mount Sinai Hospital,50 to 69,109,F,Black/African American,Not Span/Hispanic,4,Urgent,Home or Self Care,2017,047,Other and unspecified benign neoplasm,012,OT THER ENDOCRINE PRCS,401,Pituitary & adrenal procedures,10,"Endocrine, Nutritional and Metabolic Diseases and Disorders",2,Moderate,Minor,Surgical,Medicare,Blue Cross/Blue Shield,Self-Pay,,N,N,47949.01,16206.55
New York City,Manhattan,7002024,001456,Mount Sinai Hospital,18 to 29,100,F,Other Race,Not Span/Hispanic,1,Elective,Home or Self Care,2017,051,Other endocrine disorders,012,OT THER ENDOCRINE PRCS,401,Pituitary & adrenal procedures,10,"Endocrine, Nutritional and Metabolic Diseases and Disorders",1,Minor,Minor,Surgical,Medicaid,Medicaid,Self-Pay,,N,N,18527.08,7776.32
New York City,Manhattan,7002053,001463,NYU Langone Hospitals,70 or Older,109,F,Other Race,Not Span/Hispanic,2,Elective,Skilled Nursing Home,2017,041,Cancer; other and unspecified primary,012,OT THER ENDOCRINE PRCS,401,Pituitary & adrenal procedures,10,"Endocrine, Nutritional and Metabolic Diseases and Disorders",1,Minor,Moderate,Surgical,Private Health Insurance,,,,N,N,96405.80,27012.92
New York City,Manhattan,7002053,001463,NYU Langone Hospitals,70 or Older,112,F,White,Not Span/Hispanic,5,Elective,Home or Self Care,2017,047,Other and unspecified benign neoplasm,012,OT THER ENDOCRINE PRCS,401,Pituitary & adrenal procedures,10,"Endocrine, Nutritional and Metabolic Diseases and Disorders",2,Moderate,Moderate,Surgical,Medicare,,,,N,N,127985.84,32330.59
New York City,Manhattan,7002032,001466,Mount Sinai West,18 to 29,100,F,Black/African American,Not Span/Hispanic,2,Elective,Home or Self Care,2017,047,Other and unspecified benign neoplasm,012,OT THER ENDOCRINE PRCS,401,Pituitary & adrenal procedures,10,"Endocrine, Nutritional and Metabolic Diseases and Disorders",1,Minor,Minor,Surgical,Blue Cross/Blue Shield,Self-Pay,,,N,N,54381.90,20623.22
Western NY,Erie,1401014,000207,Buffalo General Medical Center,30 to 49,147,M,White,Not Span/Hispanic,2,Elective,Home or Self Care,2017,047,Other and unspecified benign neoplasm,012,OT THER ENDOCRINE PRCS,401,Pituitary & adrenal procedures,10,"Endocrine, Nutritional and Metabolic Diseases and Disorders",1,Minor,Minor,Surgical,Blue Cross/Blue Shield,Self-Pay,,,N,N,26276.10,9063.34
Western NY,Erie,1401014,000207,Buffalo General Medical Center,30 to 49,143,F,White,Not Span/Hispanic,6,Elective,Home or Self Care,2017,047,Other and unspecified benign neoplasm,012,OT THER ENDOCRINE PRCS,401,Pituitary & adrenal procedures,10,"Endocrine, Nutritional and Metabolic Diseases and Disorders",3,Major,Moderate,Surgical,Medicaid,Self-Pay,,,N,N,55670.47,18054.56
Western NY,Erie,1401014,000207,Buffalo General Medical Center,70 or Older,141,F,White,Not Span/Hispanic,2,Elective,Home or Self Care,2017,047,Other and unspecified benign neoplasm,012,OT THER ENDOCRINE PRCS,401,Pituitary & adrenal procedures,10,"Endocrine, Nutritional and Metabolic Diseases and Disorders",2,Moderate,Moderate,Surgical,Medicare,Self-Pay,,,N,N,38110.37,13003.73
Western NY,Erie,1401014,003067,Millard Fillmore Suburban Hospital,50 to 69,141,F,White,Not Span/Hispanic,2,Elective,Home w/ Home Health Services,2017,047,Other and unspecified benign neoplasm,012,OT THER ENDOCRINE PRCS,401,Pituitary & adrenal procedures,10,"Endocrine, Nutritional and Metabolic Diseases and Disorders",2,Moderate,Major,Surgical,Medicare,Medicaid,Self-Pay,,N,N,32884.09,10467.22
Western NY,Erie,1401014,003067,Millard Fillmore Suburban Hospital,50 to 69,142,F,White,Not Span/Hispanic,6,Elective,Home or Self Care,2017,047,Other and unspecified benign neoplasm,012,OT THER ENDOCRINE PRCS,401,Pituitary & adrenal procedures,10,"Endocrine, Nutritional and Metabolic Diseases and Disorders",3,Major,Major,Surgical,Private Health Insurance,Self-Pay,,,N,N,88094.03,27696.92
New York City,Bronx,7000006,001169,Montefiore Medical Center - Henry & Lucy Moses Div,50 to 69,105,F,Other Race,Not Span/Hispanic,4,Elective,Home or Self Care,2017,047,Other and unspecified benign neoplasm,012,OT THER ENDOCRINE PRCS,401,Pituitary & adrenal procedures,10,"Endocrine, Nutritional and Metabolic Diseases and Disorders",2,Moderate,Moderate,Surgical,Private Health Insurance,,,,N,N,96488.41,18397.34
New York City,Kings,7001033,001315,Kingsbrook Jewish Medical Center,70 or Older,112,M,Multi-racial,Not Span/Hispanic,8,Urgent,Home w/ Home Health Services,2017,047,Other and unspecified benign neoplasm,012,OT THER ENDOCRINE PRCS,401,Pituitary & adrenal procedures,10,"Endocrine, Nutritional and Metabolic Diseases and Disorders",2,Moderate,Moderate,Surgical,Medicare,Medicare,Self-Pay,,N,N,111361.00,35448.99
New York City,Manhattan,7002024,001456,Mount Sinai Hospital,50 to 69,113,M,Other Race,Not Span/Hispanic,2,Elective,Home or Self Care,2017,047,Other and unspecified benign neoplasm,012,OT THER ENDOCRINE PRCS,401,Pituitary & adrenal procedures,10,"Endocrine, Nutritional and Metabolic Diseases and Disorders",1,Minor,Minor,Surgical,Medicaid,Medicaid,Self-Pay,,N,N,37113.78,14902.65
New York City,Manhattan,7002024,001456,Mount Sinai Hospital,50 to 69,104,F,Black/African American,Not Span/Hispanic,1,Elective,Home or Self Care,2017,047,Other and unspecified benign neoplasm,012,OT THER ENDOCRINE PRCS,401,Pituitary & adrenal procedures,10,"Endocrine, Nutritional and Metabolic Diseases and Disorders",1,Minor,Minor,Surgical,Private Health Insurance,Self-Pay,,,N,N,28930.81,11373.74
New York City,Manhattan,7002024,001456,Mount Sinai Hospital,50 to 69,100,M,White,Not Span/Hispanic,1,Elective,Home or Self Care,2017,047,Other and unspecified benign neoplasm,012,OT THER ENDOCRINE PRCS,401,Pituitary & adrenal procedures,10,"Endocrine, Nutritional and Metabolic Diseases and Disorders",2,Moderate,Minor,Surgical,Private Health Insurance,Self-Pay,,,N,N,35252.78,13377.07
New York City,Richmond,7004003,001740,Staten Island University Hosp-North,50 to 69,103,M,Black/African American,Not Span/Hispanic,20,Urgent,Inpatient Rehabilitation Facility,2017,047,Other and unspecified benign neoplasm,012,OT THER ENDOCRINE PRCS,401,Pituitary & adrenal procedures,10,"Endocrine, Nutritional and Metabolic Diseases and Disorders",3,Major,Moderate,Surgical,Medicare,Private Health Insurance,,,N,N,192155.75,48939.88
Capital/Adirond,Otsego,3824000,000746,Mary Imogene Bassett Hospital,50 to 69,138,M,White,Not Span/Hispanic,2,Elective,Home or Self Care,2017,047,Other and unspecified benign neoplasm,012,OT THER ENDOCRINE PRCS,401,Pituitary & adrenal procedures,10,"Endocrine, Nutritional and Metabolic Diseases and Disorders",1,Minor,Moderate,Surgical,Medicaid,Self-Pay,,,N,N,31473.55,13723.03
New York City,Bronx,7000006,001169,Montefiore Medical Center - Henry & Lucy Moses Div,18 to 29,104,M,Other Race,Not Span/Hispanic,6,Elective,Home or Self Care,2017,047,Other and unspecified benign neoplasm,012,OT THER ENDOCRINE PRCS,401,Pituitary & adrenal procedures,10,"Endocrine, Nutritional and Metabolic Diseases and Disorders",1,Minor,Minor,Surgical,Medicaid,,,,N,N,89692.76,22540.87
New York City,Manhattan,7002024,001456,Mount Sinai Hospital,50 to 69,103,M,Other Race,Not Span/Hispanic,1,Elective,Home or Self Care,2017,047,Other and unspecified benign neoplasm,012,OT THER ENDOCRINE PRCS,401,Pituitary & adrenal procedures,10,"Endocrine, Nutritional and Metabolic Diseases and Disorders",1,Minor,Minor,Surgical,Blue Cross/Blue Shield,Self-Pay,,,N,N,35119.09,15201.12
New York City,Manhattan,7002053,001463,NYU Langone Hospitals,50 to 69,OOS,F,White,Not Span/Hispanic,2,Elective,Home or Self Care,2017,047,Other and unspecified benign neoplasm,012,OT THER ENDOCRINE PRCS,401,Pituitary & adrenal procedures,10,"Endocrine, Nutritional and Metabolic Diseases and Disorders",1,Minor,Moderate,Surgical,Blue Cross/Blue Shield,,,,N,N,96134.48,19250.34
New York City,Manhattan,7002053,001463,NYU Langone Hospitals,30 to 49,100,F,White,Not Span/Hispanic,1,Elective,Home or Self Care,2017,051,Other endocrine disorders,012,OT THER ENDOCRINE PRCS,401,Pituitary & adrenal procedures,10,"Endocrine, Nutritional and Metabolic Diseases and Disorders",1,Minor,Minor,Surgical,Blue Cross/Blue Shield,,,,N,N,60846.59,12995.23
New York City,Manhattan,7002053,001463,NYU Langone Hospitals,50 to 69,112,M,Black/African American,Spanish/Hispanic,1,Elective,Home or Self Care,2017,047,Other and unspecified benign neoplasm,012,OT THER ENDOCRINE PRCS,401,Pituitary & adrenal procedures,10,"Endocrine, Nutritional and Metabolic Diseases and Disorders",1,Minor,Minor,Surgical,Private Health Insurance,,,,N,N,72461.24,17415.31
Long Island,Suffolk,5154001,000925,Good Samaritan Hospital Medical Center,50 to 69,117,M,White,Not Span/Hispanic,4,Elective,Home or Self Care,2017,047,Other and unspecified benign neoplasm,012,OT THER ENDOCRINE PRCS,401,Pituitary & adrenal procedures,10,"Endocrine, Nutritional and Metabolic Diseases and Disorders",1,Minor,Minor,Surgical,Blue Cross/Blue Shield,,,,N,N,62570.39,14355.16
New York City,Kings,7002053,001304,NYU Langone Hospital-Brooklyn,50 to 69,112,M,White,Not Span/Hispanic,1,Elective,Home or Self Care,2017,047,Other and unspecified benign neoplasm,012,OT THER ENDOCRINE PRCS,401,Pituitary & adrenal procedures,10,"Endocrine, Nutritional and Metabolic Diseases and Disorders",1,Minor,Minor,Surgical,Medicare,,,,N,N,127054.80,49232.43
New York City,Kings,7001020,001305,Maimonides Medical Center,30 to 49,112,M,Black/African American,Not Span/Hispanic,1,Elective,Home or Self Care,2017,047,Other and unspecified benign neoplasm,012,OT THER ENDOCRINE PRCS,401,Pituitary & adrenal procedures,10,"Endocrine, Nutritional and Metabolic Diseases and Disorders",1,Minor,Minor,Surgical,Medicaid,,Self-Pay,,N,N,33181.00,10795.50
New York City,Kings,7001020,001305,Maimonides Medical Center,30 to 49,112,F,Other Race,Spanish/Hispanic,2,Elective,Home or Self Care,2017,051,Other endocrine disorders,011,DX ENDOCRINE PRCS,401,Pituitary & adrenal procedures,10,"Endocrine, Nutritional and Metabolic Diseases and Disorders",2,Moderate,Minor,Surgical,Medicaid,,Self-Pay,,N,N,41512.00,12967.25
New York City,Kings,7001020,001305,Maimonides Medical Center,50 to 69,112,M,White,Not Span/Hispanic,7,Emergency,Home or Self Care,2017,047,Other and unspecified benign neoplasm,012,OT THER ENDOCRINE PRCS,401,Pituitary & adrenal procedures,10,"Endocrine, Nutritional and Metabolic Diseases and Disorders",2,Moderate,Minor,Surgical,Medicare,,Self-Pay,,N,Y,78399.00,23077.40