Hospital Service Area,Hospital County,Operating Certificate Number,Permanent Facility Id,Facility Name,Age Group,Zip Code - 3 digits,Gender,Race,Ethnicity,Length of Stay,Type of Admission,Patient Disposition,Discharge Year,CCS Diagnosis Code,CCS Diagnosis Description,CCS Procedure Code,CCS Procedure Description,APR DRG Code,APR DRG Description,APR MDC Code,APR MDC Description,APR Severity of Illness Code,APR Severity of Illness Description,APR Risk of Mortality,APR Medical Surgical Description,Payment Typology 1,Payment Typology 2,Payment Typology 3,Birth Weight,Abortion Edit Indicator,Emergency Department Indicator,Total Charges,Total Costs
New York City,Manhattan,7002053,001463,NYU Langone Hospitals,30 to 49,112,F,Other Race,Not Span/Hispanic,2,Elective,Home or Self Care,2019,NEO073,BENIGN NEOPLASMS,ENP004,ADRENALECTOMY,401,ADRENAL PROCEDURES,10,"ENDOCRINE, NUTRITIONAL AND METABOLIC DISEASES AND DISORDERS",1,Minor,Minor,Surgical,Blue Cross/Blue Shield,,,,,false,112363.36,19663.85
New York City,Manhattan,7002053,001463,NYU Langone Hospitals,50 to 69,113,F,White,Not Span/Hispanic,1,Elective,Home or Self Care,2019,NEO073,BENIGN NEOPLASMS,ENP004,ADRENALECTOMY,401,ADRENAL PROCEDURES,10,"ENDOCRINE, NUTRITIONAL AND METABOLIC DISEASES AND DISORDERS",1,Minor,Moderate,Surgical,Private Health Insurance,,,,,false,113479.07,18134.08
New York City,Manhattan,7002053,001463,NYU Langone Hospitals,70 or Older,112,M,White,Not Span/Hispanic,1,Elective,Home or Self Care,2019,NEO073,BENIGN NEOPLASMS,ENP004,ADRENALECTOMY,401,ADRENAL PROCEDURES,10,"ENDOCRINE, NUTRITIONAL AND METABOLIC DISEASES AND DISORDERS",1,Minor,Minor,Surgical,Medicare,Medicare,,,,false,139314.81,24203.59
New York City,Manhattan,7002053,001463,NYU Langone Hospitals,50 to 69,OOS,M,White,Not Span/Hispanic,10,Elective,Home or Self Care,2019,NEO073,BENIGN NEOPLASMS,ENP004,ADRENALECTOMY,401,ADRENAL PROCEDURES,10,"ENDOCRINE, NUTRITIONAL AND METABOLIC DISEASES AND DISORDERS",4,Extreme,Extreme,Surgical,Medicare,,,,,false,432379.5,92834.85
New York City,Manhattan,7002053,001463,NYU Langone Hospitals,30 to 49,110,F,Other Race,Not Span/Hispanic,1,Elective,Home or Self Care,2019,NEO073,BENIGN NEOPLASMS,ENP004,ADRENALECTOMY,401,ADRENAL PROCEDURES,10,"ENDOCRINE, NUTRITIONAL AND METABOLIC DISEASES AND DISORDERS",1,Minor,Minor,Surgical,Private Health Insurance,,,,,false,94022.1,15633.96
New York City,Manhattan,7002053,001463,NYU Langone Hospitals,18 to 29,111,M,White,Not Span/Hispanic,1,Elective,Home or Self Care,2019,NEO073,BENIGN NEOPLASMS,ENP004,ADRENALECTOMY,401,ADRENAL PROCEDURES,10,"ENDOCRINE, NUTRITIONAL AND METABOLIC DISEASES AND DISORDERS",1,Minor,Minor,Surgical,Private Health Insurance,,,,,false,102401.53,16852.88
New York City,Manhattan,7002053,001463,NYU Langone Hospitals,30 to 49,114,F,Other Race,Not Span/Hispanic,1,Elective,Home or Self Care,2019,NEO073,BENIGN NEOPLASMS,ENP004,ADRENALECTOMY,401,ADRENAL PROCEDURES,10,"ENDOCRINE, NUTRITIONAL AND METABOLIC DISEASES AND DISORDERS",1,Minor,Minor,Surgical,Medicaid,,,,,false,90177,15071.36
New York City,Manhattan,7002053,001463,NYU Langone Hospitals,50 to 69,112,F,Other Race,Spanish/Hispanic,1,Elective,Home or Self Care,2019,NEO073,BENIGN NEOPLASMS,ENP004,ADRENALECTOMY,401,ADRENAL PROCEDURES,10,"ENDOCRINE, NUTRITIONAL AND METABOLIC DISEASES AND DISORDERS",1,Minor,Minor,Surgical,Blue Cross/Blue Shield,,,,,false,97193.55,16199.28
New York City,Manhattan,7002053,001463,NYU Langone Hospitals,50 to 69,103,M,White,Not Span/Hispanic,1,Elective,Home or Self Care,2019,NEO073,BENIGN NEOPLASMS,ENP004,ADRENALECTOMY,401,ADRENAL PROCEDURES,10,"ENDOCRINE, NUTRITIONAL AND METABOLIC DISEASES AND DISORDERS",1,Minor,Minor,Surgical,Blue Cross/Blue Shield,,,,,false,93761.35,15192.18
New York City,Manhattan,7002053,001463,NYU Langone Hospitals,30 to 49,112,F,Other Race,Not Span/Hispanic,1,Elective,Home or Self Care,2019,NEO073,BENIGN NEOPLASMS,ENP004,ADRENALECTOMY,401,ADRENAL PROCEDURES,10,"ENDOCRINE, NUTRITIONAL AND METABOLIC DISEASES AND DISORDERS",1,Minor,Minor,Surgical,Private Health Insurance,,,,,false,110031.38,17980.66
New York City,Manhattan,7002053,001463,NYU Langone Hospitals,30 to 49,105,F,Other Race,Not Span/Hispanic,1,Elective,Home or Self Care,2019,NEO073,BENIGN NEOPLASMS,ENP004,ADRENALECTOMY,401,ADRENAL PROCEDURES,10,"ENDOCRINE, NUTRITIONAL AND METABOLIC DISEASES AND DISORDERS",1,Minor,Minor,Surgical,Private Health Insurance,,,,,false,110959.34,18343.77
New York City,Manhattan,7002053,001463,NYU Langone Hospitals,50 to 69,103,M,White,Not Span/Hispanic,1,Elective,Home or Self Care,2019,NEO073,BENIGN NEOPLASMS,ENP004,ADRENALECTOMY,401,ADRENAL PROCEDURES,10,"ENDOCRINE, NUTRITIONAL AND METABOLIC DISEASES AND DISORDERS",1,Minor,Minor,Surgical,Medicare,Blue Cross/Blue Shield,,,,false,103722.87,17099.59
New York City,Manhattan,7002053,001463,NYU Langone Hospitals,50 to 69,115,F,Other Race,Spanish/Hispanic,2,Elective,Home or Self Care,2019,NEO073,BENIGN NEOPLASMS,ENP004,ADRENALECTOMY,401,ADRENAL PROCEDURES,10,"ENDOCRINE, NUTRITIONAL AND METABOLIC DISEASES AND DISORDERS",1,Minor,Minor,Surgical,Blue Cross/Blue Shield,,,,,false,105175.86,19816.62
New York City,Manhattan,7002053,001463,NYU Langone Hospitals,70 or Older,111,M,White,Not Span/Hispanic,2,Elective,Home or Self Care,2019,NEO053,ENDOCRINE SYSTEM CANCERS - ADRENOCORTICAL,ENP004,ADRENALECTOMY,401,ADRENAL PROCEDURES,10,"ENDOCRINE, NUTRITIONAL AND METABOLIC DISEASES AND DISORDERS",3,Major,Major,Surgical,Medicare,Private Health Insurance,,,,false,120046.81,21518.88
New York City,Manhattan,7002053,001463,NYU Langone Hospitals,50 to 69,113,F,Other Race,Not Span/Hispanic,8,Elective,Home or Self Care,2019,NEO056,ENDOCRINE SYSTEM CANCERS - ALL OTHER TYPES,ENP004,ADRENALECTOMY,401,ADRENAL PROCEDURES,10,"ENDOCRINE, NUTRITIONAL AND METABOLIC DISEASES AND DISORDERS",1,Minor,Moderate,Surgical,Medicaid,,,,,false,322560.62,64556.28
New York City,Manhattan,7002053,001463,NYU Langone Hospitals,50 to 69,109,F,White,Not Span/Hispanic,3,Elective,Home or Self Care,2019,NEO070,SECONDARY MALIGNANCIES,ENP004,ADRENALECTOMY,401,ADRENAL PROCEDURES,10,"ENDOCRINE, NUTRITIONAL AND METABOLIC DISEASES AND DISORDERS",1,Minor,Major,Surgical,Private Health Insurance,,,,,false,115921.4,21983.31
New York City,Manhattan,7002053,001463,NYU Langone Hospitals,50 to 69,112,M,Black/African American,Not Span/Hispanic,6,Elective,Home w/ Home Health Services,2019,NEO070,SECONDARY MALIGNANCIES,ENP004,ADRENALECTOMY,401,ADRENAL PROCEDURES,10,"ENDOCRINE, NUTRITIONAL AND METABOLIC DISEASES AND DISORDERS",3,Major,Major,Surgical,Medicaid,,,,,false,211343.03,50222.01
New York City,Manhattan,7002053,001463,NYU Langone Hospitals,50 to 69,OOS,F,Other Race,Not Span/Hispanic,1,Elective,Home or Self Care,2019,NEO073,BENIGN NEOPLASMS,ENP004,ADRENALECTOMY,401,ADRENAL PROCEDURES,10,"ENDOCRINE, NUTRITIONAL AND METABOLIC DISEASES AND DISORDERS",1,Minor,Moderate,Surgical,Private Health Insurance,,,,,false,111673.82,17910.67
New York City,Manhattan,7002053,001463,NYU Langone Hospitals,50 to 69,100,M,White,Not Span/Hispanic,1,Elective,Home or Self Care,2019,NEO073,BENIGN NEOPLASMS,ENP004,ADRENALECTOMY,401,ADRENAL PROCEDURES,10,"ENDOCRINE, NUTRITIONAL AND METABOLIC DISEASES AND DISORDERS",2,Moderate,Moderate,Surgical,Private Health Insurance,,,,,false,100867.81,15944.86
New York City,Manhattan,7002053,001463,NYU Langone Hospitals,30 to 49,OOS,M,White,Not Span/Hispanic,2,Elective,Home or Self Care,2019,NEO073,BENIGN NEOPLASMS,ENP004,ADRENALECTOMY,401,ADRENAL PROCEDURES,10,"ENDOCRINE, NUTRITIONAL AND METABOLIC DISEASES AND DISORDERS",1,Minor,Minor,Surgical,Private Health Insurance,,,,,false,104426.17,18924.46
New York City,Manhattan,7002053,001463,NYU Langone Hospitals,18 to 29,103,F,White,Not Span/Hispanic,1,Elective,Home or Self Care,2019,NEO073,BENIGN NEOPLASMS,ENP004,ADRENALECTOMY,401,ADRENAL PROCEDURES,10,"ENDOCRINE, NUTRITIONAL AND METABOLIC DISEASES AND DISORDERS",1,Minor,Minor,Surgical,Private Health Insurance,,,,,false,103792.14,16582.79
New York City,Manhattan,7002053,001463,NYU Langone Hospitals,50 to 69,125,M,White,Not Span/Hispanic,1,Elective,Home or Self Care,2019,NEO073,BENIGN NEOPLASMS,ENP004,ADRENALECTOMY,401,ADRENAL PROCEDURES,10,"ENDOCRINE, NUTRITIONAL AND METABOLIC DISEASES AND DISORDERS",1,Minor,Minor,Surgical,Blue Cross/Blue Shield,,,,,false,119224.9,19850.04
New York City,Manhattan,7002053,001463,NYU Langone Hospitals,18 to 29,OOS,M,White,Not Span/Hispanic,2,Elective,Home or Self Care,2019,NEO072,NEOPLASMS OF UNSPECIFIED NATURE OR UNCERTAIN BEHAVIOR,ENP004,ADRENALECTOMY,401,ADRENAL PROCEDURES,10,"ENDOCRINE, NUTRITIONAL AND METABOLIC DISEASES AND DISORDERS",3,Major,Moderate,Surgical,Private Health Insurance,,,,,false,150627.07,25590.15
New York City,Manhattan,7002053,001463,NYU Langone Hospitals,30 to 49,112,M,Black/African American,Not Span/Hispanic,1,Elective,Home or Self Care,2019,NEO073,BENIGN NEOPLASMS,ENP004,ADRENALECTOMY,401,ADRENAL PROCEDURES,10,"ENDOCRINE, NUTRITIONAL AND METABOLIC DISEASES AND DISORDERS",1,Minor,Minor,Surgical,Blue Cross/Blue Shield,Medicaid,,,,false,86768.16,14727.61
New York City,Manhattan,7002053,001463,NYU Langone Hospitals,70 or Older,112,M,White,Not Span/Hispanic,5,Elective,Home w/ Home Health Services,2019,NEO070,SECONDARY MALIGNANCIES,ENP004,ADRENALECTOMY,401,ADRENAL PROCEDURES,10,"ENDOCRINE, NUTRITIONAL AND METABOLIC DISEASES AND DISORDERS",1,Minor,Moderate,Surgical,Medicare,Medicaid,,,,false,169307.06,34038.52
New York City,Manhattan,7002053,001463,NYU Langone Hospitals,30 to 49,112,M,White,Not Span/Hispanic,1,Elective,Home or Self Care,2019,END015,OTHER SPECIFIED AND UNSPECIFIED ENDOCRINE DISORDERS,ENP004,ADRENALECTOMY,401,ADRENAL PROCEDURES,10,"ENDOCRINE, NUTRITIONAL AND METABOLIC DISEASES AND DISORDERS",1,Minor,Minor,Surgical,Private Health Insurance,,,,,false,123495.02,20200.7
New York City,Manhattan,7002053,001463,NYU Langone Hospitals,50 to 69,117,F,White,Not Span/Hispanic,1,Elective,Home or Self Care,2019,NEO073,BENIGN NEOPLASMS,ENP004,ADRENALECTOMY,401,ADRENAL PROCEDURES,10,"ENDOCRINE, NUTRITIONAL AND METABOLIC DISEASES AND DISORDERS",1,Minor,Minor,Surgical,Medicare,Medicare,,,,false,97878.11,16093.36
New York City,Manhattan,7002053,001463,NYU Langone Hospitals,50 to 69,115,M,Black/African American,Not Span/Hispanic,3,Elective,Home or Self Care,2019,NEO072,NEOPLASMS OF UNSPECIFIED NATURE OR UNCERTAIN BEHAVIOR,ENP004,ADRENALECTOMY,401,ADRENAL PROCEDURES,10,"ENDOCRINE, NUTRITIONAL AND METABOLIC DISEASES AND DISORDERS",3,Major,Major,Surgical,Blue Cross/Blue Shield,,,,,false,146496.09,27764.28
New York City,Manhattan,7002053,001463,NYU Langone Hospitals,70 or Older,113,F,White,Not Span/Hispanic,1,Elective,Home or Self Care,2019,NEO073,BENIGN NEOPLASMS,ENP004,ADRENALECTOMY,401,ADRENAL PROCEDURES,10,"ENDOCRINE, NUTRITIONAL AND METABOLIC DISEASES AND DISORDERS",1,Minor,Minor,Surgical,Medicare,,,,,false,93605.93,15725.72
New York City,Manhattan,7002053,001463,NYU Langone Hospitals,50 to 69,112,M,Other Race,Not Span/Hispanic,1,Elective,Home or Self Care,2019,NEO073,BENIGN NEOPLASMS,ENP004,ADRENALECTOMY,401,ADRENAL PROCEDURES,10,"ENDOCRINE, NUTRITIONAL AND METABOLIC DISEASES AND DISORDERS",1,Minor,Minor,Surgical,Medicaid,,,,,false,89999.77,14918.23
New York City,Manhattan,7002053,001463,NYU Langone Hospitals,70 or Older,103,M,Other Race,Not Span/Hispanic,1,Elective,Home or Self Care,2019,END015,OTHER SPECIFIED AND UNSPECIFIED ENDOCRINE DISORDERS,ENP004,ADRENALECTOMY,401,ADRENAL PROCEDURES,10,"ENDOCRINE, NUTRITIONAL AND METABOLIC DISEASES AND DISORDERS",1,Minor,Moderate,Surgical,Medicare,,,,,false,130411.63,21042.51
New York City,Manhattan,7002053,001463,NYU Langone Hospitals,30 to 49,113,F,Other Race,Not Span/Hispanic,1,Elective,Home or Self Care,2019,NEO073,BENIGN NEOPLASMS,ENP004,ADRENALECTOMY,401,ADRENAL PROCEDURES,10,"ENDOCRINE, NUTRITIONAL AND METABOLIC DISEASES AND DISORDERS",1,Minor,Minor,Surgical,Medicare,,,,,false,106648.88,16521.87
New York City,Manhattan,7002053,001463,NYU Langone Hospitals,50 to 69,112,M,Other Race,Not Span/Hispanic,2,Elective,Home or Self Care,2019,NEO073,BENIGN NEOPLASMS,ENP004,ADRENALECTOMY,401,ADRENAL PROCEDURES,10,"ENDOCRINE, NUTRITIONAL AND METABOLIC DISEASES AND DISORDERS",1,Minor,Minor,Surgical,Medicaid,,,,,false,146132.86,24797.22
New York City,Manhattan,7002053,001463,NYU Langone Hospitals,70 or Older,112,M,Other Race,Spanish/Hispanic,5,Elective,Home or Self Care,2019,NEO073,BENIGN NEOPLASMS,ENP004,ADRENALECTOMY,401,ADRENAL PROCEDURES,10,"ENDOCRINE, NUTRITIONAL AND METABOLIC DISEASES AND DISORDERS",3,Major,Moderate,Surgical,Medicare,,,,,false,220684.68,39902.25
New York City,Manhattan,7002053,001463,NYU Langone Hospitals,30 to 49,OOS,F,White,Not Span/Hispanic,4,Elective,Home or Self Care,2019,NEO073,BENIGN NEOPLASMS,ENP004,ADRENALECTOMY,401,ADRENAL PROCEDURES,10,"ENDOCRINE, NUTRITIONAL AND METABOLIC DISEASES AND DISORDERS",1,Minor,Minor,Surgical,Private Health Insurance,Private Health Insurance,,,,false,120821.24,25283.88
