Hospital Service Area,Hospital County,Operating Certificate Number,Permanent Facility Id,Facility Name,Age Group,Zip Code - 3 digits,Gender,Race,Ethnicity,Length of Stay,Type of Admission,Patient Disposition,Discharge Year,CCS Diagnosis Code,CCS Diagnosis Description,CCS Procedure Code,CCS Procedure Description,APR DRG Code,APR DRG Description,APR MDC Code,APR MDC Description,APR Severity of Illness Code,APR Severity of Illness Description,APR Risk of Mortality,APR Medical Surgical Description,Payment Typology 1,Payment Typology 2,Payment Typology 3,Birth Weight,Abortion Edit Indicator,Emergency Department Indicator,Total Charges,Total Costs
New York City,Manhattan,7002053,001463,NYU Langone Hospitals,50 to 69,103,F,White,Not Span/Hispanic,2,Elective,Home w/ Home Health Services,2019,END009,OBESITY,GIS010,GASTRECTOMY,403,PROCEDURES FOR OBESITY,10,"ENDOCRINE, NUTRITIONAL AND METABOLIC DISEASES AND DISORDERS",2,Moderate,Minor,Surgical,Medicaid,,,,,false,173742.96,28994.79
New York City,Manhattan,7002053,001463,NYU Langone Hospitals,50 to 69,112,F,White,Not Span/Hispanic,4,Elective,Home w/ Home Health Services,2019,END009,OBESITY,RES011,DIAPHRAGMATIC HERNIA REPAIR,403,PROCEDURES FOR OBESITY,10,"ENDOCRINE, NUTRITIONAL AND METABOLIC DISEASES AND DISORDERS",2,Moderate,Minor,Surgical,Medicare,Medicaid,,,,false,269198.04,47983.46
New York City,Manhattan,7002053,001463,NYU Langone Hospitals,18 to 29,109,M,White,Not Span/Hispanic,1,Elective,Home or Self Care,2019,END009,OBESITY,GIS010,GASTRECTOMY,403,PROCEDURES FOR OBESITY,10,"ENDOCRINE, NUTRITIONAL AND METABOLIC DISEASES AND DISORDERS",1,Minor,Minor,Surgical,Private Health Insurance,,,,,false,154850.17,24538.93
New York City,Manhattan,7002053,001463,NYU Langone Hospitals,30 to 49,104,F,Black/African American,Not Span/Hispanic,1,Elective,Home or Self Care,2019,END009,OBESITY,GIS010,GASTRECTOMY,403,PROCEDURES FOR OBESITY,10,"ENDOCRINE, NUTRITIONAL AND METABOLIC DISEASES AND DISORDERS",1,Minor,Minor,Surgical,Blue Cross/Blue Shield,,,,,false,152534.59,23730.38
New York City,Manhattan,7002053,001463,NYU Langone Hospitals,18 to 29,113,F,White,Not Span/Hispanic,1,Elective,Home w/ Home Health Services,2019,END009,OBESITY,GIS010,GASTRECTOMY,403,PROCEDURES FOR OBESITY,10,"ENDOCRINE, NUTRITIONAL AND METABOLIC DISEASES AND DISORDERS",1,Minor,Minor,Surgical,Medicaid,,,,,false,166773.9,28361.89
New York City,Manhattan,7002053,001463,NYU Langone Hospitals,30 to 49,116,F,Black/African American,Not Span/Hispanic,2,Elective,Home w/ Home Health Services,2019,END009,OBESITY,GIS019,GASTRO-JEJUNAL BYPASS (INCLUDING BARIATRIC),403,PROCEDURES FOR OBESITY,10,"ENDOCRINE, NUTRITIONAL AND METABOLIC DISEASES AND DISORDERS",2,Moderate,Minor,Surgical,Private Health Insurance,,,,,false,108487.57,19360.45
New York City,Manhattan,7002053,001463,NYU Langone Hospitals,18 to 29,109,M,White,Not Span/Hispanic,2,Elective,Home or Self Care,2019,END009,OBESITY,GIS010,GASTRECTOMY,403,PROCEDURES FOR OBESITY,10,"ENDOCRINE, NUTRITIONAL AND METABOLIC DISEASES AND DISORDERS",1,Minor,Minor,Surgical,Private Health Insurance,Medicaid,,,,false,176139.29,29335.47
New York City,Manhattan,7002053,001463,NYU Langone Hospitals,30 to 49,112,M,White,Not Span/Hispanic,1,Elective,Home w/ Home Health Services,2019,END009,OBESITY,GIS010,GASTRECTOMY,403,PROCEDURES FOR OBESITY,10,"ENDOCRINE, NUTRITIONAL AND METABOLIC DISEASES AND DISORDERS",1,Minor,Minor,Surgical,Medicaid,,,,,false,172300.08,27309.79
New York City,Manhattan,7002053,001463,NYU Langone Hospitals,50 to 69,,F,Other Race,Spanish/Hispanic,1,Elective,Home or Self Care,2019,END009,OBESITY,RES011,DIAPHRAGMATIC HERNIA REPAIR,403,PROCEDURES FOR OBESITY,10,"ENDOCRINE, NUTRITIONAL AND METABOLIC DISEASES AND DISORDERS",1,Minor,Minor,Surgical,Private Health Insurance,,,,,false,129655.17,20940.9
New York City,Manhattan,7002053,001463,NYU Langone Hospitals,30 to 49,112,F,White,Not Span/Hispanic,1,Elective,Home or Self Care,2019,END009,OBESITY,GIS010,GASTRECTOMY,403,PROCEDURES FOR OBESITY,10,"ENDOCRINE, NUTRITIONAL AND METABOLIC DISEASES AND DISORDERS",1,Minor,Minor,Surgical,Blue Cross/Blue Shield,Medicare,Private Health Insurance,,,false,160720.81,25402.42
New York City,Manhattan,7002053,001463,NYU Langone Hospitals,30 to 49,112,M,Other Race,Not Span/Hispanic,1,Elective,Home or Self Care,2019,END009,OBESITY,GIS010,GASTRECTOMY,403,PROCEDURES FOR OBESITY,10,"ENDOCRINE, NUTRITIONAL AND METABOLIC DISEASES AND DISORDERS",1,Minor,Minor,Surgical,Medicare,Medicaid,,,,false,154640.77,24486.53
New York City,Manhattan,7002053,001463,NYU Langone Hospitals,50 to 69,OOS,M,White,Not Span/Hispanic,1,Elective,Home or Self Care,2019,END009,OBESITY,GIS010,GASTRECTOMY,403,PROCEDURES FOR OBESITY,10,"ENDOCRINE, NUTRITIONAL AND METABOLIC DISEASES AND DISORDERS",2,Moderate,Minor,Surgical,Blue Cross/Blue Shield,,,,,false,108949.64,16957.87
New York City,Manhattan,7002053,001463,NYU Langone Hospitals,30 to 49,103,M,Other Race,Not Span/Hispanic,2,Elective,Home w/ Home Health Services,2019,END009,OBESITY,GIS010,GASTRECTOMY,403,PROCEDURES FOR OBESITY,10,"ENDOCRINE, NUTRITIONAL AND METABOLIC DISEASES AND DISORDERS",2,Moderate,Minor,Surgical,Medicaid,,,,,false,145720.26,25430.51
New York City,Manhattan,7002053,001463,NYU Langone Hospitals,30 to 49,100,F,White,Not Span/Hispanic,1,Elective,Home w/ Home Health Services,2019,END009,OBESITY,GIS010,GASTRECTOMY,403,PROCEDURES FOR OBESITY,10,"ENDOCRINE, NUTRITIONAL AND METABOLIC DISEASES AND DISORDERS",1,Minor,Minor,Surgical,Private Health Insurance,,,,,false,155154.81,24638.11
New York City,Manhattan,7002053,001463,NYU Langone Hospitals,50 to 69,109,F,White,Not Span/Hispanic,1,Elective,Home or Self Care,2019,END009,OBESITY,GIS010,GASTRECTOMY,403,PROCEDURES FOR OBESITY,10,"ENDOCRINE, NUTRITIONAL AND METABOLIC DISEASES AND DISORDERS",1,Minor,Minor,Surgical,Blue Cross/Blue Shield,,,,,false,160518.87,25266.42
New York City,Manhattan,7002053,001463,NYU Langone Hospitals,30 to 49,103,F,White,Not Span/Hispanic,1,Elective,Home or Self Care,2019,END009,OBESITY,GIS010,GASTRECTOMY,403,PROCEDURES FOR OBESITY,10,"ENDOCRINE, NUTRITIONAL AND METABOLIC DISEASES AND DISORDERS",1,Minor,Minor,Surgical,Private Health Insurance,Medicaid,,,,false,150353.33,23978.07
New York City,Manhattan,7002053,001463,NYU Langone Hospitals,30 to 49,104,F,Other Race,Spanish/Hispanic,2,Elective,Home w/ Home Health Services,2019,END009,OBESITY,GIS010,GASTRECTOMY,403,PROCEDURES FOR OBESITY,10,"ENDOCRINE, NUTRITIONAL AND METABOLIC DISEASES AND DISORDERS",2,Moderate,Minor,Surgical,Private Health Insurance,,,,,false,141545.85,24779.99
New York City,Manhattan,7002053,001463,NYU Langone Hospitals,18 to 29,104,F,White,Not Span/Hispanic,1,Elective,Home or Self Care,2019,END009,OBESITY,GIS010,GASTRECTOMY,403,PROCEDURES FOR OBESITY,10,"ENDOCRINE, NUTRITIONAL AND METABOLIC DISEASES AND DISORDERS",1,Minor,Minor,Surgical,Private Health Insurance,,,,,false,150484.75,25945.95
New York City,Manhattan,7002053,001463,NYU Langone Hospitals,18 to 29,100,F,Black/African American,Not Span/Hispanic,1,Elective,Home w/ Home Health Services,2019,END009,OBESITY,GIS010,GASTRECTOMY,403,PROCEDURES FOR OBESITY,10,"ENDOCRINE, NUTRITIONAL AND METABOLIC DISEASES AND DISORDERS",2,Moderate,Minor,Surgical,Blue Cross/Blue Shield,,,,,false,170678.24,26858.59
New York City,Manhattan,7002053,001463,NYU Langone Hospitals,50 to 69,104,M,Black/African American,Not Span/Hispanic,1,Elective,Home or Self Care,2019,END009,OBESITY,GIS010,GASTRECTOMY,403,PROCEDURES FOR OBESITY,10,"ENDOCRINE, NUTRITIONAL AND METABOLIC DISEASES AND DISORDERS",1,Minor,Minor,Surgical,Blue Cross/Blue Shield,,,,,false,101109.84,16845.48
New York City,Manhattan,7002053,001463,NYU Langone Hospitals,30 to 49,113,M,White,Not Span/Hispanic,1,Elective,Home or Self Care,2019,END009,OBESITY,GIS026,"UPPER GI THERAPEUTIC PROCEDURES, NEC (OPEN AND LAPAROSCOPIC)",403,PROCEDURES FOR OBESITY,10,"ENDOCRINE, NUTRITIONAL AND METABOLIC DISEASES AND DISORDERS",1,Minor,Minor,Surgical,Blue Cross/Blue Shield,,,,,false,98986.32,16534.97
New York City,Manhattan,7002053,001463,NYU Langone Hospitals,30 to 49,104,M,Other Race,Spanish/Hispanic,1,Elective,Home or Self Care,2019,END009,OBESITY,GIS010,GASTRECTOMY,403,PROCEDURES FOR OBESITY,10,"ENDOCRINE, NUTRITIONAL AND METABOLIC DISEASES AND DISORDERS",1,Minor,Minor,Surgical,Private Health Insurance,,,,,false,106864.66,17633.94
New York City,Manhattan,7002053,001463,NYU Langone Hospitals,30 to 49,104,F,Black/African American,Not Span/Hispanic,2,Elective,Home or Self Care,2019,END009,OBESITY,GIS019,GASTRO-JEJUNAL BYPASS (INCLUDING BARIATRIC),403,PROCEDURES FOR OBESITY,10,"ENDOCRINE, NUTRITIONAL AND METABOLIC DISEASES AND DISORDERS",1,Minor,Minor,Surgical,Blue Cross/Blue Shield,,,,,false,104232.5,19493.87
New York City,Manhattan,7002053,001463,NYU Langone Hospitals,30 to 49,112,M,White,Not Span/Hispanic,1,Elective,Home or Self Care,2019,END009,OBESITY,GIS010,GASTRECTOMY,403,PROCEDURES FOR OBESITY,10,"ENDOCRINE, NUTRITIONAL AND METABOLIC DISEASES AND DISORDERS",1,Minor,Minor,Surgical,Medicare,Private Health Insurance,,,,false,153626.2,24886.78
New York City,Manhattan,7002053,001463,NYU Langone Hospitals,50 to 69,115,M,White,Not Span/Hispanic,1,Elective,Home or Self Care,2019,END009,OBESITY,GIS010,GASTRECTOMY,403,PROCEDURES FOR OBESITY,10,"ENDOCRINE, NUTRITIONAL AND METABOLIC DISEASES AND DISORDERS",1,Minor,Minor,Surgical,Private Health Insurance,,,,,false,175150.56,27423.31
New York City,Manhattan,7002053,001463,NYU Langone Hospitals,30 to 49,114,F,White,Spanish/Hispanic,1,Elective,Home or Self Care,2019,END009,OBESITY,GIS010,GASTRECTOMY,403,PROCEDURES FOR OBESITY,10,"ENDOCRINE, NUTRITIONAL AND METABOLIC DISEASES AND DISORDERS",1,Minor,Minor,Surgical,Blue Cross/Blue Shield,,,,,false,127071.05,20719.11
New York City,Manhattan,7002053,001463,NYU Langone Hospitals,30 to 49,105,F,White,Not Span/Hispanic,1,Elective,Home w/ Home Health Services,2019,END009,OBESITY,GIS010,GASTRECTOMY,403,PROCEDURES FOR OBESITY,10,"ENDOCRINE, NUTRITIONAL AND METABOLIC DISEASES AND DISORDERS",2,Moderate,Minor,Surgical,Medicaid,,,,,false,123327.85,20102.94
New York City,Manhattan,7002053,001463,NYU Langone Hospitals,30 to 49,112,F,Black/African American,Not Span/Hispanic,1,Elective,Home or Self Care,2019,END009,OBESITY,GIS010,GASTRECTOMY,403,PROCEDURES FOR OBESITY,10,"ENDOCRINE, NUTRITIONAL AND METABOLIC DISEASES AND DISORDERS",1,Minor,Minor,Surgical,Private Health Insurance,,,,,false,209854.02,32921.62
New York City,Manhattan,7002053,001463,NYU Langone Hospitals,50 to 69,113,F,White,Not Span/Hispanic,1,Elective,Home w/ Home Health Services,2019,END009,OBESITY,GIS019,GASTRO-JEJUNAL BYPASS (INCLUDING BARIATRIC),403,PROCEDURES FOR OBESITY,10,"ENDOCRINE, NUTRITIONAL AND METABOLIC DISEASES AND DISORDERS",1,Minor,Minor,Surgical,Private Health Insurance,,,,,false,85764.91,14342.63
New York City,Manhattan,7002053,001463,NYU Langone Hospitals,30 to 49,117,M,Other Race,Spanish/Hispanic,1,Elective,Home or Self Care,2019,END009,OBESITY,GIS010,GASTRECTOMY,403,PROCEDURES FOR OBESITY,10,"ENDOCRINE, NUTRITIONAL AND METABOLIC DISEASES AND DISORDERS",1,Minor,Minor,Surgical,Blue Cross/Blue Shield,,,,,false,153023.64,26638.99
New York City,Manhattan,7002053,001463,NYU Langone Hospitals,18 to 29,,F,Black/African American,Not Span/Hispanic,1,Elective,Home w/ Home Health Services,2019,END009,OBESITY,GIS010,GASTRECTOMY,403,PROCEDURES FOR OBESITY,10,"ENDOCRINE, NUTRITIONAL AND METABOLIC DISEASES AND DISORDERS",2,Moderate,Minor,Surgical,Blue Cross/Blue Shield,,,,,false,162608.39,25591.13
New York City,Manhattan,7002053,001463,NYU Langone Hospitals,50 to 69,114,F,Other Race,Spanish/Hispanic,2,Elective,Home or Self Care,2019,END009,OBESITY,GIS019,GASTRO-JEJUNAL BYPASS (INCLUDING BARIATRIC),403,PROCEDURES FOR OBESITY,10,"ENDOCRINE, NUTRITIONAL AND METABOLIC DISEASES AND DISORDERS",2,Moderate,Minor,Surgical,Private Health Insurance,,,,,false,93647.92,18047.58
New York City,Manhattan,7002053,001463,NYU Langone Hospitals,30 to 49,112,F,Black/African American,Not Span/Hispanic,1,Elective,Home w/ Home Health Services,2019,END009,OBESITY,GIS010,GASTRECTOMY,403,PROCEDURES FOR OBESITY,10,"ENDOCRINE, NUTRITIONAL AND METABOLIC DISEASES AND DISORDERS",1,Minor,Minor,Surgical,Private Health Insurance,,,,,false,151200.83,24265.18
New York City,Manhattan,7002053,001463,NYU Langone Hospitals,50 to 69,111,F,White,Not Span/Hispanic,1,Elective,Home w/ Home Health Services,2019,END009,OBESITY,GIS010,GASTRECTOMY,403,PROCEDURES FOR OBESITY,10,"ENDOCRINE, NUTRITIONAL AND METABOLIC DISEASES AND DISORDERS",1,Minor,Minor,Surgical,Private Health Insurance,,,,,false,133194.21,21284.01
New York City,Manhattan,7002053,001463,NYU Langone Hospitals,50 to 69,112,F,Other Race,Not Span/Hispanic,1,Elective,Home or Self Care,2019,END009,OBESITY,GIS010,GASTRECTOMY,403,PROCEDURES FOR OBESITY,10,"ENDOCRINE, NUTRITIONAL AND METABOLIC DISEASES AND DISORDERS",1,Minor,Minor,Surgical,Private Health Insurance,,,,,false,85687.36,14425.37
New York City,Manhattan,7002053,001463,NYU Langone Hospitals,50 to 69,112,F,White,Spanish/Hispanic,1,Elective,Home or Self Care,2019,END009,OBESITY,GIS005,EXPLORATION OF PERITONEAL CAVITY,403,PROCEDURES FOR OBESITY,10,"ENDOCRINE, NUTRITIONAL AND METABOLIC DISEASES AND DISORDERS",2,Moderate,Minor,Surgical,Medicare,,,,,false,82436.54,14262.95
New York City,Manhattan,7002053,001463,NYU Langone Hospitals,50 to 69,104,F,Black/African American,Not Span/Hispanic,2,Elective,Home or Self Care,2019,END009,OBESITY,GIS010,GASTRECTOMY,403,PROCEDURES FOR OBESITY,10,"ENDOCRINE, NUTRITIONAL AND METABOLIC DISEASES AND DISORDERS",2,Moderate,Minor,Surgical,Private Health Insurance,,,,,false,153828.27,26708.24
New York City,Manhattan,7002053,001463,NYU Langone Hospitals,30 to 49,112,F,Other Race,Spanish/Hispanic,1,Elective,Home or Self Care,2019,END009,OBESITY,GIS010,GASTRECTOMY,403,PROCEDURES FOR OBESITY,10,"ENDOCRINE, NUTRITIONAL AND METABOLIC DISEASES AND DISORDERS",1,Minor,Minor,Surgical,Private Health Insurance,,,,,false,103698.97,16939.41
New York City,Manhattan,7002053,001463,NYU Langone Hospitals,30 to 49,103,F,White,Not Span/Hispanic,1,Elective,Home or Self Care,2019,END009,OBESITY,GIS010,GASTRECTOMY,403,PROCEDURES FOR OBESITY,10,"ENDOCRINE, NUTRITIONAL AND METABOLIC DISEASES AND DISORDERS",1,Minor,Minor,Surgical,Blue Cross/Blue Shield,Private Health Insurance,,,,false,136448.16,22043.68
New York City,Manhattan,7002053,001463,NYU Langone Hospitals,30 to 49,OOS,F,White,Not Span/Hispanic,1,Elective,Home or Self Care,2019,END009,OBESITY,GIS010,GASTRECTOMY,403,PROCEDURES FOR OBESITY,10,"ENDOCRINE, NUTRITIONAL AND METABOLIC DISEASES AND DISORDERS",2,Moderate,Minor,Surgical,Private Health Insurance,,,,,false,149620.24,23657.44
New York City,Manhattan,7002053,001463,NYU Langone Hospitals,30 to 49,100,F,Other Race,Spanish/Hispanic,3,Elective,Home or Self Care,2019,END009,OBESITY,GIS019,GASTRO-JEJUNAL BYPASS (INCLUDING BARIATRIC),403,PROCEDURES FOR OBESITY,10,"ENDOCRINE, NUTRITIONAL AND METABOLIC DISEASES AND DISORDERS",2,Moderate,Minor,Surgical,Blue Cross/Blue Shield,,,,,false,127626.06,24034.83
New York City,Manhattan,7002053,001463,NYU Langone Hospitals,50 to 69,100,M,White,Not Span/Hispanic,2,Elective,Home w/ Home Health Services,2019,END009,OBESITY,GIS019,GASTRO-JEJUNAL BYPASS (INCLUDING BARIATRIC),403,PROCEDURES FOR OBESITY,10,"ENDOCRINE, NUTRITIONAL AND METABOLIC DISEASES AND DISORDERS",1,Minor,Minor,Surgical,Private Health Insurance,Medicare,,,,false,139533.79,26057.93
New York City,Manhattan,7002053,001463,NYU Langone Hospitals,50 to 69,112,F,White,Not Span/Hispanic,2,Elective,Home or Self Care,2019,END009,OBESITY,GIS019,GASTRO-JEJUNAL BYPASS (INCLUDING BARIATRIC),403,PROCEDURES FOR OBESITY,10,"ENDOCRINE, NUTRITIONAL AND METABOLIC DISEASES AND DISORDERS",2,Moderate,Minor,Surgical,Blue Cross/Blue Shield,,,,,false,136851.99,23241.37
New York City,Manhattan,7002053,001463,NYU Langone Hospitals,30 to 49,113,M,Other Race,Spanish/Hispanic,1,Elective,Home or Self Care,2019,END009,OBESITY,GIS010,GASTRECTOMY,403,PROCEDURES FOR OBESITY,10,"ENDOCRINE, NUTRITIONAL AND METABOLIC DISEASES AND DISORDERS",1,Minor,Minor,Surgical,Medicaid,,,,,false,173457.39,27347.84
New York City,Manhattan,7002053,001463,NYU Langone Hospitals,30 to 49,111,F,White,Not Span/Hispanic,1,Elective,Home or Self Care,2019,END009,OBESITY,GIS010,GASTRECTOMY,403,PROCEDURES FOR OBESITY,10,"ENDOCRINE, NUTRITIONAL AND METABOLIC DISEASES AND DISORDERS",1,Minor,Minor,Surgical,Blue Cross/Blue Shield,,,,,false,140968.72,22873.58
New York City,Manhattan,7002053,001463,NYU Langone Hospitals,50 to 69,113,M,Other Race,Not Span/Hispanic,1,Elective,Home or Self Care,2019,END009,OBESITY,GIS010,GASTRECTOMY,403,PROCEDURES FOR OBESITY,10,"ENDOCRINE, NUTRITIONAL AND METABOLIC DISEASES AND DISORDERS",1,Minor,Minor,Surgical,Private Health Insurance,,,,,false,93830.92,15786.11
New York City,Manhattan,7002053,001463,NYU Langone Hospitals,30 to 49,112,F,Black/African American,Not Span/Hispanic,1,Elective,Home or Self Care,2019,END009,OBESITY,GIS010,GASTRECTOMY,403,PROCEDURES FOR OBESITY,10,"ENDOCRINE, NUTRITIONAL AND METABOLIC DISEASES AND DISORDERS",1,Minor,Minor,Surgical,Private Health Insurance,,,,,false,135542.56,21681.93
New York City,Manhattan,7002053,001463,NYU Langone Hospitals,30 to 49,103,F,White,Not Span/Hispanic,1,Elective,Home or Self Care,2019,END009,OBESITY,GIS010,GASTRECTOMY,403,PROCEDURES FOR OBESITY,10,"ENDOCRINE, NUTRITIONAL AND METABOLIC DISEASES AND DISORDERS",1,Minor,Minor,Surgical,Blue Cross/Blue Shield,,,,,false,150772.37,23989.92
New York City,Manhattan,7002053,001463,NYU Langone Hospitals,30 to 49,112,M,Black/African American,Not Span/Hispanic,1,Elective,Home or Self Care,2019,END009,OBESITY,GIS010,GASTRECTOMY,403,PROCEDURES FOR OBESITY,10,"ENDOCRINE, NUTRITIONAL AND METABOLIC DISEASES AND DISORDERS",1,Minor,Minor,Surgical,Medicaid,,,,,false,130423.11,21794.83
New York City,Manhattan,7002053,001463,NYU Langone Hospitals,30 to 49,112,F,White,Not Span/Hispanic,1,Elective,Home w/ Home Health Services,2019,END009,OBESITY,GIS010,GASTRECTOMY,403,PROCEDURES FOR OBESITY,10,"ENDOCRINE, NUTRITIONAL AND METABOLIC DISEASES AND DISORDERS",1,Minor,Minor,Surgical,Private Health Insurance,,,,,false,136649.73,21796.49
New York City,Manhattan,7002053,001463,NYU Langone Hospitals,30 to 49,114,F,Black/African American,Not Span/Hispanic,1,Elective,Home or Self Care,2019,END009,OBESITY,GIS010,GASTRECTOMY,403,PROCEDURES FOR OBESITY,10,"ENDOCRINE, NUTRITIONAL AND METABOLIC DISEASES AND DISORDERS",1,Minor,Minor,Surgical,Private Health Insurance,,,,,false,137553.41,21998.91
New York City,Manhattan,7002053,001463,NYU Langone Hospitals,30 to 49,114,M,Black/African American,Not Span/Hispanic,1,Elective,Home or Self Care,2019,END009,OBESITY,GIS010,GASTRECTOMY,403,PROCEDURES FOR OBESITY,10,"ENDOCRINE, NUTRITIONAL AND METABOLIC DISEASES AND DISORDERS",1,Minor,Minor,Surgical,Private Health Insurance,,,,,false,138020.92,22458.98
New York City,Manhattan,7002053,001463,NYU Langone Hospitals,30 to 49,116,F,White,Not Span/Hispanic,1,Elective,Home or Self Care,2019,END009,OBESITY,GIS010,GASTRECTOMY,403,PROCEDURES FOR OBESITY,10,"ENDOCRINE, NUTRITIONAL AND METABOLIC DISEASES AND DISORDERS",2,Moderate,Minor,Surgical,Private Health Insurance,,,,,false,141836.19,22548.49
New York City,Manhattan,7002053,001463,NYU Langone Hospitals,18 to 29,112,F,White,Not Span/Hispanic,1,Elective,Home or Self Care,2019,END009,OBESITY,GIS010,GASTRECTOMY,403,PROCEDURES FOR OBESITY,10,"ENDOCRINE, NUTRITIONAL AND METABOLIC DISEASES AND DISORDERS",2,Moderate,Minor,Surgical,Private Health Insurance,,,,,false,136862.09,22180.65
New York City,Manhattan,7002053,001463,NYU Langone Hospitals,18 to 29,112,F,White,Not Span/Hispanic,1,Elective,Home w/ Home Health Services,2019,END009,OBESITY,GIS010,GASTRECTOMY,403,PROCEDURES FOR OBESITY,10,"ENDOCRINE, NUTRITIONAL AND METABOLIC DISEASES AND DISORDERS",1,Minor,Minor,Surgical,Medicaid,,,,,false,142232.6,22967.23
New York City,Manhattan,7002053,001463,NYU Langone Hospitals,18 to 29,112,F,White,Not Span/Hispanic,1,Elective,Home or Self Care,2019,END009,OBESITY,GIS010,GASTRECTOMY,403,PROCEDURES FOR OBESITY,10,"ENDOCRINE, NUTRITIONAL AND METABOLIC DISEASES AND DISORDERS",1,Minor,Minor,Surgical,Private Health Insurance,,,,,false,163942.5,25370.42
New York City,Manhattan,7002053,001463,NYU Langone Hospitals,30 to 49,107,F,White,Not Span/Hispanic,2,Elective,Home or Self Care,2019,END009,OBESITY,GIS010,GASTRECTOMY,403,PROCEDURES FOR OBESITY,10,"ENDOCRINE, NUTRITIONAL AND METABOLIC DISEASES AND DISORDERS",2,Moderate,Minor,Surgical,Blue Cross/Blue Shield,,,,,false,151613.77,25605.13
New York City,Manhattan,7002053,001463,NYU Langone Hospitals,18 to 29,103,F,White,Not Span/Hispanic,1,Elective,Home w/ Home Health Services,2019,END009,OBESITY,GIS010,GASTRECTOMY,403,PROCEDURES FOR OBESITY,10,"ENDOCRINE, NUTRITIONAL AND METABOLIC DISEASES AND DISORDERS",1,Minor,Minor,Surgical,Private Health Insurance,,,,,false,132465.06,21573.57
New York City,Manhattan,7002053,001463,NYU Langone Hospitals,30 to 49,104,F,Black/African American,Not Span/Hispanic,1,Elective,Home w/ Home Health Services,2019,END009,OBESITY,GIS010,GASTRECTOMY,403,PROCEDURES FOR OBESITY,10,"ENDOCRINE, NUTRITIONAL AND METABOLIC DISEASES AND DISORDERS",2,Moderate,Minor,Surgical,Private Health Insurance,,,,,false,137130.58,22029.66
New York City,Manhattan,7002053,001463,NYU Langone Hospitals,30 to 49,101,F,Other Race,Spanish/Hispanic,3,Elective,Home w/ Home Health Services,2019,END009,OBESITY,GIS025,OTHER GI SYSTEM DEVICE PROCEDURES,403,PROCEDURES FOR OBESITY,10,"ENDOCRINE, NUTRITIONAL AND METABOLIC DISEASES AND DISORDERS",2,Moderate,Minor,Surgical,Private Health Insurance,,,,,false,199236.79,32723.31
New York City,Manhattan,7002053,001463,NYU Langone Hospitals,50 to 69,OOS,F,Black/African American,Not Span/Hispanic,1,Elective,Home w/ Home Health Services,2019,END009,OBESITY,GIS010,GASTRECTOMY,403,PROCEDURES FOR OBESITY,10,"ENDOCRINE, NUTRITIONAL AND METABOLIC DISEASES AND DISORDERS",1,Minor,Minor,Surgical,Private Health Insurance,,,,,false,137592.94,22003.66
New York City,Manhattan,7002053,001463,NYU Langone Hospitals,30 to 49,113,M,White,Not Span/Hispanic,2,Elective,Home or Self Care,2019,END009,OBESITY,GIS010,GASTRECTOMY,403,PROCEDURES FOR OBESITY,10,"ENDOCRINE, NUTRITIONAL AND METABOLIC DISEASES AND DISORDERS",1,Minor,Minor,Surgical,Medicaid,,,,,false,152165.2,26545.37
New York City,Manhattan,7002053,001463,NYU Langone Hospitals,30 to 49,113,F,White,Spanish/Hispanic,1,Elective,Home or Self Care,2019,END009,OBESITY,GIS010,GASTRECTOMY,403,PROCEDURES FOR OBESITY,10,"ENDOCRINE, NUTRITIONAL AND METABOLIC DISEASES AND DISORDERS",1,Minor,Minor,Surgical,Blue Cross/Blue Shield,,,,,false,132654.09,21274.92
New York City,Manhattan,7002053,001463,NYU Langone Hospitals,30 to 49,112,F,White,Not Span/Hispanic,1,Elective,Home w/ Home Health Services,2019,END009,OBESITY,GIS010,GASTRECTOMY,403,PROCEDURES FOR OBESITY,10,"ENDOCRINE, NUTRITIONAL AND METABOLIC DISEASES AND DISORDERS",2,Moderate,Minor,Surgical,Private Health Insurance,,,,,false,144755.66,23192.09
New York City,Manhattan,7002053,001463,NYU Langone Hospitals,50 to 69,103,M,White,Not Span/Hispanic,1,Elective,Home w/ Home Health Services,2019,END009,OBESITY,GIS010,GASTRECTOMY,403,PROCEDURES FOR OBESITY,10,"ENDOCRINE, NUTRITIONAL AND METABOLIC DISEASES AND DISORDERS",2,Moderate,Minor,Surgical,Private Health Insurance,,,,,false,150495.82,24489.77
New York City,Manhattan,7002053,001463,NYU Langone Hospitals,30 to 49,105,F,White,Not Span/Hispanic,1,Elective,Home or Self Care,2019,END009,OBESITY,GIS010,GASTRECTOMY,403,PROCEDURES FOR OBESITY,10,"ENDOCRINE, NUTRITIONAL AND METABOLIC DISEASES AND DISORDERS",2,Moderate,Minor,Surgical,Federal/State/Local/VA,,,,,false,161780.5,25767.85