Hospital Service Area,Hospital County,Operating Certificate Number,Permanent Facility Id,Facility Name,Age Group,Zip Code - 3 digits,Gender,Race,Ethnicity,Length of Stay,Type of Admission,Patient Disposition,Discharge Year,CCS Diagnosis Code,CCS Diagnosis Description,CCS Procedure Code,CCS Procedure Description,APR DRG Code,APR DRG Description,APR MDC Code,APR MDC Description,APR Severity of Illness Code,APR Severity of Illness Description,APR Risk of Mortality,APR Medical Surgical Description,Payment Typology 1,Payment Typology 2,Payment Typology 3,Birth Weight,Abortion Edit Indicator,Emergency Department Indicator,Total Charges,Total Costs
New York City,Manhattan,7002001,001438,Bellevue Hospital Center,30 to 49,112,F,Other Race,Not Span/Hispanic,1,Emergency,Home or Self Care,2017,047,Other and unspecified benign neoplasm,010,THYROIDECTOMY;PART/FULL,404,"Thyroid, parathyroid & thyroglossal procedures",10,"Endocrine, Nutritional and Metabolic Diseases and Disorders",1,Minor,Minor,Surgical,Private Health Insurance,,,,N,N,2835.66,1828.29
New York City,Manhattan,7002001,001438,Bellevue Hospital Center,50 to 69,112,F,Other Race,Spanish/Hispanic,1,Elective,Home or Self Care,2017,048,Thyroid disorders,010,THYROIDECTOMY;PART/FULL,404,"Thyroid, parathyroid & thyroglossal procedures",10,"Endocrine, Nutritional and Metabolic Diseases and Disorders",1,Minor,Minor,Surgical,Medicare,Medicaid,,,N,N,6333.57,4083.56
New York City,Manhattan,7002001,001438,Bellevue Hospital Center,30 to 49,113,F,Other Race,Not Span/Hispanic,3,Emergency,Home or Self Care,2017,048,Thyroid disorders,010,THYROIDECTOMY;PART/FULL,404,"Thyroid, parathyroid & thyroglossal procedures",10,"Endocrine, Nutritional and Metabolic Diseases and Disorders",2,Moderate,Minor,Surgical,Self-Pay,,,,N,N,18387.55,11855.34
New York City,Manhattan,7002001,001438,Bellevue Hospital Center,30 to 49,104,F,Other Race,Not Span/Hispanic,1,Emergency,Home or Self Care,2017,048,Thyroid disorders,011,DX ENDOCRINE PRCS,404,"Thyroid, parathyroid & thyroglossal procedures",10,"Endocrine, Nutritional and Metabolic Diseases and Disorders",1,Minor,Minor,Surgical,Medicaid,Medicaid,,,N,N,6333.57,4083.56
New York City,Manhattan,7002001,001438,Bellevue Hospital Center,50 to 69,104,F,Black/African American,Not Span/Hispanic,1,Emergency,Home or Self Care,2017,051,Other endocrine disorders,012,OT THER ENDOCRINE PRCS,404,"Thyroid, parathyroid & thyroglossal procedures",10,"Endocrine, Nutritional and Metabolic Diseases and Disorders",1,Minor,Minor,Surgical,Medicaid,Medicaid,,,N,N,6693.38,4315.54
New York City,Manhattan,7002001,001438,Bellevue Hospital Center,70 or Older,103,M,Other Race,Not Span/Hispanic,16,Emergency,Home w/ Home Health Services,2017,036,Cancer of thyroid,010,THYROIDECTOMY;PART/FULL,404,"Thyroid, parathyroid & thyroglossal procedures",10,"Endocrine, Nutritional and Metabolic Diseases and Disorders",3,Major,Major,Surgical,Medicaid,,,,N,Y,100788.63,64983.27
New York City,Manhattan,7002001,001438,Bellevue Hospital Center,30 to 49,111,F,Other Race,Not Span/Hispanic,1,Elective,Home or Self Care,2017,048,Thyroid disorders,010,THYROIDECTOMY;PART/FULL,404,"Thyroid, parathyroid & thyroglossal procedures",10,"Endocrine, Nutritional and Metabolic Diseases and Disorders",1,Minor,Minor,Surgical,Self-Pay,,,,N,N,2919.80,1882.54
New York City,Manhattan,7002001,001438,Bellevue Hospital Center,50 to 69,117,F,Other Race,Not Span/Hispanic,2,Emergency,Home or Self Care,2017,048,Thyroid disorders,010,THYROIDECTOMY;PART/FULL,404,"Thyroid, parathyroid & thyroglossal procedures",10,"Endocrine, Nutritional and Metabolic Diseases and Disorders",1,Minor,Minor,Surgical,Self-Pay,,,,N,N,12484.65,8049.45
New York City,Manhattan,7002001,001438,Bellevue Hospital Center,30 to 49,112,F,Other Race,Not Span/Hispanic,1,Emergency,Home or Self Care,2017,036,Cancer of thyroid,010,THYROIDECTOMY;PART/FULL,404,"Thyroid, parathyroid & thyroglossal procedures",10,"Endocrine, Nutritional and Metabolic Diseases and Disorders",2,Moderate,Moderate,Surgical,Self-Pay,,,,N,N,3477.50,2242.11
New York City,Manhattan,7002001,001438,Bellevue Hospital Center,30 to 49,104,F,Other Race,Not Span/Hispanic,3,Elective,Home or Self Care,2017,047,Other and unspecified benign neoplasm,012,OT THER ENDOCRINE PRCS,404,"Thyroid, parathyroid & thyroglossal procedures",10,"Endocrine, Nutritional and Metabolic Diseases and Disorders",1,Minor,Minor,Surgical,Medicaid,Medicaid,,,N,N,18433.89,11885.21
New York City,Manhattan,7002001,001438,Bellevue Hospital Center,30 to 49,104,F,Other Race,Spanish/Hispanic,1,Emergency,Home or Self Care,2017,051,Other endocrine disorders,012,OT THER ENDOCRINE PRCS,404,"Thyroid, parathyroid & thyroglossal procedures",10,"Endocrine, Nutritional and Metabolic Diseases and Disorders",1,Minor,Minor,Surgical,Medicaid,Medicaid,,,N,N,2837.31,1829.35
New York City,Manhattan,7002001,001438,Bellevue Hospital Center,30 to 49,112,F,Other Race,Not Span/Hispanic,5,Emergency,Home or Self Care,2017,036,Cancer of thyroid,010,THYROIDECTOMY;PART/FULL,404,"Thyroid, parathyroid & thyroglossal procedures",10,"Endocrine, Nutritional and Metabolic Diseases and Disorders",2,Moderate,Minor,Surgical,Medicaid,,,,N,N,34193.22,22046.01
New York City,Manhattan,7002001,001438,Bellevue Hospital Center,50 to 69,104,F,Black/African American,Not Span/Hispanic,1,Elective,Home or Self Care,2017,051,Other endocrine disorders,012,OT THER ENDOCRINE PRCS,404,"Thyroid, parathyroid & thyroglossal procedures",10,"Endocrine, Nutritional and Metabolic Diseases and Disorders",1,Minor,Minor,Surgical,Medicaid,Medicaid,,,N,N,2959.77,1908.31
New York City,Manhattan,7002001,001438,Bellevue Hospital Center,30 to 49,100,F,Other Race,Not Span/Hispanic,1,Elective,Home or Self Care,2017,048,Thyroid disorders,011,DX ENDOCRINE PRCS,404,"Thyroid, parathyroid & thyroglossal procedures",10,"Endocrine, Nutritional and Metabolic Diseases and Disorders",1,Minor,Minor,Surgical,Self-Pay,,,,N,N,6174.88,3981.24
New York City,Manhattan,7002001,001438,Bellevue Hospital Center,30 to 49,104,F,Other Race,Spanish/Hispanic,1,Emergency,Home or Self Care,2017,048,Thyroid disorders,030,TONSIL-/ADENOID-ECTOMY,404,"Thyroid, parathyroid & thyroglossal procedures",10,"Endocrine, Nutritional and Metabolic Diseases and Disorders",1,Minor,Minor,Surgical,Self-Pay,,,,N,N,7065.07,4555.19
New York City,Manhattan,7002001,001438,Bellevue Hospital Center,50 to 69,112,F,Other Race,Not Span/Hispanic,5,Emergency,Home or Self Care,2017,036,Cancer of thyroid,010,THYROIDECTOMY;PART/FULL,404,"Thyroid, parathyroid & thyroglossal procedures",10,"Endocrine, Nutritional and Metabolic Diseases and Disorders",3,Major,Major,Surgical,Medicaid,,,,N,N,38751.42,24984.90
New York City,Manhattan,7002001,001438,Bellevue Hospital Center,30 to 49,112,F,Other Race,Not Span/Hispanic,1,Emergency,Home or Self Care,2017,048,Thyroid disorders,010,THYROIDECTOMY;PART/FULL,404,"Thyroid, parathyroid & thyroglossal procedures",10,"Endocrine, Nutritional and Metabolic Diseases and Disorders",1,Minor,Minor,Surgical,Self-Pay,,,,N,N,3057.02,1971.01
New York City,Manhattan,7002001,001438,Bellevue Hospital Center,50 to 69,100,F,Black/African American,Not Span/Hispanic,2,Emergency,Home or Self Care,2017,036,Cancer of thyroid,010,THYROIDECTOMY;PART/FULL,404,"Thyroid, parathyroid & thyroglossal procedures",10,"Endocrine, Nutritional and Metabolic Diseases and Disorders",1,Minor,Minor,Surgical,Medicare,Medicare,,,N,N,9231.90,5952.25
New York City,Manhattan,7002001,001438,Bellevue Hospital Center,50 to 69,113,M,Black/African American,Not Span/Hispanic,4,Emergency,Home or Self Care,2017,048,Thyroid disorders,010,THYROIDECTOMY;PART/FULL,404,"Thyroid, parathyroid & thyroglossal procedures",10,"Endocrine, Nutritional and Metabolic Diseases and Disorders",1,Minor,Minor,Surgical,Department of Corrections,,,,N,N,22566.70,14549.83
New York City,Manhattan,7002001,001438,Bellevue Hospital Center,30 to 49,113,F,Other Race,Spanish/Hispanic,1,Emergency,Home or Self Care,2017,036,Cancer of thyroid,010,THYROIDECTOMY;PART/FULL,404,"Thyroid, parathyroid & thyroglossal procedures",10,"Endocrine, Nutritional and Metabolic Diseases and Disorders",1,Minor,Minor,Surgical,Medicaid,,,,N,N,2770.42,1786.22
New York City,Manhattan,7002001,001438,Bellevue Hospital Center,30 to 49,112,F,Other Race,Not Span/Hispanic,1,Emergency,Home or Self Care,2017,048,Thyroid disorders,010,THYROIDECTOMY;PART/FULL,404,"Thyroid, parathyroid & thyroglossal procedures",10,"Endocrine, Nutritional and Metabolic Diseases and Disorders",1,Minor,Minor,Surgical,Self-Pay,,,,N,N,3057.02,1971.01
