Hospital Service Area,Hospital County,Operating Certificate Number,Permanent Facility Id,Facility Name,Age Group,Zip Code - 3 digits,Gender,Race,Ethnicity,Length of Stay,Type of Admission,Patient Disposition,Discharge Year,CCS Diagnosis Code,CCS Diagnosis Description,CCS Procedure Code,CCS Procedure Description,APR DRG Code,APR DRG Description,APR MDC Code,APR MDC Description,APR Severity of Illness Code,APR Severity of Illness Description,APR Risk of Mortality,APR Medical Surgical Description,Payment Typology 1,Payment Typology 2,Payment Typology 3,Birth Weight,Abortion Edit Indicator,Emergency Department Indicator,Total Charges,Total Costs
New York City,Manhattan,7002001,001438,Bellevue Hospital Center,50 to 69,112,F,Black/African American,Not Span/Hispanic,2,Elective,Home or Self Care,2020,END001,THYROID DISORDERS,ENP002,THYROIDECTOMY,404,"THYROID, PARATHYROID & THYROGLOSSAL PROCEDURES",10,"ENDOCRINE, NUTRITIONAL AND METABOLIC DISEASES AND DISORDERS",1,Minor,Minor,Surgical,Private Health Insurance,,,,,N,47669.93,27414.21
New York City,Manhattan,7002001,001438,Bellevue Hospital Center,30 to 49,112,M,Black/African American,Not Span/Hispanic,2,Elective,Home or Self Care,2020,END001,THYROID DISORDERS,ENP002,THYROIDECTOMY,404,"THYROID, PARATHYROID & THYROGLOSSAL PROCEDURES",10,"ENDOCRINE, NUTRITIONAL AND METABOLIC DISEASES AND DISORDERS",2,Moderate,Moderate,Surgical,Medicaid,,,,,N,33641.51,19346.69
New York City,Manhattan,7002001,001438,Bellevue Hospital Center,30 to 49,113,F,Other Race,Spanish/Hispanic,3,Elective,Home or Self Care,2020,NEO050,ENDOCRINE SYSTEM CANCERS - THYROID,ENP002,THYROIDECTOMY,404,"THYROID, PARATHYROID & THYROGLOSSAL PROCEDURES",10,"ENDOCRINE, NUTRITIONAL AND METABOLIC DISEASES AND DISORDERS",2,Moderate,Moderate,Surgical,Private Health Insurance,,,,,N,82471.33,47427.94
New York City,Manhattan,7002001,001438,Bellevue Hospital Center,18 to 29,112,M,Other Race,Spanish/Hispanic,1,Elective,Home or Self Care,2020,END001,THYROID DISORDERS,ENP002,THYROIDECTOMY,404,"THYROID, PARATHYROID & THYROGLOSSAL PROCEDURES",10,"ENDOCRINE, NUTRITIONAL AND METABOLIC DISEASES AND DISORDERS",1,Minor,Minor,Surgical,Medicaid,,,,,N,23959.47,13778.71
New York City,Manhattan,7002001,001438,Bellevue Hospital Center,30 to 49,112,F,Black/African American,Not Span/Hispanic,1,Elective,Home or Self Care,2020,END001,THYROID DISORDERS,ENP002,THYROIDECTOMY,404,"THYROID, PARATHYROID & THYROGLOSSAL PROCEDURES",10,"ENDOCRINE, NUTRITIONAL AND METABOLIC DISEASES AND DISORDERS",1,Minor,Minor,Surgical,Medicaid,,,,,N,31655.18,18204.39
New York City,Manhattan,7002001,001438,Bellevue Hospital Center,50 to 69,113,F,Other Race,Not Span/Hispanic,2,Elective,Home or Self Care,2020,NEO050,ENDOCRINE SYSTEM CANCERS - THYROID,ENP002,THYROIDECTOMY,404,"THYROID, PARATHYROID & THYROGLOSSAL PROCEDURES",10,"ENDOCRINE, NUTRITIONAL AND METABOLIC DISEASES AND DISORDERS",1,Minor,Minor,Surgical,Medicaid,,,,,N,34984.85,20119.23
New York City,Manhattan,7002001,001438,Bellevue Hospital Center,30 to 49,104,M,Other Race,Spanish/Hispanic,1,Elective,Home or Self Care,2020,END001,THYROID DISORDERS,ENP002,THYROIDECTOMY,404,"THYROID, PARATHYROID & THYROGLOSSAL PROCEDURES",10,"ENDOCRINE, NUTRITIONAL AND METABOLIC DISEASES AND DISORDERS",1,Minor,Minor,Surgical,Private Health Insurance,,,,,N,28845.75,16588.73
New York City,Manhattan,7002001,001438,Bellevue Hospital Center,50 to 69,112,M,Black/African American,Not Span/Hispanic,1,Urgent,Home or Self Care,2020,END001,THYROID DISORDERS,ENP002,THYROIDECTOMY,404,"THYROID, PARATHYROID & THYROGLOSSAL PROCEDURES",10,"ENDOCRINE, NUTRITIONAL AND METABOLIC DISEASES AND DISORDERS",2,Moderate,Moderate,Surgical,Medicare,Medicaid,,,,N,37341.31,21474.39
New York City,Manhattan,7002001,001438,Bellevue Hospital Center,18 to 29,112,M,Other Race,Spanish/Hispanic,1,Elective,Home or Self Care,2020,END001,THYROID DISORDERS,ENP002,THYROIDECTOMY,404,"THYROID, PARATHYROID & THYROGLOSSAL PROCEDURES",10,"ENDOCRINE, NUTRITIONAL AND METABOLIC DISEASES AND DISORDERS",1,Minor,Minor,Surgical,Medicaid,,,,,N,31248.84,17970.71
New York City,Manhattan,7002001,001438,Bellevue Hospital Center,30 to 49,112,F,White,Spanish/Hispanic,5,Elective,Home or Self Care,2020,NEO050,ENDOCRINE SYSTEM CANCERS - THYROID,ENP002,THYROIDECTOMY,404,"THYROID, PARATHYROID & THYROGLOSSAL PROCEDURES",10,"ENDOCRINE, NUTRITIONAL AND METABOLIC DISEASES AND DISORDERS",2,Moderate,Moderate,Surgical,Medicaid,,,,,N,69558.5,40001.98
New York City,Manhattan,7002001,001438,Bellevue Hospital Center,30 to 49,113,F,Other Race,Spanish/Hispanic,1,Elective,Home or Self Care,2020,END001,THYROID DISORDERS,ENP002,THYROIDECTOMY,404,"THYROID, PARATHYROID & THYROGLOSSAL PROCEDURES",10,"ENDOCRINE, NUTRITIONAL AND METABOLIC DISEASES AND DISORDERS",1,Minor,Moderate,Surgical,Medicaid,,,,,N,26866.4,15450.44
New York City,Manhattan,7002001,001438,Bellevue Hospital Center,30 to 49,112,F,Other Race,Spanish/Hispanic,1,Elective,Home or Self Care,2020,END001,THYROID DISORDERS,ENP002,THYROIDECTOMY,404,"THYROID, PARATHYROID & THYROGLOSSAL PROCEDURES",10,"ENDOCRINE, NUTRITIONAL AND METABOLIC DISEASES AND DISORDERS",1,Minor,Minor,Surgical,Medicaid,,,,,N,31547.46,18142.44
New York City,Manhattan,7002001,001438,Bellevue Hospital Center,50 to 69,113,F,Other Race,Not Span/Hispanic,1,Elective,Home or Self Care,2020,NEO050,ENDOCRINE SYSTEM CANCERS - THYROID,ENP002,THYROIDECTOMY,404,"THYROID, PARATHYROID & THYROGLOSSAL PROCEDURES",10,"ENDOCRINE, NUTRITIONAL AND METABOLIC DISEASES AND DISORDERS",1,Minor,Minor,Surgical,Medicaid,,,,,N,29824.95,17151.85
New York City,Manhattan,7002001,001438,Bellevue Hospital Center,50 to 69,113,F,Other Race,Spanish/Hispanic,1,Elective,Home or Self Care,2020,END001,THYROID DISORDERS,ENP002,THYROIDECTOMY,404,"THYROID, PARATHYROID & THYROGLOSSAL PROCEDURES",10,"ENDOCRINE, NUTRITIONAL AND METABOLIC DISEASES AND DISORDERS",1,Minor,Moderate,Surgical,Private Health Insurance,,,,,N,29986.62,17244.83
New York City,Manhattan,7002001,001438,Bellevue Hospital Center,18 to 29,112,F,Other Race,Spanish/Hispanic,1,Elective,Home or Self Care,2020,NEO050,ENDOCRINE SYSTEM CANCERS - THYROID,ENP002,THYROIDECTOMY,404,"THYROID, PARATHYROID & THYROGLOSSAL PROCEDURES",10,"ENDOCRINE, NUTRITIONAL AND METABOLIC DISEASES AND DISORDERS",1,Minor,Minor,Surgical,Medicaid,,,,,N,26069.77,14992.31
New York City,Manhattan,7002001,001438,Bellevue Hospital Center,18 to 29,114,F,Other Race,Spanish/Hispanic,1,Elective,Home or Self Care,2020,END001,THYROID DISORDERS,ENP002,THYROIDECTOMY,404,"THYROID, PARATHYROID & THYROGLOSSAL PROCEDURES",10,"ENDOCRINE, NUTRITIONAL AND METABOLIC DISEASES AND DISORDERS",1,Minor,Minor,Surgical,Medicaid,,,,,N,27670.04,15912.6
New York City,Manhattan,7002001,001438,Bellevue Hospital Center,50 to 69,100,F,Other Race,Not Span/Hispanic,1,Elective,Home or Self Care,2020,END001,THYROID DISORDERS,ENP002,THYROIDECTOMY,404,"THYROID, PARATHYROID & THYROGLOSSAL PROCEDURES",10,"ENDOCRINE, NUTRITIONAL AND METABOLIC DISEASES AND DISORDERS",1,Minor,Minor,Surgical,Medicaid,,,,,N,26497.4,15238.23
New York City,Manhattan,7002001,001438,Bellevue Hospital Center,50 to 69,100,M,Other Race,Not Span/Hispanic,1,Elective,Home or Self Care,2020,END001,THYROID DISORDERS,ENP002,THYROIDECTOMY,404,"THYROID, PARATHYROID & THYROGLOSSAL PROCEDURES",10,"ENDOCRINE, NUTRITIONAL AND METABOLIC DISEASES AND DISORDERS",1,Minor,Minor,Surgical,Self-Pay,,,,,N,27113.66,15592.63
New York City,Manhattan,7002001,001438,Bellevue Hospital Center,30 to 49,113,M,Black/African American,Unknown,3,Elective,Court/Law Enforcement,2020,NEO073,BENIGN NEOPLASMS,ENP003,PARATHYROIDECTOMY,404,"THYROID, PARATHYROID & THYROGLOSSAL PROCEDURES",10,"ENDOCRINE, NUTRITIONAL AND METABOLIC DISEASES AND DISORDERS",1,Minor,Minor,Surgical,Medicaid,,,,,N,39131.58,22503.95
New York City,Manhattan,7002001,001438,Bellevue Hospital Center,50 to 69,104,F,Black/African American,Not Span/Hispanic,1,Elective,Home or Self Care,2020,END001,THYROID DISORDERS,ENP002,THYROIDECTOMY,404,"THYROID, PARATHYROID & THYROGLOSSAL PROCEDURES",10,"ENDOCRINE, NUTRITIONAL AND METABOLIC DISEASES AND DISORDERS",1,Minor,Minor,Surgical,Medicaid,,,,,N,22429.51,12898.85
New York City,Manhattan,7002001,001438,Bellevue Hospital Center,30 to 49,100,F,Other Race,Not Span/Hispanic,1,Elective,Home or Self Care,2020,NEO050,ENDOCRINE SYSTEM CANCERS - THYROID,ENP002,THYROIDECTOMY,404,"THYROID, PARATHYROID & THYROGLOSSAL PROCEDURES",10,"ENDOCRINE, NUTRITIONAL AND METABOLIC DISEASES AND DISORDERS",1,Minor,Minor,Surgical,Medicaid,,,,,N,25511.67,14671.35
New York City,Manhattan,7002001,001438,Bellevue Hospital Center,50 to 69,112,F,Other Race,Unknown,1,Elective,Home or Self Care,2020,NEO073,BENIGN NEOPLASMS,ENP003,PARATHYROIDECTOMY,404,"THYROID, PARATHYROID & THYROGLOSSAL PROCEDURES",10,"ENDOCRINE, NUTRITIONAL AND METABOLIC DISEASES AND DISORDERS",1,Minor,Minor,Surgical,Medicaid,,,,,N,37782.94,21728.36
New York City,Manhattan,7002001,001438,Bellevue Hospital Center,50 to 69,112,M,Black/African American,Not Span/Hispanic,1,Elective,Home or Self Care,2020,END001,THYROID DISORDERS,ENP002,THYROIDECTOMY,404,"THYROID, PARATHYROID & THYROGLOSSAL PROCEDURES",10,"ENDOCRINE, NUTRITIONAL AND METABOLIC DISEASES AND DISORDERS",2,Moderate,Minor,Surgical,Medicare,,,,,N,46320.6,26638.24
New York City,Manhattan,7002001,001438,Bellevue Hospital Center,18 to 29,100,F,Black/African American,Not Span/Hispanic,1,Elective,Home or Self Care,2020,NEO050,ENDOCRINE SYSTEM CANCERS - THYROID,ENP002,THYROIDECTOMY,404,"THYROID, PARATHYROID & THYROGLOSSAL PROCEDURES",10,"ENDOCRINE, NUTRITIONAL AND METABOLIC DISEASES AND DISORDERS",1,Minor,Minor,Surgical,Medicaid,,,,,N,38670.07,22238.54
New York City,Manhattan,7002001,001438,Bellevue Hospital Center,70 or Older,,F,Other Race,Spanish/Hispanic,1,Elective,Home or Self Care,2020,NEO050,ENDOCRINE SYSTEM CANCERS - THYROID,ENP002,THYROIDECTOMY,404,"THYROID, PARATHYROID & THYROGLOSSAL PROCEDURES",10,"ENDOCRINE, NUTRITIONAL AND METABOLIC DISEASES AND DISORDERS",1,Minor,Minor,Surgical,Medicaid,,,,,N,24844.36,14287.59
New York City,Manhattan,7002001,001438,Bellevue Hospital Center,30 to 49,100,M,Other Race,Spanish/Hispanic,3,Elective,Home or Self Care,2020,NEO050,ENDOCRINE SYSTEM CANCERS - THYROID,ENP002,THYROIDECTOMY,404,"THYROID, PARATHYROID & THYROGLOSSAL PROCEDURES",10,"ENDOCRINE, NUTRITIONAL AND METABOLIC DISEASES AND DISORDERS",2,Moderate,Moderate,Surgical,Medicaid,,,,,N,91112.91,52397.58
New York City,Manhattan,7002001,001438,Bellevue Hospital Center,70 or Older,114,F,Other Race,Not Span/Hispanic,3,Elective,Home or Self Care,2020,NEO050,ENDOCRINE SYSTEM CANCERS - THYROID,ENP002,THYROIDECTOMY,404,"THYROID, PARATHYROID & THYROGLOSSAL PROCEDURES",10,"ENDOCRINE, NUTRITIONAL AND METABOLIC DISEASES AND DISORDERS",2,Moderate,Moderate,Surgical,Medicaid,,,,,N,89543.88,51495.25
