Hospital Service Area,Hospital County,Operating Certificate Number,Permanent Facility Id,Facility Name,Age Group,Zip Code - 3 digits,Gender,Race,Ethnicity,Length of Stay,Type of Admission,Patient Disposition,Discharge Year,CCS Diagnosis Code,CCS Diagnosis Description,CCS Procedure Code,CCS Procedure Description,APR DRG Code,APR DRG Description,APR MDC Code,APR MDC Description,APR Severity of Illness Code,APR Severity of Illness Description,APR Risk of Mortality,APR Medical Surgical Description,Payment Typology 1,Payment Typology 2,Payment Typology 3,Birth Weight,Abortion Edit Indicator,Emergency Department Indicator,Total Charges,Total Costs
New York City,Manhattan,7002053,001463,NYU Langone Hospitals,50 to 69,115,M,White,Not Span/Hispanic,1,Elective,Home or Self Care,2020,NEO050,ENDOCRINE SYSTEM CANCERS - THYROID,ENP002,THYROIDECTOMY,404,"THYROID, PARATHYROID & THYROGLOSSAL PROCEDURES",10,"ENDOCRINE, NUTRITIONAL AND METABOLIC DISEASES AND DISORDERS",2,Moderate,Moderate,Surgical,Private Health Insurance,,,,,N,95591.03,15323.51
New York City,Manhattan,7002053,001463,NYU Langone Hospitals,50 to 69,113,M,Other Race,Unknown,2,Elective,Home w/ Home Health Services,2020,END001,THYROID DISORDERS,ENP002,THYROIDECTOMY,404,"THYROID, PARATHYROID & THYROGLOSSAL PROCEDURES",10,"ENDOCRINE, NUTRITIONAL AND METABOLIC DISEASES AND DISORDERS",1,Minor,Minor,Surgical,Private Health Insurance,,,,,N,94667.46,16937.73
New York City,Manhattan,7002053,001463,NYU Langone Hospitals,30 to 49,113,F,Other Race,Spanish/Hispanic,5,Elective,Home or Self Care,2020,NEO050,ENDOCRINE SYSTEM CANCERS - THYROID,ENP002,THYROIDECTOMY,404,"THYROID, PARATHYROID & THYROGLOSSAL PROCEDURES",10,"ENDOCRINE, NUTRITIONAL AND METABOLIC DISEASES AND DISORDERS",2,Moderate,Moderate,Surgical,Medicaid,,,,,N,210853.99,37553.18
New York City,Manhattan,7002053,001463,NYU Langone Hospitals,50 to 69,OOS,F,White,Spanish/Hispanic,4,Elective,Home or Self Care,2020,NEO050,ENDOCRINE SYSTEM CANCERS - THYROID,ENP002,THYROIDECTOMY,404,"THYROID, PARATHYROID & THYROGLOSSAL PROCEDURES",10,"ENDOCRINE, NUTRITIONAL AND METABOLIC DISEASES AND DISORDERS",1,Minor,Minor,Surgical,Medicare,Private Health Insurance,,,,N,112299.74,22850.26
New York City,Manhattan,7002053,001463,NYU Langone Hospitals,50 to 69,114,F,Other Race,Spanish/Hispanic,8,Elective,Home w/ Home Health Services,2020,NEO050,ENDOCRINE SYSTEM CANCERS - THYROID,ENP002,THYROIDECTOMY,404,"THYROID, PARATHYROID & THYROGLOSSAL PROCEDURES",10,"ENDOCRINE, NUTRITIONAL AND METABOLIC DISEASES AND DISORDERS",3,Major,Moderate,Surgical,Medicaid,,,,,N,333547,69949.88
New York City,Manhattan,7002053,001463,NYU Langone Hospitals,50 to 69,113,F,White,Not Span/Hispanic,6,Elective,Home w/ Home Health Services,2020,NEO050,ENDOCRINE SYSTEM CANCERS - THYROID,ENP002,THYROIDECTOMY,404,"THYROID, PARATHYROID & THYROGLOSSAL PROCEDURES",10,"ENDOCRINE, NUTRITIONAL AND METABOLIC DISEASES AND DISORDERS",2,Moderate,Moderate,Surgical,Medicaid,,,,,N,461756,83584.31
New York City,Manhattan,7002053,001463,NYU Langone Hospitals,50 to 69,100,F,Other Race,Spanish/Hispanic,1,Elective,Home or Self Care,2020,END001,THYROID DISORDERS,ENP002,THYROIDECTOMY,404,"THYROID, PARATHYROID & THYROGLOSSAL PROCEDURES",10,"ENDOCRINE, NUTRITIONAL AND METABOLIC DISEASES AND DISORDERS",1,Minor,Minor,Surgical,Medicare,Private Health Insurance,,,,N,122579.46,18432.55
New York City,Manhattan,7002053,001463,NYU Langone Hospitals,18 to 29,112,M,White,Not Span/Hispanic,1,Elective,Home or Self Care,2020,NEO050,ENDOCRINE SYSTEM CANCERS - THYROID,ENP002,THYROIDECTOMY,404,"THYROID, PARATHYROID & THYROGLOSSAL PROCEDURES",10,"ENDOCRINE, NUTRITIONAL AND METABOLIC DISEASES AND DISORDERS",2,Moderate,Moderate,Surgical,Private Health Insurance,,,,,N,165724.84,24590.63
New York City,Manhattan,7002053,001463,NYU Langone Hospitals,30 to 49,100,M,White,Not Span/Hispanic,2,Elective,Home or Self Care,2020,NEO050,ENDOCRINE SYSTEM CANCERS - THYROID,ENP002,THYROIDECTOMY,404,"THYROID, PARATHYROID & THYROGLOSSAL PROCEDURES",10,"ENDOCRINE, NUTRITIONAL AND METABOLIC DISEASES AND DISORDERS",2,Moderate,Moderate,Surgical,Medicaid,,,,,N,103534.06,21049.67
New York City,Manhattan,7002053,001463,NYU Langone Hospitals,50 to 69,112,F,White,Spanish/Hispanic,1,Elective,Home or Self Care,2020,NEO050,ENDOCRINE SYSTEM CANCERS - THYROID,ENP002,THYROIDECTOMY,404,"THYROID, PARATHYROID & THYROGLOSSAL PROCEDURES",10,"ENDOCRINE, NUTRITIONAL AND METABOLIC DISEASES AND DISORDERS",2,Moderate,Moderate,Surgical,Medicaid,,,,,N,118034.11,18067.65
New York City,Manhattan,7002053,001463,NYU Langone Hospitals,30 to 49,104,F,Other Race,Spanish/Hispanic,1,Elective,Home or Self Care,2020,NEO050,ENDOCRINE SYSTEM CANCERS - THYROID,ENP002,THYROIDECTOMY,404,"THYROID, PARATHYROID & THYROGLOSSAL PROCEDURES",10,"ENDOCRINE, NUTRITIONAL AND METABOLIC DISEASES AND DISORDERS",1,Minor,Minor,Surgical,Blue Cross/Blue Shield,,,,,N,79867.61,14354.32
New York City,Manhattan,7002053,001463,NYU Langone Hospitals,70 or Older,113,F,White,Not Span/Hispanic,2,Elective,Home or Self Care,2020,NEO050,ENDOCRINE SYSTEM CANCERS - THYROID,ENP002,THYROIDECTOMY,404,"THYROID, PARATHYROID & THYROGLOSSAL PROCEDURES",10,"ENDOCRINE, NUTRITIONAL AND METABOLIC DISEASES AND DISORDERS",2,Moderate,Moderate,Surgical,Medicare,Blue Cross/Blue Shield,,,,N,85907.9,18277.46
New York City,Manhattan,7002053,001463,NYU Langone Hospitals,50 to 69,112,F,White,Not Span/Hispanic,12,Elective,Home w/ Home Health Services,2020,END001,THYROID DISORDERS,ENP002,THYROIDECTOMY,404,"THYROID, PARATHYROID & THYROGLOSSAL PROCEDURES",10,"ENDOCRINE, NUTRITIONAL AND METABOLIC DISEASES AND DISORDERS",3,Major,Major,Surgical,Blue Cross/Blue Shield,,,,,N,331699.19,89670.6
New York City,Manhattan,7002053,001463,NYU Langone Hospitals,70 or Older,104,F,Black/African American,Not Span/Hispanic,1,Elective,Home or Self Care,2020,NEO050,ENDOCRINE SYSTEM CANCERS - THYROID,ENP002,THYROIDECTOMY,404,"THYROID, PARATHYROID & THYROGLOSSAL PROCEDURES",10,"ENDOCRINE, NUTRITIONAL AND METABOLIC DISEASES AND DISORDERS",1,Minor,Minor,Surgical,Medicare,Private Health Insurance,,,,N,115602.65,18433.99
New York City,Manhattan,7002053,001463,NYU Langone Hospitals,30 to 49,104,F,Other Race,Not Span/Hispanic,3,Elective,Home or Self Care,2020,NEO050,ENDOCRINE SYSTEM CANCERS - THYROID,ENP002,THYROIDECTOMY,404,"THYROID, PARATHYROID & THYROGLOSSAL PROCEDURES",10,"ENDOCRINE, NUTRITIONAL AND METABOLIC DISEASES AND DISORDERS",2,Moderate,Moderate,Surgical,Medicaid,,,,,N,110484.99,24738.76
New York City,Manhattan,7002053,001463,NYU Langone Hospitals,50 to 69,113,M,Other Race,Not Span/Hispanic,1,Elective,Home or Self Care,2020,NEO050,ENDOCRINE SYSTEM CANCERS - THYROID,ENP002,THYROIDECTOMY,404,"THYROID, PARATHYROID & THYROGLOSSAL PROCEDURES",10,"ENDOCRINE, NUTRITIONAL AND METABOLIC DISEASES AND DISORDERS",2,Moderate,Moderate,Surgical,Medicare,,,,,N,126287.63,20546.24
New York City,Manhattan,7002053,001463,NYU Langone Hospitals,50 to 69,104,F,Black/African American,Not Span/Hispanic,6,Elective,Home or Self Care,2020,END015,OTHER SPECIFIED AND UNSPECIFIED ENDOCRINE DISORDERS,ENP003,PARATHYROIDECTOMY,404,"THYROID, PARATHYROID & THYROGLOSSAL PROCEDURES",10,"ENDOCRINE, NUTRITIONAL AND METABOLIC DISEASES AND DISORDERS",3,Major,Major,Surgical,Medicare,Medicare,,,,N,171366.62,58739.35
New York City,Manhattan,7002053,001463,NYU Langone Hospitals,50 to 69,112,M,Black/African American,Unknown,5,Elective,Home or Self Care,2020,END001,THYROID DISORDERS,ENP002,THYROIDECTOMY,404,"THYROID, PARATHYROID & THYROGLOSSAL PROCEDURES",10,"ENDOCRINE, NUTRITIONAL AND METABOLIC DISEASES AND DISORDERS",1,Minor,Minor,Surgical,Blue Cross/Blue Shield,,,,,N,167699.16,37981.51
New York City,Manhattan,7002053,001463,NYU Langone Hospitals,70 or Older,100,F,White,Not Span/Hispanic,2,Elective,Home or Self Care,2020,NEO073,BENIGN NEOPLASMS,ENP003,PARATHYROIDECTOMY,404,"THYROID, PARATHYROID & THYROGLOSSAL PROCEDURES",10,"ENDOCRINE, NUTRITIONAL AND METABOLIC DISEASES AND DISORDERS",3,Major,Moderate,Surgical,Medicare,Blue Cross/Blue Shield,,,,N,62456.27,14846.67
New York City,Manhattan,7002053,001463,NYU Langone Hospitals,50 to 69,112,M,White,Not Span/Hispanic,1,Elective,Home or Self Care,2020,NEO050,ENDOCRINE SYSTEM CANCERS - THYROID,ENP002,THYROIDECTOMY,404,"THYROID, PARATHYROID & THYROGLOSSAL PROCEDURES",10,"ENDOCRINE, NUTRITIONAL AND METABOLIC DISEASES AND DISORDERS",2,Moderate,Moderate,Surgical,Medicaid,,,,,N,132777.85,21138.23
