Hospital Service Area,Hospital County,Operating Certificate Number,Permanent Facility Id,Facility Name,Age Group,Zip Code - 3 digits,Gender,Race,Ethnicity,Length of Stay,Type of Admission,Patient Disposition,Discharge Year,CCS Diagnosis Code,CCS Diagnosis Description,CCS Procedure Code,CCS Procedure Description,APR DRG Code,APR DRG Description,APR MDC Code,APR MDC Description,APR Severity of Illness Code,APR Severity of Illness Description,APR Risk of Mortality,APR Medical Surgical Description,Payment Typology 1,Payment Typology 2,Payment Typology 3,Birth Weight,Abortion Edit Indicator,Emergency Department Indicator,Total Charges,Total Costs
New York City,Manhattan,7002053,001463,NYU Langone Hospitals,70 or Older,100,F,White,Not Span/Hispanic,9,Emergency,Home w/ Home Health Services,2020,NEO048,NERVOUS SYSTEM CANCERS - BRAIN,MAM011,ELECTROENCEPHALOGRAM (EEG),041,NERVOUS SYSTEM MALIGNANCY,01,DISEASES AND DISORDERS OF THE NERVOUS SYSTEM,3,Major,Major,Medical,Medicare,,,,,Y,187197.44,44190.8
New York City,Manhattan,7002053,001463,NYU Langone Hospitals,70 or Older,100,M,Multi-racial,Spanish/Hispanic,1,Emergency,Home w/ Home Health Services,2020,NEO070,SECONDARY MALIGNANCIES,,,041,NERVOUS SYSTEM MALIGNANCY,01,DISEASES AND DISORDERS OF THE NERVOUS SYSTEM,3,Major,Major,Medical,Medicare,Private Health Insurance,,,,Y,15920.94,4399.75
New York City,Manhattan,7002053,001463,NYU Langone Hospitals,30 to 49,112,F,Black/African American,Not Span/Hispanic,2,Emergency,Home or Self Care,2020,NEO049,NERVOUS SYSTEM CANCERS - ALL OTHER TYPES,CNS002,LUMBAR PUNCTURE,041,NERVOUS SYSTEM MALIGNANCY,01,DISEASES AND DISORDERS OF THE NERVOUS SYSTEM,1,Minor,Minor,Medical,Private Health Insurance,,,,,N,72994.74,11315.94
New York City,Manhattan,7002053,001463,NYU Langone Hospitals,70 or Older,112,F,White,Not Span/Hispanic,2,Elective,Home or Self Care,2020,NEO070,SECONDARY MALIGNANCIES,CNS001,MINIMALLY INVASIVE CNS BIOPSY,041,NERVOUS SYSTEM MALIGNANCY,01,DISEASES AND DISORDERS OF THE NERVOUS SYSTEM,2,Moderate,Major,Medical,Medicare,Medicare,,,,N,117987.41,20076.51
New York City,Manhattan,7002053,001463,NYU Langone Hospitals,50 to 69,112,F,Black/African American,Not Span/Hispanic,17,Emergency,Skilled Nursing Home,2020,NEO070,SECONDARY MALIGNANCIES,,,041,NERVOUS SYSTEM MALIGNANCY,01,DISEASES AND DISORDERS OF THE NERVOUS SYSTEM,3,Major,Major,Medical,Medicare,Medicaid,,,,Y,230458.18,79707.97
New York City,Manhattan,7002053,001463,NYU Langone Hospitals,18 to 29,120,M,White,Not Span/Hispanic,2,Elective,Home or Self Care,2020,NEO048,NERVOUS SYSTEM CANCERS - BRAIN,CNS001,MINIMALLY INVASIVE CNS BIOPSY,041,NERVOUS SYSTEM MALIGNANCY,01,DISEASES AND DISORDERS OF THE NERVOUS SYSTEM,1,Minor,Minor,Medical,Private Health Insurance,,,,,N,124808.63,22147.51
New York City,Manhattan,7002053,001463,NYU Langone Hospitals,0 to 17,112,F,Other Race,Not Span/Hispanic,2,Emergency,Home or Self Care,2020,NEO048,NERVOUS SYSTEM CANCERS - BRAIN,,,041,NERVOUS SYSTEM MALIGNANCY,01,DISEASES AND DISORDERS OF THE NERVOUS SYSTEM,2,Moderate,Major,Medical,Medicaid,,,,,Y,38033.52,7032.2
New York City,Manhattan,7002053,001463,NYU Langone Hospitals,0 to 17,112,F,Black/African American,Not Span/Hispanic,3,Emergency,Home or Self Care,2020,NEO048,NERVOUS SYSTEM CANCERS - BRAIN,ADM021,"ADMINISTRATION OF THERAPEUTIC SUBSTANCES, NEC",041,NERVOUS SYSTEM MALIGNANCY,01,DISEASES AND DISORDERS OF THE NERVOUS SYSTEM,4,Extreme,Major,Medical,Medicaid,,,,,Y,55583.81,12317.56
New York City,Manhattan,7002053,001463,NYU Langone Hospitals,50 to 69,100,M,White,Not Span/Hispanic,1,Elective,Home or Self Care,2020,NEO048,NERVOUS SYSTEM CANCERS - BRAIN,OTR002,COMPUTER-ASSISTED PROCEDURES,041,NERVOUS SYSTEM MALIGNANCY,01,DISEASES AND DISORDERS OF THE NERVOUS SYSTEM,2,Moderate,Major,Medical,Private Health Insurance,,,,,N,90864.84,14310.82
New York City,Manhattan,7002053,001463,NYU Langone Hospitals,50 to 69,101,M,Black/African American,Not Span/Hispanic,1,Emergency,Home or Self Care,2020,NEO048,NERVOUS SYSTEM CANCERS - BRAIN,,,041,NERVOUS SYSTEM MALIGNANCY,01,DISEASES AND DISORDERS OF THE NERVOUS SYSTEM,2,Moderate,Moderate,Medical,Private Health Insurance,,,,,Y,23876.95,4584.2
New York City,Manhattan,7002053,001463,NYU Langone Hospitals,70 or Older,100,M,White,Not Span/Hispanic,2,Emergency,Home w/ Home Health Services,2020,NEO070,SECONDARY MALIGNANCIES,,,041,NERVOUS SYSTEM MALIGNANCY,01,DISEASES AND DISORDERS OF THE NERVOUS SYSTEM,3,Major,Major,Medical,Medicare,,,,,Y,33994.12,9298.84
New York City,Manhattan,7002053,001463,NYU Langone Hospitals,70 or Older,100,F,White,Not Span/Hispanic,8,Emergency,Skilled Nursing Home,2020,NEO070,SECONDARY MALIGNANCIES,,,041,NERVOUS SYSTEM MALIGNANCY,01,DISEASES AND DISORDERS OF THE NERVOUS SYSTEM,2,Moderate,Moderate,Medical,Medicare,,,,,Y,101054.97,30422.06
New York City,Manhattan,7002053,001463,NYU Langone Hospitals,50 to 69,100,M,Black/African American,Not Span/Hispanic,7,Emergency,Home or Self Care,2020,NEO048,NERVOUS SYSTEM CANCERS - BRAIN,CNS001,MINIMALLY INVASIVE CNS BIOPSY,041,NERVOUS SYSTEM MALIGNANCY,01,DISEASES AND DISORDERS OF THE NERVOUS SYSTEM,3,Major,Major,Medical,Medicaid,,,,,Y,237567.88,43382.26
New York City,Manhattan,7002053,001463,NYU Langone Hospitals,50 to 69,101,M,Black/African American,Not Span/Hispanic,6,Emergency,Skilled Nursing Home,2020,NEO048,NERVOUS SYSTEM CANCERS - BRAIN,,,041,NERVOUS SYSTEM MALIGNANCY,01,DISEASES AND DISORDERS OF THE NERVOUS SYSTEM,3,Major,Extreme,Medical,Private Health Insurance,,,,,Y,58349.78,19919.4
New York City,Manhattan,7002053,001463,NYU Langone Hospitals,50 to 69,124,F,White,Not Span/Hispanic,2,Emergency,Home or Self Care,2020,NEO048,NERVOUS SYSTEM CANCERS - BRAIN,RAD001,BEAM RADIATION,041,NERVOUS SYSTEM MALIGNANCY,01,DISEASES AND DISORDERS OF THE NERVOUS SYSTEM,3,Major,Minor,Medical,Medicaid,,,,,Y,69453.81,12971.39
New York City,Manhattan,7002053,001463,NYU Langone Hospitals,30 to 49,100,F,White,Not Span/Hispanic,2,Emergency,Home or Self Care,2020,NEO070,SECONDARY MALIGNANCIES,MAM011,ELECTROENCEPHALOGRAM (EEG),041,NERVOUS SYSTEM MALIGNANCY,01,DISEASES AND DISORDERS OF THE NERVOUS SYSTEM,2,Moderate,Major,Medical,Private Health Insurance,,,,,Y,91592.61,11276.08
New York City,Manhattan,7002053,001463,NYU Langone Hospitals,0 to 17,112,F,White,Not Span/Hispanic,17,Urgent,Home or Self Care,2020,NEO048,NERVOUS SYSTEM CANCERS - BRAIN,CAR025,PLACEMENT OF TUNNELED OR IMPLANTABLE PORTION OF A VASCULAR ACCESS DEVICE,041,NERVOUS SYSTEM MALIGNANCY,01,DISEASES AND DISORDERS OF THE NERVOUS SYSTEM,3,Major,Major,Medical,Medicaid,,,,,N,251963.39,55230.34
New York City,Manhattan,7002053,001463,NYU Langone Hospitals,50 to 69,124,F,White,Not Span/Hispanic,2,Emergency,Home w/ Home Health Services,2020,NEO048,NERVOUS SYSTEM CANCERS - BRAIN,MAM011,ELECTROENCEPHALOGRAM (EEG),041,NERVOUS SYSTEM MALIGNANCY,01,DISEASES AND DISORDERS OF THE NERVOUS SYSTEM,3,Major,Moderate,Medical,Medicaid,,,,,Y,81639.33,9630.87
New York City,Manhattan,7002053,001463,NYU Langone Hospitals,50 to 69,112,M,Black/African American,Not Span/Hispanic,13,Emergency,Skilled Nursing Home,2020,NEO048,NERVOUS SYSTEM CANCERS - BRAIN,,,041,NERVOUS SYSTEM MALIGNANCY,01,DISEASES AND DISORDERS OF THE NERVOUS SYSTEM,3,Major,Extreme,Medical,Medicaid,,,,,N,128904.46,42811.29
New York City,Manhattan,7002053,001463,NYU Langone Hospitals,50 to 69,111,F,White,Not Span/Hispanic,8,Emergency,Home w/ Home Health Services,2020,NEO070,SECONDARY MALIGNANCIES,RAD001,BEAM RADIATION,041,NERVOUS SYSTEM MALIGNANCY,01,DISEASES AND DISORDERS OF THE NERVOUS SYSTEM,3,Major,Major,Medical,Blue Cross/Blue Shield,,,,,Y,153149.23,40912.03
New York City,Manhattan,7002053,001463,NYU Langone Hospitals,50 to 69,112,F,White,Not Span/Hispanic,4,Emergency,Short-term Hospital,2020,NEO048,NERVOUS SYSTEM CANCERS - BRAIN,,,041,NERVOUS SYSTEM MALIGNANCY,01,DISEASES AND DISORDERS OF THE NERVOUS SYSTEM,3,Major,Major,Medical,Medicare,,,,,Y,110942.49,30377.84
New York City,Manhattan,7002053,001463,NYU Langone Hospitals,50 to 69,100,M,White,Not Span/Hispanic,2,Emergency,Left Against Medical Advice,2020,NEO048,NERVOUS SYSTEM CANCERS - BRAIN,,,041,NERVOUS SYSTEM MALIGNANCY,01,DISEASES AND DISORDERS OF THE NERVOUS SYSTEM,2,Moderate,Major,Medical,Medicaid,,,,,Y,38056.65,8696.32
New York City,Manhattan,7002053,001463,NYU Langone Hospitals,50 to 69,112,F,Other Race,Not Span/Hispanic,4,Emergency,Home w/ Home Health Services,2020,NEO048,NERVOUS SYSTEM CANCERS - BRAIN,CNS001,MINIMALLY INVASIVE CNS BIOPSY,041,NERVOUS SYSTEM MALIGNANCY,01,DISEASES AND DISORDERS OF THE NERVOUS SYSTEM,3,Major,Major,Medical,Blue Cross/Blue Shield,,,,,Y,189411.25,33891.02
New York City,Manhattan,7002053,001463,NYU Langone Hospitals,18 to 29,111,F,Other Race,Spanish/Hispanic,8,Emergency,Home w/ Home Health Services,2020,NEO070,SECONDARY MALIGNANCIES,RAD004,"RADIATION THERAPY, NEC",041,NERVOUS SYSTEM MALIGNANCY,01,DISEASES AND DISORDERS OF THE NERVOUS SYSTEM,3,Major,Major,Medical,Private Health Insurance,,,,,Y,123834.02,42442.58
New York City,Manhattan,7002053,001463,NYU Langone Hospitals,70 or Older,OOS,F,Other Race,Not Span/Hispanic,4,Emergency,Hospice - Home,2020,NEO070,SECONDARY MALIGNANCIES,MAM011,ELECTROENCEPHALOGRAM (EEG),041,NERVOUS SYSTEM MALIGNANCY,01,DISEASES AND DISORDERS OF THE NERVOUS SYSTEM,3,Major,Major,Medical,Medicare,,,,,Y,83991.38,16646.38
New York City,Manhattan,7002053,001463,NYU Langone Hospitals,50 to 69,114,F,Black/African American,Not Span/Hispanic,3,Emergency,Left Against Medical Advice,2020,NEO070,SECONDARY MALIGNANCIES,MAM011,ELECTROENCEPHALOGRAM (EEG),041,NERVOUS SYSTEM MALIGNANCY,01,DISEASES AND DISORDERS OF THE NERVOUS SYSTEM,2,Moderate,Major,Medical,Private Health Insurance,,,,,Y,113307.01,13645
New York City,Manhattan,7002053,001463,NYU Langone Hospitals,70 or Older,100,F,White,Not Span/Hispanic,1,Emergency,Hospice - Medical Facility,2020,NEO070,SECONDARY MALIGNANCIES,OTR004,ISOLATION PROCEDURES,041,NERVOUS SYSTEM MALIGNANCY,01,DISEASES AND DISORDERS OF THE NERVOUS SYSTEM,3,Major,Major,Medical,Medicare,Medicare,,,,Y,48311.27,5857.77
New York City,Manhattan,7002053,001463,NYU Langone Hospitals,50 to 69,111,F,White,Not Span/Hispanic,1,Emergency,Home w/ Home Health Services,2020,NEO070,SECONDARY MALIGNANCIES,,,041,NERVOUS SYSTEM MALIGNANCY,01,DISEASES AND DISORDERS OF THE NERVOUS SYSTEM,3,Major,Major,Medical,Blue Cross/Blue Shield,,,,,Y,27890.04,5278.23
New York City,Manhattan,7002053,001463,NYU Langone Hospitals,70 or Older,112,F,Black/African American,Not Span/Hispanic,1,Emergency,Home w/ Home Health Services,2020,NEO070,SECONDARY MALIGNANCIES,RAD004,"RADIATION THERAPY, NEC",041,NERVOUS SYSTEM MALIGNANCY,01,DISEASES AND DISORDERS OF THE NERVOUS SYSTEM,3,Major,Major,Medical,Medicare,,,,,Y,59185.39,13888.79
New York City,Manhattan,7002053,001463,NYU Langone Hospitals,30 to 49,112,F,White,Not Span/Hispanic,2,Emergency,Hospice - Home,2020,NEO048,NERVOUS SYSTEM CANCERS - BRAIN,,,041,NERVOUS SYSTEM MALIGNANCY,01,DISEASES AND DISORDERS OF THE NERVOUS SYSTEM,3,Major,Extreme,Medical,Blue Cross/Blue Shield,,,,,Y,79604.4,13445.93
New York City,Manhattan,7002053,001463,NYU Langone Hospitals,50 to 69,104,M,Black/African American,Not Span/Hispanic,1,Emergency,Skilled Nursing Home,2020,NEO048,NERVOUS SYSTEM CANCERS - BRAIN,,,041,NERVOUS SYSTEM MALIGNANCY,01,DISEASES AND DISORDERS OF THE NERVOUS SYSTEM,3,Major,Extreme,Medical,Private Health Insurance,,,,,Y,30977.58,9784.6
New York City,Manhattan,7002053,001463,NYU Langone Hospitals,50 to 69,113,F,Other Race,Not Span/Hispanic,5,Emergency,Home or Self Care,2020,NEO070,SECONDARY MALIGNANCIES,MAM011,ELECTROENCEPHALOGRAM (EEG),041,NERVOUS SYSTEM MALIGNANCY,01,DISEASES AND DISORDERS OF THE NERVOUS SYSTEM,4,Extreme,Extreme,Medical,Blue Cross/Blue Shield,Medicare,,,,Y,140409.6,27187.36
New York City,Manhattan,7002053,001463,NYU Langone Hospitals,0 to 17,112,F,Black/African American,Not Span/Hispanic,5,Emergency,Home or Self Care,2020,NEO048,NERVOUS SYSTEM CANCERS - BRAIN,ADM012,CHEMOTHERAPY,041,NERVOUS SYSTEM MALIGNANCY,01,DISEASES AND DISORDERS OF THE NERVOUS SYSTEM,1,Minor,Minor,Medical,Private Health Insurance,,,,,Y,100989.57,20628.57
New York City,Manhattan,7002053,001463,NYU Langone Hospitals,30 to 49,112,F,Other Race,Spanish/Hispanic,2,Emergency,Hospice - Home,2020,NEO070,SECONDARY MALIGNANCIES,,,041,NERVOUS SYSTEM MALIGNANCY,01,DISEASES AND DISORDERS OF THE NERVOUS SYSTEM,3,Major,Major,Medical,Medicaid,,,,,Y,57152.54,12991.76
New York City,Manhattan,7002053,001463,NYU Langone Hospitals,18 to 29,113,M,White,Not Span/Hispanic,16,Urgent,Home or Self Care,2020,NEO070,SECONDARY MALIGNANCIES,CAR025,PLACEMENT OF TUNNELED OR IMPLANTABLE PORTION OF A VASCULAR ACCESS DEVICE,041,NERVOUS SYSTEM MALIGNANCY,01,DISEASES AND DISORDERS OF THE NERVOUS SYSTEM,1,Minor,Moderate,Medical,Medicaid,,,,,N,377502.9,88161.88
New York City,Manhattan,7002053,001463,NYU Langone Hospitals,30 to 49,114,F,Other Race,Not Span/Hispanic,3,Emergency,Home or Self Care,2020,NEO048,NERVOUS SYSTEM CANCERS - BRAIN,CNS001,MINIMALLY INVASIVE CNS BIOPSY,041,NERVOUS SYSTEM MALIGNANCY,01,DISEASES AND DISORDERS OF THE NERVOUS SYSTEM,3,Major,Minor,Medical,Medicaid,,,,,Y,175215.16,33103.14
New York City,Manhattan,7002053,001463,NYU Langone Hospitals,30 to 49,100,M,White,Not Span/Hispanic,1,Emergency,Home w/ Home Health Services,2020,NEO070,SECONDARY MALIGNANCIES,MAM011,ELECTROENCEPHALOGRAM (EEG),041,NERVOUS SYSTEM MALIGNANCY,01,DISEASES AND DISORDERS OF THE NERVOUS SYSTEM,3,Major,Major,Medical,Blue Cross/Blue Shield,,,,,Y,94217.83,19530.05
New York City,Manhattan,7002053,001463,NYU Langone Hospitals,70 or Older,100,M,Other Race,Not Span/Hispanic,4,Emergency,Home or Self Care,2020,NEO070,SECONDARY MALIGNANCIES,GIS004,GI SYSTEM ENDOSCOPY WITHOUT BIOPSY (DIAGNOSTIC),041,NERVOUS SYSTEM MALIGNANCY,01,DISEASES AND DISORDERS OF THE NERVOUS SYSTEM,2,Moderate,Major,Medical,Medicare,Medicaid,,,,Y,110372.44,26983.78
New York City,Manhattan,7002053,001463,NYU Langone Hospitals,50 to 69,113,M,Other Race,Not Span/Hispanic,26,Emergency,Home w/ Home Health Services,2020,NEO070,SECONDARY MALIGNANCIES,RAD004,"RADIATION THERAPY, NEC",041,NERVOUS SYSTEM MALIGNANCY,01,DISEASES AND DISORDERS OF THE NERVOUS SYSTEM,4,Extreme,Extreme,Medical,Blue Cross/Blue Shield,,,,,Y,618926.19,161905.92
New York City,Manhattan,7002053,001463,NYU Langone Hospitals,30 to 49,100,F,Other Race,Not Span/Hispanic,1,Emergency,Home or Self Care,2020,NEO048,NERVOUS SYSTEM CANCERS - BRAIN,,,041,NERVOUS SYSTEM MALIGNANCY,01,DISEASES AND DISORDERS OF THE NERVOUS SYSTEM,3,Major,Moderate,Medical,Private Health Insurance,,,,,Y,46562.62,10571.74
New York City,Manhattan,7002053,001463,NYU Langone Hospitals,50 to 69,112,F,Black/African American,Not Span/Hispanic,14,Emergency,Skilled Nursing Home,2020,NEO070,SECONDARY MALIGNANCIES,RAD004,"RADIATION THERAPY, NEC",041,NERVOUS SYSTEM MALIGNANCY,01,DISEASES AND DISORDERS OF THE NERVOUS SYSTEM,3,Major,Major,Medical,Medicaid,,,,,Y,347990.44,96284.47
New York City,Manhattan,7002053,001463,NYU Langone Hospitals,18 to 29,103,F,White,Not Span/Hispanic,7,Emergency,Hospice - Home,2020,NEO048,NERVOUS SYSTEM CANCERS - BRAIN,,,041,NERVOUS SYSTEM MALIGNANCY,01,DISEASES AND DISORDERS OF THE NERVOUS SYSTEM,2,Moderate,Minor,Medical,Blue Cross/Blue Shield,,,,,Y,106474.81,24137.2
New York City,Manhattan,7002053,001463,NYU Langone Hospitals,50 to 69,111,F,White,Not Span/Hispanic,17,Emergency,Skilled Nursing Home,2020,NEO070,SECONDARY MALIGNANCIES,CNS002,LUMBAR PUNCTURE,041,NERVOUS SYSTEM MALIGNANCY,01,DISEASES AND DISORDERS OF THE NERVOUS SYSTEM,3,Major,Major,Medical,Medicaid,,,,,Y,467346.87,102529.61
New York City,Manhattan,7002053,001463,NYU Langone Hospitals,70 or Older,113,F,Other Race,Unknown,6,Emergency,Inpatient Rehabilitation Facility,2020,NEO048,NERVOUS SYSTEM CANCERS - BRAIN,CAR028,INFERIOR VENA CAVA (IVC) FILTER PROCEDURES,041,NERVOUS SYSTEM MALIGNANCY,01,DISEASES AND DISORDERS OF THE NERVOUS SYSTEM,3,Major,Extreme,Medical,Medicaid,,,,,Y,255561.88,53466.35
New York City,Manhattan,7002053,001463,NYU Langone Hospitals,30 to 49,101,M,White,Not Span/Hispanic,6,Emergency,Inpatient Rehabilitation Facility,2020,NEO048,NERVOUS SYSTEM CANCERS - BRAIN,MAM011,ELECTROENCEPHALOGRAM (EEG),041,NERVOUS SYSTEM MALIGNANCY,01,DISEASES AND DISORDERS OF THE NERVOUS SYSTEM,2,Moderate,Moderate,Medical,Private Health Insurance,,,,,Y,154081.56,32716.25
New York City,Manhattan,7002053,001463,NYU Langone Hospitals,30 to 49,112,F,Black/African American,Not Span/Hispanic,16,Emergency,Home w/ Home Health Services,2020,NEO070,SECONDARY MALIGNANCIES,CAR024,VENOUS AND ARTERIAL CATHETER PLACEMENT,041,NERVOUS SYSTEM MALIGNANCY,01,DISEASES AND DISORDERS OF THE NERVOUS SYSTEM,4,Extreme,Extreme,Medical,Medicaid,,,,,Y,372538.43,127962.78
New York City,Manhattan,7002053,001463,NYU Langone Hospitals,30 to 49,114,F,Black/African American,Not Span/Hispanic,11,Emergency,Home w/ Home Health Services,2020,NEO070,SECONDARY MALIGNANCIES,ADM012,CHEMOTHERAPY,041,NERVOUS SYSTEM MALIGNANCY,01,DISEASES AND DISORDERS OF THE NERVOUS SYSTEM,3,Major,Extreme,Medical,Medicaid,,,,,Y,241935.25,61459.27
New York City,Manhattan,7002053,001463,NYU Langone Hospitals,50 to 69,100,M,White,Not Span/Hispanic,3,Emergency,Home w/ Home Health Services,2020,NEO070,SECONDARY MALIGNANCIES,RAD004,"RADIATION THERAPY, NEC",041,NERVOUS SYSTEM MALIGNANCY,01,DISEASES AND DISORDERS OF THE NERVOUS SYSTEM,3,Major,Major,Medical,Private Health Insurance,,,,,Y,122022.16,29531.16
New York City,Manhattan,7002053,001463,NYU Langone Hospitals,50 to 69,109,M,White,Not Span/Hispanic,11,Emergency,Inpatient Rehabilitation Facility,2020,NEO048,NERVOUS SYSTEM CANCERS - BRAIN,CNS001,MINIMALLY INVASIVE CNS BIOPSY,041,NERVOUS SYSTEM MALIGNANCY,01,DISEASES AND DISORDERS OF THE NERVOUS SYSTEM,2,Moderate,Minor,Medical,Private Health Insurance,,,,,Y,308006.96,76034.73
New York City,Manhattan,7002053,001463,NYU Langone Hospitals,50 to 69,114,M,Other Race,Not Span/Hispanic,10,Emergency,Home or Self Care,2020,NEO070,SECONDARY MALIGNANCIES,RAD001,BEAM RADIATION,041,NERVOUS SYSTEM MALIGNANCY,01,DISEASES AND DISORDERS OF THE NERVOUS SYSTEM,3,Major,Major,Medical,Medicaid,,,,,Y,302619.01,68897.79
New York City,Manhattan,7002053,001463,NYU Langone Hospitals,0 to 17,112,F,Black/African American,Not Span/Hispanic,5,Elective,Home or Self Care,2020,NEO048,NERVOUS SYSTEM CANCERS - BRAIN,EST001,PHERESIS THERAPY,041,NERVOUS SYSTEM MALIGNANCY,01,DISEASES AND DISORDERS OF THE NERVOUS SYSTEM,2,Moderate,Moderate,Medical,Private Health Insurance,Medicaid,,,,N,172487.73,23547.19
New York City,Manhattan,7002053,001463,NYU Langone Hospitals,50 to 69,112,F,Black/African American,Not Span/Hispanic,6,Emergency,Home w/ Home Health Services,2020,NEO070,SECONDARY MALIGNANCIES,RAD004,"RADIATION THERAPY, NEC",041,NERVOUS SYSTEM MALIGNANCY,01,DISEASES AND DISORDERS OF THE NERVOUS SYSTEM,3,Major,Moderate,Medical,Medicaid,,,,,Y,121889.11,42595.89
New York City,Manhattan,7002053,001463,NYU Langone Hospitals,0 to 17,112,F,Black/African American,Not Span/Hispanic,3,Elective,Home or Self Care,2020,NEO048,NERVOUS SYSTEM CANCERS - BRAIN,CAR025,PLACEMENT OF TUNNELED OR IMPLANTABLE PORTION OF A VASCULAR ACCESS DEVICE,041,NERVOUS SYSTEM MALIGNANCY,01,DISEASES AND DISORDERS OF THE NERVOUS SYSTEM,1,Minor,Minor,Medical,Private Health Insurance,Medicaid,,,,N,83752.45,14839.92
New York City,Manhattan,7002053,001463,NYU Langone Hospitals,30 to 49,101,M,White,Not Span/Hispanic,4,Emergency,Home or Self Care,2020,NEO048,NERVOUS SYSTEM CANCERS - BRAIN,,,041,NERVOUS SYSTEM MALIGNANCY,01,DISEASES AND DISORDERS OF THE NERVOUS SYSTEM,1,Minor,Minor,Medical,Private Health Insurance,,,,,Y,66472.17,24478.06
New York City,Manhattan,7002053,001463,NYU Langone Hospitals,30 to 49,101,M,White,Not Span/Hispanic,2,Emergency,Home w/ Home Health Services,2020,NEO048,NERVOUS SYSTEM CANCERS - BRAIN,,,041,NERVOUS SYSTEM MALIGNANCY,01,DISEASES AND DISORDERS OF THE NERVOUS SYSTEM,2,Moderate,Moderate,Medical,Private Health Insurance,,,,,Y,70205.44,19167.36
New York City,Manhattan,7002053,001463,NYU Langone Hospitals,50 to 69,112,F,Other Race,Spanish/Hispanic,3,Emergency,Home w/ Home Health Services,2020,NEO070,SECONDARY MALIGNANCIES,MAM011,ELECTROENCEPHALOGRAM (EEG),041,NERVOUS SYSTEM MALIGNANCY,01,DISEASES AND DISORDERS OF THE NERVOUS SYSTEM,4,Extreme,Extreme,Medical,Medicaid,,,,,Y,122234.99,22013.76
New York City,Manhattan,7002053,001463,NYU Langone Hospitals,70 or Older,118,M,White,Not Span/Hispanic,19,Emergency,Home w/ Home Health Services,2020,NEO070,SECONDARY MALIGNANCIES,MAM011,ELECTROENCEPHALOGRAM (EEG),041,NERVOUS SYSTEM MALIGNANCY,01,DISEASES AND DISORDERS OF THE NERVOUS SYSTEM,3,Major,Major,Medical,Medicare,Blue Cross/Blue Shield,,,,N,445348.91,125886.82
New York City,Manhattan,7002053,001463,NYU Langone Hospitals,18 to 29,117,M,White,Not Span/Hispanic,4,Elective,Home or Self Care,2020,NEO048,NERVOUS SYSTEM CANCERS - BRAIN,CNS001,MINIMALLY INVASIVE CNS BIOPSY,041,NERVOUS SYSTEM MALIGNANCY,01,DISEASES AND DISORDERS OF THE NERVOUS SYSTEM,2,Moderate,Major,Medical,Private Health Insurance,,,,,N,133775.58,30880.22
New York City,Manhattan,7002053,001463,NYU Langone Hospitals,70 or Older,114,M,Other Race,Not Span/Hispanic,12,Emergency,Skilled Nursing Home,2020,NEO070,SECONDARY MALIGNANCIES,OTR004,ISOLATION PROCEDURES,041,NERVOUS SYSTEM MALIGNANCY,01,DISEASES AND DISORDERS OF THE NERVOUS SYSTEM,3,Major,Major,Medical,Blue Cross/Blue Shield,Medicare,,,,Y,183229.34,60415.15
New York City,Manhattan,7002053,001463,NYU Langone Hospitals,70 or Older,113,M,Other Race,Not Span/Hispanic,2,Emergency,Short-term Hospital,2020,NEO070,SECONDARY MALIGNANCIES,,,041,NERVOUS SYSTEM MALIGNANCY,01,DISEASES AND DISORDERS OF THE NERVOUS SYSTEM,2,Moderate,Major,Medical,Medicare,Medicare,,,,Y,73601.76,19079.05
New York City,Manhattan,7002053,001463,NYU Langone Hospitals,30 to 49,101,M,White,Not Span/Hispanic,10,Emergency,Skilled Nursing Home,2020,NEO048,NERVOUS SYSTEM CANCERS - BRAIN,SKB006,SKIN LACERATION REPAIR (EXCLUDING PERINEUM),041,NERVOUS SYSTEM MALIGNANCY,01,DISEASES AND DISORDERS OF THE NERVOUS SYSTEM,2,Moderate,Moderate,Medical,Private Health Insurance,,,,,Y,119798.12,48857.97
New York City,Manhattan,7002053,001463,NYU Langone Hospitals,50 to 69,112,M,White,Not Span/Hispanic,2,Emergency,Hospice - Home,2020,NEO048,NERVOUS SYSTEM CANCERS - BRAIN,,,041,NERVOUS SYSTEM MALIGNANCY,01,DISEASES AND DISORDERS OF THE NERVOUS SYSTEM,3,Major,Extreme,Medical,Medicaid,,,,,Y,60293.13,17258.27
New York City,Manhattan,7002053,001463,NYU Langone Hospitals,30 to 49,100,F,White,Not Span/Hispanic,24,Emergency,Home w/ Home Health Services,2020,NEO048,NERVOUS SYSTEM CANCERS - BRAIN,CNS001,MINIMALLY INVASIVE CNS BIOPSY,041,NERVOUS SYSTEM MALIGNANCY,01,DISEASES AND DISORDERS OF THE NERVOUS SYSTEM,3,Major,Major,Medical,Private Health Insurance,,,,,N,933084.69,155169.53
New York City,Manhattan,7002053,001463,NYU Langone Hospitals,50 to 69,100,F,White,Not Span/Hispanic,21,Elective,Home or Self Care,2020,NEO048,NERVOUS SYSTEM CANCERS - BRAIN,CNS001,MINIMALLY INVASIVE CNS BIOPSY,041,NERVOUS SYSTEM MALIGNANCY,01,DISEASES AND DISORDERS OF THE NERVOUS SYSTEM,3,Major,Major,Medical,Private Health Insurance,,,,,N,364119.78,117043.22
New York City,Manhattan,7002053,001463,NYU Langone Hospitals,50 to 69,100,F,White,Not Span/Hispanic,2,Emergency,Home w/ Home Health Services,2020,NEO070,SECONDARY MALIGNANCIES,CNS002,LUMBAR PUNCTURE,041,NERVOUS SYSTEM MALIGNANCY,01,DISEASES AND DISORDERS OF THE NERVOUS SYSTEM,3,Major,Major,Medical,Private Health Insurance,,,,,Y,91692.32,14742.23
New York City,Manhattan,7002053,001463,NYU Langone Hospitals,50 to 69,100,F,White,Not Span/Hispanic,9,Emergency,Hospice - Home,2020,NEO070,SECONDARY MALIGNANCIES,,,041,NERVOUS SYSTEM MALIGNANCY,01,DISEASES AND DISORDERS OF THE NERVOUS SYSTEM,3,Major,Major,Medical,Private Health Insurance,,,,,Y,137485.19,44429.32