Hospital Service Area,Hospital County,Operating Certificate Number,Permanent Facility Id,Facility Name,Age Group,Zip Code - 3 digits,Gender,Race,Ethnicity,Length of Stay,Type of Admission,Patient Disposition,Discharge Year,CCS Diagnosis Code,CCS Diagnosis Description,CCS Procedure Code,CCS Procedure Description,APR DRG Code,APR DRG Description,APR MDC Code,APR MDC Description,APR Severity of Illness Code,APR Severity of Illness Description,APR Risk of Mortality,APR Medical Surgical Description,Payment Typology 1,Payment Typology 2,Payment Typology 3,Birth Weight,Abortion Edit Indicator,Emergency Department Indicator,Total Charges,Total Costs
New York City,Bronx,7000006,001169,Montefiore Medical Center - Henry & Lucy Moses Div,70 or Older,104,M,Black/African American,Not Span/Hispanic,4,Emergency,Home or Self Care,2020,NVS011,NEUROCOGNITIVE DISORDERS,,,042,DEGENERATIVE NERVOUS SYSTEM DISORDERS EXC MULT SCLEROSIS,01,DISEASES AND DISORDERS OF THE NERVOUS SYSTEM,1,Minor,Moderate,Medical,Medicare,,,,,Y,40107.63,7128.01
New York City,Bronx,7000006,001169,Montefiore Medical Center - Henry & Lucy Moses Div,70 or Older,104,M,Other Race,Not Span/Hispanic,7,Emergency,Home w/ Home Health Services,2020,NVS011,NEUROCOGNITIVE DISORDERS,,,042,DEGENERATIVE NERVOUS SYSTEM DISORDERS EXC MULT SCLEROSIS,01,DISEASES AND DISORDERS OF THE NERVOUS SYSTEM,1,Minor,Minor,Medical,Medicare,Medicaid,,,,Y,86367.72,15928.15
New York City,Bronx,7000006,001169,Montefiore Medical Center - Henry & Lucy Moses Div,70 or Older,104,F,Other Race,Spanish/Hispanic,8,Emergency,Skilled Nursing Home,2020,NVS011,NEUROCOGNITIVE DISORDERS,,,042,DEGENERATIVE NERVOUS SYSTEM DISORDERS EXC MULT SCLEROSIS,01,DISEASES AND DISORDERS OF THE NERVOUS SYSTEM,2,Moderate,Moderate,Medical,Medicare,Medicaid,,,,Y,95287.39,17883.13
New York City,Bronx,7000006,001169,Montefiore Medical Center - Henry & Lucy Moses Div,70 or Older,104,F,White,Not Span/Hispanic,4,Emergency,Home or Self Care,2020,NVS011,NEUROCOGNITIVE DISORDERS,,,042,DEGENERATIVE NERVOUS SYSTEM DISORDERS EXC MULT SCLEROSIS,01,DISEASES AND DISORDERS OF THE NERVOUS SYSTEM,2,Moderate,Minor,Medical,Medicare,Private Health Insurance,,,,Y,49909.32,9111.73
New York City,Bronx,7000006,003058,Montefiore Med Center - Jack D Weiler Hosp of A Einstein College Div,70 or Older,104,F,Other Race,Spanish/Hispanic,9,Emergency,Hospice - Home,2020,NVS011,NEUROCOGNITIVE DISORDERS,ADM017,ADMINISTRATION OF NUTRITIONAL AND ELECTROLYTIC SUBSTANCES,042,DEGENERATIVE NERVOUS SYSTEM DISORDERS EXC MULT SCLEROSIS,01,DISEASES AND DISORDERS OF THE NERVOUS SYSTEM,3,Major,Major,Medical,Medicare,Medicaid,,,,Y,93449.37,17751.55
New York City,Bronx,7000006,001168,Montefiore Medical Center-Wakefield Hospital,50 to 69,104,M,Black/African American,Not Span/Hispanic,3,Emergency,Home w/ Home Health Services,2020,NVS011,NEUROCOGNITIVE DISORDERS,ADM021,"ADMINISTRATION OF THERAPEUTIC SUBSTANCES, NEC",042,DEGENERATIVE NERVOUS SYSTEM DISORDERS EXC MULT SCLEROSIS,01,DISEASES AND DISORDERS OF THE NERVOUS SYSTEM,2,Moderate,Moderate,Medical,Medicare,,,,,Y,36711.51,5933.86
New York City,Bronx,7000006,001169,Montefiore Medical Center - Henry & Lucy Moses Div,70 or Older,104,M,Other Race,Spanish/Hispanic,5,Emergency,Home w/ Home Health Services,2020,NVS011,NEUROCOGNITIVE DISORDERS,ADM015,ADMINISTRATION OF ANTIBIOTICS,042,DEGENERATIVE NERVOUS SYSTEM DISORDERS EXC MULT SCLEROSIS,01,DISEASES AND DISORDERS OF THE NERVOUS SYSTEM,2,Moderate,Moderate,Medical,Medicare,Medicaid,,,,Y,59794.35,11421.42
New York City,Bronx,7000006,001169,Montefiore Medical Center - Henry & Lucy Moses Div,50 to 69,109,F,White,Not Span/Hispanic,33,Emergency,Hospice - Medical Facility,2020,NVS020,OTHER SPECIFIED NERVOUS SYSTEM DISORDERS,CNS002,LUMBAR PUNCTURE,042,DEGENERATIVE NERVOUS SYSTEM DISORDERS EXC MULT SCLEROSIS,01,DISEASES AND DISORDERS OF THE NERVOUS SYSTEM,3,Major,Major,Medical,Medicaid,,,,,Y,341212.86,65574.52
New York City,Bronx,7000006,001169,Montefiore Medical Center - Henry & Lucy Moses Div,70 or Older,104,M,Other Race,Spanish/Hispanic,8,Emergency,Skilled Nursing Home,2020,NVS011,NEUROCOGNITIVE DISORDERS,ADM021,"ADMINISTRATION OF THERAPEUTIC SUBSTANCES, NEC",042,DEGENERATIVE NERVOUS SYSTEM DISORDERS EXC MULT SCLEROSIS,01,DISEASES AND DISORDERS OF THE NERVOUS SYSTEM,1,Minor,Moderate,Medical,Medicare,Medicaid,,,,Y,88014.37,17435.55
New York City,Bronx,7000006,003058,Montefiore Med Center - Jack D Weiler Hosp of A Einstein College Div,70 or Older,104,M,White,Not Span/Hispanic,13,Emergency,Home w/ Home Health Services,2020,NVS011,NEUROCOGNITIVE DISORDERS,CNS002,LUMBAR PUNCTURE,042,DEGENERATIVE NERVOUS SYSTEM DISORDERS EXC MULT SCLEROSIS,01,DISEASES AND DISORDERS OF THE NERVOUS SYSTEM,2,Moderate,Moderate,Medical,Medicare,Private Health Insurance,,,,Y,132932.89,26079.19
Capital/Adirond,Otsego,3801000,000739,A.O. Fox Memorial Hospital,70 or Older,137,M,White,Not Span/Hispanic,5,Emergency,Medicare Cert Long Term Care Hospital,2020,NVS011,NEUROCOGNITIVE DISORDERS,ADM010,VACCINATIONS,042,DEGENERATIVE NERVOUS SYSTEM DISORDERS EXC MULT SCLEROSIS,01,DISEASES AND DISORDERS OF THE NERVOUS SYSTEM,1,Minor,Minor,Medical,Medicare,,,,,Y,8763.89,6591.38
New York City,Bronx,7000006,001169,Montefiore Medical Center - Henry & Lucy Moses Div,70 or Older,104,F,Other Race,Spanish/Hispanic,8,Emergency,Home w/ Home Health Services,2020,NVS011,NEUROCOGNITIVE DISORDERS,,,042,DEGENERATIVE NERVOUS SYSTEM DISORDERS EXC MULT SCLEROSIS,01,DISEASES AND DISORDERS OF THE NERVOUS SYSTEM,2,Moderate,Moderate,Medical,Medicare,,,,,Y,97503.91,16618.37
Hudson Valley,Westchester,5904001,001072,Montefiore New Rochelle Hospital,50 to 69,105,M,Black/African American,Unknown,2,Emergency,Home or Self Care,2020,NVS011,NEUROCOGNITIVE DISORDERS,ADM017,ADMINISTRATION OF NUTRITIONAL AND ELECTROLYTIC SUBSTANCES,042,DEGENERATIVE NERVOUS SYSTEM DISORDERS EXC MULT SCLEROSIS,01,DISEASES AND DISORDERS OF THE NERVOUS SYSTEM,2,Moderate,Minor,Medical,Medicaid,Medicaid,Self-Pay,,,Y,18039.54,4734.07
Hudson Valley,Westchester,5904001,001072,Montefiore New Rochelle Hospital,70 or Older,108,M,White,Unknown,8,Emergency,Skilled Nursing Home,2020,NVS011,NEUROCOGNITIVE DISORDERS,ADM017,ADMINISTRATION OF NUTRITIONAL AND ELECTROLYTIC SUBSTANCES,042,DEGENERATIVE NERVOUS SYSTEM DISORDERS EXC MULT SCLEROSIS,01,DISEASES AND DISORDERS OF THE NERVOUS SYSTEM,1,Minor,Moderate,Medical,Medicare,Medicare,Self-Pay,,,Y,55027.07,15647.37
Hudson Valley,Westchester,5904001,001072,Montefiore New Rochelle Hospital,50 to 69,104,F,Black/African American,Unknown,2,Emergency,Home or Self Care,2020,NVS011,NEUROCOGNITIVE DISORDERS,,,042,DEGENERATIVE NERVOUS SYSTEM DISORDERS EXC MULT SCLEROSIS,01,DISEASES AND DISORDERS OF THE NERVOUS SYSTEM,1,Minor,Minor,Medical,Medicare,Medicare,Self-Pay,,,Y,28015.27,13930.66
New York City,Bronx,7000006,001168,Montefiore Medical Center-Wakefield Hospital,70 or Older,104,M,Black/African American,Not Span/Hispanic,5,Emergency,Skilled Nursing Home,2020,NVS004,PARKINSON`S DISEASE,,,042,DEGENERATIVE NERVOUS SYSTEM DISORDERS EXC MULT SCLEROSIS,01,DISEASES AND DISORDERS OF THE NERVOUS SYSTEM,2,Moderate,Moderate,Medical,Medicare,,,,,Y,64558.83,11802.54
New York City,Bronx,7000006,001168,Montefiore Medical Center-Wakefield Hospital,50 to 69,104,M,Black/African American,Not Span/Hispanic,9,Emergency,Skilled Nursing Home,2020,NVS011,NEUROCOGNITIVE DISORDERS,IMG007,COMPUTERIZED TOMOGRAPHY (CT) WITHOUT CONTRAST,042,DEGENERATIVE NERVOUS SYSTEM DISORDERS EXC MULT SCLEROSIS,01,DISEASES AND DISORDERS OF THE NERVOUS SYSTEM,2,Moderate,Major,Medical,Medicare,Medicaid,,,,Y,105152.01,19615.21
New York City,Manhattan,7002024,001456,Mount Sinai Hospital,70 or Older,113,M,Other Race,Unknown,8,Urgent,Home or Self Care,2020,NVS011,NEUROCOGNITIVE DISORDERS,,,042,DEGENERATIVE NERVOUS SYSTEM DISORDERS EXC MULT SCLEROSIS,01,DISEASES AND DISORDERS OF THE NERVOUS SYSTEM,2,Moderate,Minor,Medical,Medicare,Medicare,Self-Pay,,,N,49406.88,22058.52
New York City,Manhattan,7002024,001456,Mount Sinai Hospital,70 or Older,100,M,Black/African American,Not Span/Hispanic,13,Emergency,Home w/ Home Health Services,2020,NVS011,NEUROCOGNITIVE DISORDERS,,,042,DEGENERATIVE NERVOUS SYSTEM DISORDERS EXC MULT SCLEROSIS,01,DISEASES AND DISORDERS OF THE NERVOUS SYSTEM,2,Moderate,Moderate,Medical,Medicare,Medicare,Medicaid,,,Y,135504.03,36317.98
New York City,Manhattan,7002024,001456,Mount Sinai Hospital,70 or Older,100,F,Other Race,Unknown,9,Emergency,Skilled Nursing Home,2020,NVS011,NEUROCOGNITIVE DISORDERS,,,042,DEGENERATIVE NERVOUS SYSTEM DISORDERS EXC MULT SCLEROSIS,01,DISEASES AND DISORDERS OF THE NERVOUS SYSTEM,4,Extreme,Extreme,Medical,Medicare,Blue Cross/Blue Shield,Self-Pay,,,Y,94525.82,24656.75
New York City,Bronx,7000006,001168,Montefiore Medical Center-Wakefield Hospital,50 to 69,104,F,Other Race,Not Span/Hispanic,4,Emergency,Home w/ Home Health Services,2020,NVS011,NEUROCOGNITIVE DISORDERS,,,042,DEGENERATIVE NERVOUS SYSTEM DISORDERS EXC MULT SCLEROSIS,01,DISEASES AND DISORDERS OF THE NERVOUS SYSTEM,2,Moderate,Minor,Medical,Private Health Insurance,,,,,Y,52074.28,9409.81
New York City,Bronx,7000006,001169,Montefiore Medical Center - Henry & Lucy Moses Div,70 or Older,104,M,Other Race,Spanish/Hispanic,7,Emergency,Home or Self Care,2020,NVS011,NEUROCOGNITIVE DISORDERS,,,042,DEGENERATIVE NERVOUS SYSTEM DISORDERS EXC MULT SCLEROSIS,01,DISEASES AND DISORDERS OF THE NERVOUS SYSTEM,2,Moderate,Moderate,Medical,Medicare,,,,,Y,71262.14,14023.14
New York City,Bronx,7000006,001169,Montefiore Medical Center - Henry & Lucy Moses Div,50 to 69,104,M,Black/African American,Not Span/Hispanic,16,Emergency,Home or Self Care,2020,NVS011,NEUROCOGNITIVE DISORDERS,,,042,DEGENERATIVE NERVOUS SYSTEM DISORDERS EXC MULT SCLEROSIS,01,DISEASES AND DISORDERS OF THE NERVOUS SYSTEM,1,Minor,Minor,Medical,Medicare,,,,,Y,108948.35,32925.31
New York City,Bronx,7000006,003058,Montefiore Med Center - Jack D Weiler Hosp of A Einstein College Div,70 or Older,104,M,Black/African American,Not Span/Hispanic,4,Emergency,Expired,2020,NVS006,OTHER SPECIFIED HEREDITARY AND DEGENERATIVE NERVOUS SYSTEM CONDITIONS,CAR024,VENOUS AND ARTERIAL CATHETER PLACEMENT,042,DEGENERATIVE NERVOUS SYSTEM DISORDERS EXC MULT SCLEROSIS,01,DISEASES AND DISORDERS OF THE NERVOUS SYSTEM,4,Extreme,Extreme,Medical,Medicare,,,,,Y,89898,11367.31
New York City,Manhattan,7002032,001469,Mount Sinai Morningside,70 or Older,104,F,Black/African American,Not Span/Hispanic,8,Emergency,Home w/ Home Health Services,2020,NVS004,PARKINSON`S DISEASE,ADM021,"ADMINISTRATION OF THERAPEUTIC SUBSTANCES, NEC",042,DEGENERATIVE NERVOUS SYSTEM DISORDERS EXC MULT SCLEROSIS,01,DISEASES AND DISORDERS OF THE NERVOUS SYSTEM,2,Moderate,Moderate,Medical,Medicare,Medicare,Medicaid,,,Y,84371.27,18414.38
New York City,Manhattan,7002032,001469,Mount Sinai Morningside,70 or Older,100,M,White,Not Span/Hispanic,8,Emergency,Hospice - Medical Facility,2020,NVS011,NEUROCOGNITIVE DISORDERS,IMG007,COMPUTERIZED TOMOGRAPHY (CT) WITHOUT CONTRAST,042,DEGENERATIVE NERVOUS SYSTEM DISORDERS EXC MULT SCLEROSIS,01,DISEASES AND DISORDERS OF THE NERVOUS SYSTEM,2,Moderate,Moderate,Medical,Medicare,Self-Pay,,,,Y,80408.68,17343.99
New York City,Kings,7002002,001324,Mount Sinai Brooklyn,50 to 69,112,M,White,Unknown,5,Emergency,Home w/ Home Health Services,2020,NVS011,NEUROCOGNITIVE DISORDERS,,,042,DEGENERATIVE NERVOUS SYSTEM DISORDERS EXC MULT SCLEROSIS,01,DISEASES AND DISORDERS OF THE NERVOUS SYSTEM,3,Major,Major,Medical,Medicaid,Self-Pay,,,,Y,61661.66,8077.23
New York City,Manhattan,7002032,001469,Mount Sinai Morningside,70 or Older,100,M,Other Race,Spanish/Hispanic,2,Emergency,Home or Self Care,2020,NVS011,NEUROCOGNITIVE DISORDERS,IMG007,COMPUTERIZED TOMOGRAPHY (CT) WITHOUT CONTRAST,042,DEGENERATIVE NERVOUS SYSTEM DISORDERS EXC MULT SCLEROSIS,01,DISEASES AND DISORDERS OF THE NERVOUS SYSTEM,2,Moderate,Moderate,Medical,Medicare,Medicare,Medicaid,,,Y,29012.89,6306.16
New York City,Manhattan,7002032,001469,Mount Sinai Morningside,70 or Older,100,F,Other Race,Spanish/Hispanic,4,Emergency,Home w/ Home Health Services,2020,NVS011,NEUROCOGNITIVE DISORDERS,ADM021,"ADMINISTRATION OF THERAPEUTIC SUBSTANCES, NEC",042,DEGENERATIVE NERVOUS SYSTEM DISORDERS EXC MULT SCLEROSIS,01,DISEASES AND DISORDERS OF THE NERVOUS SYSTEM,2,Moderate,Moderate,Medical,Medicare,Medicare,Medicaid,,,Y,46193.3,10237.15
New York City,Manhattan,7002032,001469,Mount Sinai Morningside,50 to 69,100,F,White,Spanish/Hispanic,9,Emergency,Home w/ Home Health Services,2020,NVS011,NEUROCOGNITIVE DISORDERS,ADM021,"ADMINISTRATION OF THERAPEUTIC SUBSTANCES, NEC",042,DEGENERATIVE NERVOUS SYSTEM DISORDERS EXC MULT SCLEROSIS,01,DISEASES AND DISORDERS OF THE NERVOUS SYSTEM,2,Moderate,Moderate,Medical,Medicare,Medicare,Self-Pay,,,Y,87298.55,18759.47
New York City,Manhattan,7002032,001469,Mount Sinai Morningside,70 or Older,104,M,Other Race,Spanish/Hispanic,3,Urgent,Home or Self Care,2020,NVS011,NEUROCOGNITIVE DISORDERS,IMG005,MAGNETIC RESONANCE IMAGING (MRI),042,DEGENERATIVE NERVOUS SYSTEM DISORDERS EXC MULT SCLEROSIS,01,DISEASES AND DISORDERS OF THE NERVOUS SYSTEM,2,Moderate,Minor,Medical,Medicare,Medicare,Self-Pay,,,N,33575.75,7026.18
New York City,Manhattan,7002032,001469,Mount Sinai Morningside,70 or Older,100,F,Black/African American,Not Span/Hispanic,4,Emergency,Home w/ Home Health Services,2020,NVS011,NEUROCOGNITIVE DISORDERS,ADM021,"ADMINISTRATION OF THERAPEUTIC SUBSTANCES, NEC",042,DEGENERATIVE NERVOUS SYSTEM DISORDERS EXC MULT SCLEROSIS,01,DISEASES AND DISORDERS OF THE NERVOUS SYSTEM,1,Minor,Minor,Medical,Medicare,Medicare,Medicaid,,,Y,45722.94,9732.82
New York City,Manhattan,7002032,001469,Mount Sinai Morningside,70 or Older,100,F,Black/African American,Not Span/Hispanic,10,Emergency,Skilled Nursing Home,2020,NVS011,NEUROCOGNITIVE DISORDERS,MAM011,ELECTROENCEPHALOGRAM (EEG),042,DEGENERATIVE NERVOUS SYSTEM DISORDERS EXC MULT SCLEROSIS,01,DISEASES AND DISORDERS OF THE NERVOUS SYSTEM,2,Moderate,Moderate,Medical,Medicare,Medicare,Self-Pay,,,Y,114893,24180.28
New York City,Bronx,7000006,001168,Montefiore Medical Center-Wakefield Hospital,50 to 69,104,M,Other Race,Spanish/Hispanic,7,Emergency,Skilled Nursing Home,2020,NVS011,NEUROCOGNITIVE DISORDERS,IMG007,COMPUTERIZED TOMOGRAPHY (CT) WITHOUT CONTRAST,042,DEGENERATIVE NERVOUS SYSTEM DISORDERS EXC MULT SCLEROSIS,01,DISEASES AND DISORDERS OF THE NERVOUS SYSTEM,2,Moderate,Moderate,Medical,Medicare,,,,,Y,50445.98,9065.77
New York City,Manhattan,7002002,001439,Mount Sinai Beth Israel,70 or Older,113,F,Other Race,Unknown,3,Emergency,Home or Self Care,2020,NVS011,NEUROCOGNITIVE DISORDERS,IMG007,COMPUTERIZED TOMOGRAPHY (CT) WITHOUT CONTRAST,042,DEGENERATIVE NERVOUS SYSTEM DISORDERS EXC MULT SCLEROSIS,01,DISEASES AND DISORDERS OF THE NERVOUS SYSTEM,1,Minor,Minor,Medical,Medicare,Miscellaneous/Other,Medicaid,,,Y,36813.18,8435.26
New York City,Manhattan,7002002,001439,Mount Sinai Beth Israel,70 or Older,100,F,Other Race,Unknown,3,Emergency,Home w/ Home Health Services,2020,NVS011,NEUROCOGNITIVE DISORDERS,ADM021,"ADMINISTRATION OF THERAPEUTIC SUBSTANCES, NEC",042,DEGENERATIVE NERVOUS SYSTEM DISORDERS EXC MULT SCLEROSIS,01,DISEASES AND DISORDERS OF THE NERVOUS SYSTEM,2,Moderate,Minor,Medical,Medicare,Miscellaneous/Other,Self-Pay,,,Y,35219.79,7863.36
New York City,Manhattan,7002002,001439,Mount Sinai Beth Israel,70 or Older,OOS,F,Other Race,Unknown,3,Urgent,Home w/ Home Health Services,2020,NVS006,OTHER SPECIFIED HEREDITARY AND DEGENERATIVE NERVOUS SYSTEM CONDITIONS,GIS017,GASTROSTOMY,042,DEGENERATIVE NERVOUS SYSTEM DISORDERS EXC MULT SCLEROSIS,01,DISEASES AND DISORDERS OF THE NERVOUS SYSTEM,2,Moderate,Major,Medical,Medicare,Private Health Insurance,Self-Pay,,,N,34307.35,8531.82
New York City,Manhattan,7002032,001466,Mount Sinai West,70 or Older,100,F,Other Race,Not Span/Hispanic,6,Emergency,Skilled Nursing Home,2020,NVS011,NEUROCOGNITIVE DISORDERS,ADM021,"ADMINISTRATION OF THERAPEUTIC SUBSTANCES, NEC",042,DEGENERATIVE NERVOUS SYSTEM DISORDERS EXC MULT SCLEROSIS,01,DISEASES AND DISORDERS OF THE NERVOUS SYSTEM,2,Moderate,Moderate,Medical,Medicare,Medicaid,Self-Pay,,,Y,60025.64,12921.19
New York City,Manhattan,7002032,001466,Mount Sinai West,70 or Older,100,F,White,Not Span/Hispanic,3,Emergency,Skilled Nursing Home,2020,NVS004,PARKINSON`S DISEASE,IMG007,COMPUTERIZED TOMOGRAPHY (CT) WITHOUT CONTRAST,042,DEGENERATIVE NERVOUS SYSTEM DISORDERS EXC MULT SCLEROSIS,01,DISEASES AND DISORDERS OF THE NERVOUS SYSTEM,2,Moderate,Minor,Medical,Medicare,Blue Cross/Blue Shield,Self-Pay,,,Y,33226.97,7117.33
New York City,Manhattan,7002032,001466,Mount Sinai West,50 to 69,100,M,White,Not Span/Hispanic,2,Emergency,Home or Self Care,2020,NVS011,NEUROCOGNITIVE DISORDERS,IMG005,MAGNETIC RESONANCE IMAGING (MRI),042,DEGENERATIVE NERVOUS SYSTEM DISORDERS EXC MULT SCLEROSIS,01,DISEASES AND DISORDERS OF THE NERVOUS SYSTEM,1,Minor,Moderate,Medical,Blue Cross/Blue Shield,Self-Pay,,,,N,40479.6,8288.86
New York City,Bronx,7000006,001169,Montefiore Medical Center - Henry & Lucy Moses Div,18 to 29,,M,Black/African American,Spanish/Hispanic,5,Emergency,Home or Self Care,2020,NVS018,MYOPATHIES,ESA004,NON-INVASIVE VENTILATION,042,DEGENERATIVE NERVOUS SYSTEM DISORDERS EXC MULT SCLEROSIS,01,DISEASES AND DISORDERS OF THE NERVOUS SYSTEM,3,Major,Major,Medical,Medicaid,,,,,Y,158656.99,23185.48
Hudson Valley,Westchester,5901000,001039,NewYork-Presbyterian/Hudson Valley Hospital,70 or Older,105,F,White,Not Span/Hispanic,3,Emergency,Home or Self Care,2020,NVS011,NEUROCOGNITIVE DISORDERS,ADM021,"ADMINISTRATION OF THERAPEUTIC SUBSTANCES, NEC",042,DEGENERATIVE NERVOUS SYSTEM DISORDERS EXC MULT SCLEROSIS,01,DISEASES AND DISORDERS OF THE NERVOUS SYSTEM,2,Moderate,Moderate,Medical,Medicare,Blue Cross/Blue Shield,,,,Y,23806.96,7493.57
New York City,Bronx,7000006,001169,Montefiore Medical Center - Henry & Lucy Moses Div,70 or Older,104,M,Other Race,Spanish/Hispanic,1,Emergency,Home or Self Care,2020,NVS011,NEUROCOGNITIVE DISORDERS,,,042,DEGENERATIVE NERVOUS SYSTEM DISORDERS EXC MULT SCLEROSIS,01,DISEASES AND DISORDERS OF THE NERVOUS SYSTEM,1,Minor,Moderate,Medical,Medicare,,,,,Y,17995.42,2765.72
New York City,Bronx,7000006,003058,Montefiore Med Center - Jack D Weiler Hosp of A Einstein College Div,70 or Older,104,M,Other Race,Not Span/Hispanic,7,Emergency,Skilled Nursing Home,2020,NVS011,NEUROCOGNITIVE DISORDERS,ADM017,ADMINISTRATION OF NUTRITIONAL AND ELECTROLYTIC SUBSTANCES,042,DEGENERATIVE NERVOUS SYSTEM DISORDERS EXC MULT SCLEROSIS,01,DISEASES AND DISORDERS OF THE NERVOUS SYSTEM,3,Major,Major,Medical,Medicare,Medicaid,,,,Y,82981.5,14716.07
New York City,Manhattan,7002024,001456,Mount Sinai Hospital,70 or Older,100,F,White,Not Span/Hispanic,13,Emergency,Hospice - Home,2020,NVS011,NEUROCOGNITIVE DISORDERS,MAM007,ELECTROCARDIOGRAM (ECG),042,DEGENERATIVE NERVOUS SYSTEM DISORDERS EXC MULT SCLEROSIS,01,DISEASES AND DISORDERS OF THE NERVOUS SYSTEM,2,Moderate,Moderate,Medical,Medicare,Private Health Insurance,Self-Pay,,,Y,148123.08,39751.6
New York City,Bronx,7000006,001168,Montefiore Medical Center-Wakefield Hospital,50 to 69,104,F,Other Race,Spanish/Hispanic,13,Emergency,Skilled Nursing Home,2020,NVS011,NEUROCOGNITIVE DISORDERS,,,042,DEGENERATIVE NERVOUS SYSTEM DISORDERS EXC MULT SCLEROSIS,01,DISEASES AND DISORDERS OF THE NERVOUS SYSTEM,2,Moderate,Moderate,Medical,Medicare,Medicaid,,,,Y,150233.95,29349.06
New York City,Bronx,7000006,003058,Montefiore Med Center - Jack D Weiler Hosp of A Einstein College Div,70 or Older,104,F,Black/African American,Not Span/Hispanic,5,Emergency,Hospice - Home,2020,NVS011,NEUROCOGNITIVE DISORDERS,MAM011,ELECTROENCEPHALOGRAM (EEG),042,DEGENERATIVE NERVOUS SYSTEM DISORDERS EXC MULT SCLEROSIS,01,DISEASES AND DISORDERS OF THE NERVOUS SYSTEM,3,Major,Major,Medical,Medicare,Private Health Insurance,,,,Y,72730.05,9812.91
New York City,Bronx,7000006,001169,Montefiore Medical Center - Henry & Lucy Moses Div,0 to 17,,F,Other Race,Unknown,2,Elective,Home or Self Care,2020,MBD014,NEURODEVELOPMENTAL DISORDERS,MAM011,ELECTROENCEPHALOGRAM (EEG),042,DEGENERATIVE NERVOUS SYSTEM DISORDERS EXC MULT SCLEROSIS,01,DISEASES AND DISORDERS OF THE NERVOUS SYSTEM,2,Moderate,Moderate,Medical,Private Health Insurance,,,,,N,19688,5799.64
New York City,Bronx,7000006,001168,Montefiore Medical Center-Wakefield Hospital,70 or Older,104,M,Black/African American,Not Span/Hispanic,9,Emergency,Skilled Nursing Home,2020,NVS011,NEUROCOGNITIVE DISORDERS,,,042,DEGENERATIVE NERVOUS SYSTEM DISORDERS EXC MULT SCLEROSIS,01,DISEASES AND DISORDERS OF THE NERVOUS SYSTEM,3,Major,Major,Medical,Medicare,,,,,Y,119110.32,20903.25
Hudson Valley,Westchester,5903001,001061,Montefiore Mount Vernon Hospital,70 or Older,108,F,Black/African American,Multi-ethnic,7,Emergency,Home w/ Home Health Services,2020,NVS011,NEUROCOGNITIVE DISORDERS,,,042,DEGENERATIVE NERVOUS SYSTEM DISORDERS EXC MULT SCLEROSIS,01,DISEASES AND DISORDERS OF THE NERVOUS SYSTEM,1,Minor,Moderate,Medical,Medicare,Medicare,Self-Pay,,,Y,51614.51,18311.01
Hudson Valley,Westchester,5904001,001072,Montefiore New Rochelle Hospital,50 to 69,108,M,Black/African American,Not Span/Hispanic,2,Emergency,Home or Self Care,2020,NVS011,NEUROCOGNITIVE DISORDERS,,,042,DEGENERATIVE NERVOUS SYSTEM DISORDERS EXC MULT SCLEROSIS,01,DISEASES AND DISORDERS OF THE NERVOUS SYSTEM,2,Moderate,Moderate,Medical,Medicaid,Medicaid,Self-Pay,,,Y,21150.34,4679.66
Hudson Valley,Westchester,5904001,001072,Montefiore New Rochelle Hospital,70 or Older,108,F,Black/African American,Multi-ethnic,10,Emergency,Skilled Nursing Home,2020,NVS011,NEUROCOGNITIVE DISORDERS,,,042,DEGENERATIVE NERVOUS SYSTEM DISORDERS EXC MULT SCLEROSIS,01,DISEASES AND DISORDERS OF THE NERVOUS SYSTEM,3,Major,Moderate,Medical,Medicare,Medicare,Self-Pay,,,Y,68638.34,18440.38
Hudson Valley,Westchester,5903001,001061,Montefiore Mount Vernon Hospital,70 or Older,105,F,Black/African American,Not Span/Hispanic,5,Emergency,Home w/ Home Health Services,2020,NVS011,NEUROCOGNITIVE DISORDERS,,,042,DEGENERATIVE NERVOUS SYSTEM DISORDERS EXC MULT SCLEROSIS,01,DISEASES AND DISORDERS OF THE NERVOUS SYSTEM,2,Moderate,Minor,Medical,Medicare,Medicare,Self-Pay,,,Y,32130.76,11982.88
New York City,Bronx,7000006,001169,Montefiore Medical Center - Henry & Lucy Moses Div,50 to 69,105,M,White,Not Span/Hispanic,7,Emergency,Inpatient Rehabilitation Facility,2020,NVS006,OTHER SPECIFIED HEREDITARY AND DEGENERATIVE NERVOUS SYSTEM CONDITIONS,,,042,DEGENERATIVE NERVOUS SYSTEM DISORDERS EXC MULT SCLEROSIS,01,DISEASES AND DISORDERS OF THE NERVOUS SYSTEM,2,Moderate,Major,Medical,Private Health Insurance,,,,,N,79017.32,15624.34
Hudson Valley,Westchester,5903001,001061,Montefiore Mount Vernon Hospital,70 or Older,,M,White,Not Span/Hispanic,4,Emergency,Skilled Nursing Home,2020,NVS011,NEUROCOGNITIVE DISORDERS,,,042,DEGENERATIVE NERVOUS SYSTEM DISORDERS EXC MULT SCLEROSIS,01,DISEASES AND DISORDERS OF THE NERVOUS SYSTEM,2,Moderate,Moderate,Medical,Medicare,Medicare,Self-Pay,,,Y,28499.74,10608.9
Long Island,Nassau,2908000,000511,NYU Langone Hospital-Long Island,70 or Older,118,M,White,Not Span/Hispanic,5,Emergency,Hospice - Home,2020,NVS011,NEUROCOGNITIVE DISORDERS,CAR028,INFERIOR VENA CAVA (IVC) FILTER PROCEDURES,042,DEGENERATIVE NERVOUS SYSTEM DISORDERS EXC MULT SCLEROSIS,01,DISEASES AND DISORDERS OF THE NERVOUS SYSTEM,4,Extreme,Major,Medical,Medicare,Blue Cross/Blue Shield,,,,Y,126379.72,27348.28
New York City,Manhattan,7002054,003975,New York Presbyterian Hospital - Allen Hospital,70 or Older,104,F,Multi-racial,Spanish/Hispanic,8,Emergency,Skilled Nursing Home,2020,NVS011,NEUROCOGNITIVE DISORDERS,,,042,DEGENERATIVE NERVOUS SYSTEM DISORDERS EXC MULT SCLEROSIS,01,DISEASES AND DISORDERS OF THE NERVOUS SYSTEM,2,Moderate,Moderate,Medical,Medicare,Medicare,Medicaid,,,Y,88673.65,19408.3