Hospital Service Area,Hospital County,Operating Certificate Number,Permanent Facility Id,Facility Name,Age Group,Zip Code - 3 digits,Gender,Race,Ethnicity,Length of Stay,Type of Admission,Patient Disposition,Discharge Year,CCS Diagnosis Code,CCS Diagnosis Description,CCS Procedure Code,CCS Procedure Description,APR DRG Code,APR DRG Description,APR MDC Code,APR MDC Description,APR Severity of Illness Code,APR Severity of Illness Description,APR Risk of Mortality,APR Medical Surgical Description,Payment Typology 1,Payment Typology 2,Payment Typology 3,Birth Weight,Abortion Edit Indicator,Emergency Department Indicator,Total Charges,Total Costs
Long Island,Nassau,2908000,000511,NYU Winthrop Hospital,0 to 17,117,F,White,Not Span/Hispanic,4,Emergency,Home w/ Home Health Services,2017,050,Diabetes mellitus with complications,000,NO PROC,420,Diabetes,10,"Endocrine, Nutritional and Metabolic Diseases and Disorders",1,Minor,Minor,Medical,Private Health Insurance,,,,N,Y,26531.04,5918.35
Long Island,Nassau,2908000,000511,NYU Winthrop Hospital,30 to 49,117,M,White,Not Span/Hispanic,12,Emergency,Home or Self Care,2017,050,Diabetes mellitus with complications,054,OT VASC CATH; NOT HEART,420,Diabetes,10,"Endocrine, Nutritional and Metabolic Diseases and Disorders",3,Major,Moderate,Medical,Blue Cross/Blue Shield,,,,N,Y,202200.34,32768.26
Long Island,Nassau,2908000,000511,NYU Winthrop Hospital,30 to 49,115,F,White,Not Span/Hispanic,2,Emergency,Home or Self Care,2017,050,Diabetes mellitus with complications,000,NO PROC,420,Diabetes,10,"Endocrine, Nutritional and Metabolic Diseases and Disorders",2,Moderate,Minor,Medical,Blue Cross/Blue Shield,,,,N,Y,30164.14,7336.15
Long Island,Nassau,2908000,000511,NYU Winthrop Hospital,70 or Older,115,F,White,Not Span/Hispanic,4,Emergency,Home w/ Home Health Services,2017,050,Diabetes mellitus with complications,000,NO PROC,420,Diabetes,10,"Endocrine, Nutritional and Metabolic Diseases and Disorders",2,Moderate,Major,Medical,Medicare,Medicare,Medicaid,,N,Y,43521.78,8801.37
Long Island,Nassau,2908000,000511,NYU Winthrop Hospital,0 to 17,115,F,Black/African American,Not Span/Hispanic,3,Emergency,Home w/ Home Health Services,2017,050,Diabetes mellitus with complications,000,NO PROC,420,Diabetes,10,"Endocrine, Nutritional and Metabolic Diseases and Disorders",2,Moderate,Minor,Medical,Medicaid,Medicaid,,,N,Y,60745.77,8784.75
Long Island,Nassau,2908000,000511,NYU Winthrop Hospital,0 to 17,115,M,White,Not Span/Hispanic,2,Emergency,Home w/ Home Health Services,2017,050,Diabetes mellitus with complications,000,NO PROC,420,Diabetes,10,"Endocrine, Nutritional and Metabolic Diseases and Disorders",2,Moderate,Minor,Medical,Blue Cross/Blue Shield,,,,N,Y,24375.77,4680.17
Long Island,Nassau,2908000,000511,NYU Winthrop Hospital,30 to 49,115,M,Other Race,Spanish/Hispanic,4,Emergency,Home w/ Home Health Services,2017,050,Diabetes mellitus with complications,000,NO PROC,420,Diabetes,10,"Endocrine, Nutritional and Metabolic Diseases and Disorders",2,Moderate,Minor,Medical,Private Health Insurance,,,,N,Y,67956.25,10324.14
Long Island,Nassau,2908000,000511,NYU Winthrop Hospital,50 to 69,115,M,Black/African American,Not Span/Hispanic,7,Emergency,Home or Self Care,2017,050,Diabetes mellitus with complications,000,NO PROC,420,Diabetes,10,"Endocrine, Nutritional and Metabolic Diseases and Disorders",2,Moderate,Moderate,Medical,Federal/State/Local/VA,,,,N,Y,81471.34,16883.06
Long Island,Nassau,2908000,000511,NYU Winthrop Hospital,50 to 69,115,F,Black/African American,Not Span/Hispanic,7,Emergency,Home w/ Home Health Services,2017,050,Diabetes mellitus with complications,070,UP GASTRO ENDOSC/BIOPSY,420,Diabetes,10,"Endocrine, Nutritional and Metabolic Diseases and Disorders",3,Major,Extreme,Medical,Blue Cross/Blue Shield,Medicare,,,N,Y,130140.96,26985.61
Long Island,Nassau,2908000,000511,NYU Winthrop Hospital,50 to 69,117,M,White,Not Span/Hispanic,4,Emergency,Home w/ Home Health Services,2017,050,Diabetes mellitus with complications,000,NO PROC,420,Diabetes,10,"Endocrine, Nutritional and Metabolic Diseases and Disorders",1,Minor,Moderate,Medical,Private Health Insurance,,,,N,Y,67921.19,13834.60
Long Island,Nassau,2908000,000511,NYU Winthrop Hospital,0 to 17,117,M,White,Not Span/Hispanic,1,Emergency,Home or Self Care,2017,050,Diabetes mellitus with complications,000,NO PROC,420,Diabetes,10,"Endocrine, Nutritional and Metabolic Diseases and Disorders",1,Minor,Minor,Medical,Medicaid,,,,N,Y,14092.25,2637.55
Long Island,Nassau,2908000,000511,NYU Winthrop Hospital,0 to 17,117,M,White,Not Span/Hispanic,2,Emergency,Home w/ Home Health Services,2017,050,Diabetes mellitus with complications,000,NO PROC,420,Diabetes,10,"Endocrine, Nutritional and Metabolic Diseases and Disorders",2,Moderate,Minor,Medical,Blue Cross/Blue Shield,,,,N,Y,45106.37,7085.94
Long Island,Nassau,2908000,000511,NYU Winthrop Hospital,30 to 49,115,F,Black/African American,Not Span/Hispanic,6,Emergency,Home w/ Home Health Services,2017,050,Diabetes mellitus with complications,000,NO PROC,420,Diabetes,10,"Endocrine, Nutritional and Metabolic Diseases and Disorders",2,Moderate,Moderate,Medical,Medicaid,Medicaid,,,N,Y,79800.45,15549.11
Long Island,Nassau,2908000,000511,NYU Winthrop Hospital,70 or Older,110,F,White,Not Span/Hispanic,1,Emergency,Home w/ Home Health Services,2017,050,Diabetes mellitus with complications,058,HEMODIALYSIS,420,Diabetes,10,"Endocrine, Nutritional and Metabolic Diseases and Disorders",3,Major,Moderate,Medical,Medicare,Medicare,Blue Cross/Blue Shield,,N,Y,30619.84,5007.83
Long Island,Nassau,2908000,000511,NYU Winthrop Hospital,0 to 17,117,M,White,Not Span/Hispanic,2,Emergency,Home w/ Home Health Services,2017,050,Diabetes mellitus with complications,000,NO PROC,420,Diabetes,10,"Endocrine, Nutritional and Metabolic Diseases and Disorders",1,Minor,Minor,Medical,Blue Cross/Blue Shield,,,,N,Y,17424.82,3644.14
Long Island,Nassau,2908000,000511,NYU Winthrop Hospital,50 to 69,115,M,White,Spanish/Hispanic,3,Emergency,Home or Self Care,2017,050,Diabetes mellitus with complications,070,UP GASTRO ENDOSC/BIOPSY,420,Diabetes,10,"Endocrine, Nutritional and Metabolic Diseases and Disorders",1,Minor,Moderate,Medical,Medicare,Medicare,Medicaid,,N,Y,42272.98,8045.02
Long Island,Nassau,2908000,000511,NYU Winthrop Hospital,70 or Older,115,F,White,Spanish/Hispanic,3,Emergency,Home w/ Home Health Services,2017,050,Diabetes mellitus with complications,000,NO PROC,420,Diabetes,10,"Endocrine, Nutritional and Metabolic Diseases and Disorders",1,Minor,Major,Medical,Medicare,Medicare,Medicaid,,N,Y,45456.74,8124.24
Long Island,Nassau,2908000,000511,NYU Winthrop Hospital,70 or Older,115,M,White,Not Span/Hispanic,2,Emergency,Home w/ Home Health Services,2017,050,Diabetes mellitus with complications,168,"INCIS/DRAIN, SKIN/SUBCU",420,Diabetes,10,"Endocrine, Nutritional and Metabolic Diseases and Disorders",2,Moderate,Major,Medical,Medicare,Medicare,Private Health Insurance,,N,Y,32623.01,7092.79
Long Island,Nassau,2908000,000511,NYU Winthrop Hospital,0 to 17,116,M,Black/African American,Not Span/Hispanic,1,Urgent,Home w/ Home Health Services,2017,050,Diabetes mellitus with complications,000,NO PROC,420,Diabetes,10,"Endocrine, Nutritional and Metabolic Diseases and Disorders",2,Moderate,Minor,Medical,Private Health Insurance,,,,N,N,15228.70,2318.24
Long Island,Nassau,2908000,000511,NYU Winthrop Hospital,0 to 17,117,F,Black/African American,Not Span/Hispanic,2,Emergency,Home or Self Care,2017,050,Diabetes mellitus with complications,000,NO PROC,420,Diabetes,10,"Endocrine, Nutritional and Metabolic Diseases and Disorders",2,Moderate,Minor,Medical,Blue Cross/Blue Shield,,,,N,Y,39136.68,6011.56
Long Island,Nassau,2908000,000511,NYU Winthrop Hospital,0 to 17,117,M,White,Not Span/Hispanic,1,Emergency,Home or Self Care,2017,050,Diabetes mellitus with complications,000,NO PROC,420,Diabetes,10,"Endocrine, Nutritional and Metabolic Diseases and Disorders",2,Moderate,Minor,Medical,Medicaid,,,,N,Y,18152.42,3689.57
Long Island,Nassau,2908000,000511,NYU Winthrop Hospital,50 to 69,115,F,White,Spanish/Hispanic,7,Emergency,Skilled Nursing Home,2017,050,Diabetes mellitus with complications,000,NO PROC,420,Diabetes,10,"Endocrine, Nutritional and Metabolic Diseases and Disorders",2,Moderate,Major,Medical,Medicaid,Medicaid,,,N,Y,85876.39,15261.61
Long Island,Nassau,2908000,000511,NYU Winthrop Hospital,70 or Older,115,M,White,Not Span/Hispanic,4,Emergency,Inpatient Rehabilitation Facility,2017,050,Diabetes mellitus with complications,000,NO PROC,420,Diabetes,10,"Endocrine, Nutritional and Metabolic Diseases and Disorders",1,Minor,Moderate,Medical,Medicare,Medicare,,,N,Y,78589.99,17281.22
Long Island,Nassau,2908000,000511,NYU Winthrop Hospital,30 to 49,115,F,Black/African American,Not Span/Hispanic,2,Emergency,Home w/ Home Health Services,2017,050,Diabetes mellitus with complications,223,ENTERAL/PARENTERAL NUTR,420,Diabetes,10,"Endocrine, Nutritional and Metabolic Diseases and Disorders",1,Minor,Moderate,Medical,Medicaid,Medicaid,,,N,Y,27251.66,5681.10
Long Island,Nassau,2908000,000511,NYU Winthrop Hospital,70 or Older,115,M,White,Not Span/Hispanic,17,Emergency,Home w/ Home Health Services,2017,050,Diabetes mellitus with complications,175,OT OR THER PRC SKN/BRST,420,Diabetes,10,"Endocrine, Nutritional and Metabolic Diseases and Disorders",4,Extreme,Major,Medical,Medicare,Medicare,Self-Pay,,N,Y,241263.72,59948.39
Long Island,Nassau,2908000,000511,NYU Winthrop Hospital,50 to 69,115,M,Black/African American,Not Span/Hispanic,5,Emergency,Home or Self Care,2017,050,Diabetes mellitus with complications,000,NO PROC,420,Diabetes,10,"Endocrine, Nutritional and Metabolic Diseases and Disorders",3,Major,Minor,Medical,Medicaid,Medicaid,,,N,Y,51636.46,10281.03
Long Island,Nassau,2908000,000511,NYU Winthrop Hospital,30 to 49,115,M,Black/African American,Not Span/Hispanic,1,Emergency,Left Against Medical Advice,2017,050,Diabetes mellitus with complications,000,NO PROC,420,Diabetes,10,"Endocrine, Nutritional and Metabolic Diseases and Disorders",2,Moderate,Moderate,Medical,Medicare,Medicare,,,N,Y,31276.48,5428.79
Long Island,Nassau,2908000,000511,NYU Winthrop Hospital,0 to 17,117,F,White,Not Span/Hispanic,2,Emergency,Home w/ Home Health Services,2017,050,Diabetes mellitus with complications,000,NO PROC,420,Diabetes,10,"Endocrine, Nutritional and Metabolic Diseases and Disorders",1,Minor,Minor,Medical,Blue Cross/Blue Shield,,,,N,Y,22766.87,4442.20
Long Island,Nassau,2908000,000511,NYU Winthrop Hospital,30 to 49,115,M,Black/African American,Not Span/Hispanic,1,Emergency,Left Against Medical Advice,2017,050,Diabetes mellitus with complications,000,NO PROC,420,Diabetes,10,"Endocrine, Nutritional and Metabolic Diseases and Disorders",2,Moderate,Minor,Medical,Medicare,Medicare,,,N,Y,28109.42,4864.45
Long Island,Nassau,2908000,000511,NYU Winthrop Hospital,18 to 29,117,M,White,Spanish/Hispanic,1,Emergency,Home or Self Care,2017,050,Diabetes mellitus with complications,000,NO PROC,420,Diabetes,10,"Endocrine, Nutritional and Metabolic Diseases and Disorders",2,Moderate,Moderate,Medical,Private Health Insurance,,,,N,Y,31227.71,4947.18
Long Island,Nassau,2908000,000511,NYU Winthrop Hospital,70 or Older,115,M,White,Not Span/Hispanic,10,Emergency,Home w/ Home Health Services,2017,050,Diabetes mellitus with complications,000,NO PROC,420,Diabetes,10,"Endocrine, Nutritional and Metabolic Diseases and Disorders",4,Extreme,Major,Medical,Medicare,Private Health Insurance,,,N,Y,144991.23,31971.45
Long Island,Nassau,2908000,000511,NYU Winthrop Hospital,18 to 29,117,F,White,Not Span/Hispanic,1,Emergency,Home or Self Care,2017,050,Diabetes mellitus with complications,000,NO PROC,420,Diabetes,10,"Endocrine, Nutritional and Metabolic Diseases and Disorders",1,Minor,Minor,Medical,Private Health Insurance,Private Health Insurance,Private Health Insurance,,N,Y,38730.84,5558.92
Long Island,Nassau,2908000,000511,NYU Winthrop Hospital,18 to 29,115,F,White,Spanish/Hispanic,1,Emergency,Home or Self Care,2017,050,Diabetes mellitus with complications,000,NO PROC,420,Diabetes,10,"Endocrine, Nutritional and Metabolic Diseases and Disorders",2,Moderate,Minor,Medical,Medicaid,Medicaid,,,N,Y,24169.38,3831.59
Long Island,Nassau,2908000,000511,NYU Winthrop Hospital,0 to 17,117,F,White,Not Span/Hispanic,2,Emergency,Home or Self Care,2017,050,Diabetes mellitus with complications,000,NO PROC,420,Diabetes,10,"Endocrine, Nutritional and Metabolic Diseases and Disorders",2,Moderate,Minor,Medical,Blue Cross/Blue Shield,,,,N,Y,39316.38,5708.16
Long Island,Nassau,2908000,000511,NYU Winthrop Hospital,30 to 49,114,M,Black/African American,Not Span/Hispanic,3,Emergency,Home or Self Care,2017,049,Diabetes mellitus without complication,000,NO PROC,420,Diabetes,10,"Endocrine, Nutritional and Metabolic Diseases and Disorders",1,Minor,Minor,Medical,Private Health Insurance,,,,N,Y,51044.88,12509.68
Long Island,Nassau,2908000,000511,NYU Winthrop Hospital,0 to 17,117,M,White,Not Span/Hispanic,2,Emergency,Home w/ Home Health Services,2017,050,Diabetes mellitus with complications,000,NO PROC,420,Diabetes,10,"Endocrine, Nutritional and Metabolic Diseases and Disorders",1,Minor,Minor,Medical,Blue Cross/Blue Shield,,,,N,Y,20163.01,4013.90
Long Island,Nassau,2908000,000511,NYU Winthrop Hospital,70 or Older,117,M,White,Not Span/Hispanic,8,Emergency,Home w/ Home Health Services,2017,050,Diabetes mellitus with complications,000,NO PROC,420,Diabetes,10,"Endocrine, Nutritional and Metabolic Diseases and Disorders",2,Moderate,Moderate,Medical,Medicare,Medicare,Blue Cross/Blue Shield,,N,Y,127412.37,30298.17
Long Island,Nassau,2908000,000511,NYU Winthrop Hospital,50 to 69,115,M,Other Race,Spanish/Hispanic,2,Emergency,Home or Self Care,2017,050,Diabetes mellitus with complications,000,NO PROC,420,Diabetes,10,"Endocrine, Nutritional and Metabolic Diseases and Disorders",1,Minor,Moderate,Medical,Private Health Insurance,,,,N,Y,30271.98,6336.57
Long Island,Nassau,2908000,000511,NYU Winthrop Hospital,30 to 49,115,F,Other Race,Spanish/Hispanic,3,Emergency,Home or Self Care,2017,050,Diabetes mellitus with complications,070,UP GASTRO ENDOSC/BIOPSY,420,Diabetes,10,"Endocrine, Nutritional and Metabolic Diseases and Disorders",2,Moderate,Moderate,Medical,Medicaid,Medicaid,,,N,Y,57627.78,10381.76
Long Island,Nassau,2908000,000511,NYU Winthrop Hospital,30 to 49,110,M,White,Not Span/Hispanic,5,Emergency,Home or Self Care,2017,050,Diabetes mellitus with complications,070,UP GASTRO ENDOSC/BIOPSY,420,Diabetes,10,"Endocrine, Nutritional and Metabolic Diseases and Disorders",2,Moderate,Moderate,Medical,Private Health Insurance,Blue Cross/Blue Shield,,,N,Y,74295.35,11250.98
Long Island,Nassau,2908000,000511,NYU Winthrop Hospital,0 to 17,118,M,White,Spanish/Hispanic,1,Emergency,Home or Self Care,2017,050,Diabetes mellitus with complications,000,NO PROC,420,Diabetes,10,"Endocrine, Nutritional and Metabolic Diseases and Disorders",2,Moderate,Minor,Medical,Medicaid,,,,N,Y,27603.07,4337.87
Long Island,Nassau,2908000,000511,NYU Winthrop Hospital,30 to 49,115,M,White,Spanish/Hispanic,7,Emergency,Home or Self Care,2017,050,Diabetes mellitus with complications,000,NO PROC,420,Diabetes,10,"Endocrine, Nutritional and Metabolic Diseases and Disorders",3,Major,Major,Medical,Medicaid,Medicaid,,,N,Y,68253.84,13519.04
Long Island,Nassau,2908000,000511,NYU Winthrop Hospital,50 to 69,115,M,White,Not Span/Hispanic,3,Emergency,Home w/ Home Health Services,2017,050,Diabetes mellitus with complications,000,NO PROC,420,Diabetes,10,"Endocrine, Nutritional and Metabolic Diseases and Disorders",3,Major,Extreme,Medical,Medicare,Medicare,Medicaid,,N,Y,52783.26,12208.11
Long Island,Nassau,2908000,000511,NYU Winthrop Hospital,0 to 17,117,F,White,Not Span/Hispanic,2,Emergency,Home or Self Care,2017,050,Diabetes mellitus with complications,000,NO PROC,420,Diabetes,10,"Endocrine, Nutritional and Metabolic Diseases and Disorders",2,Moderate,Minor,Medical,Blue Cross/Blue Shield,,,,N,Y,28252.58,5447.08
Long Island,Nassau,2908000,000511,NYU Winthrop Hospital,0 to 17,,M,Black/African American,Not Span/Hispanic,2,Emergency,Home or Self Care,2017,050,Diabetes mellitus with complications,000,NO PROC,420,Diabetes,10,"Endocrine, Nutritional and Metabolic Diseases and Disorders",2,Moderate,Minor,Medical,Private Health Insurance,,,,N,Y,36972.54,6263.50
Long Island,Nassau,2908000,000511,NYU Winthrop Hospital,70 or Older,115,F,White,Not Span/Hispanic,7,Emergency,Home w/ Home Health Services,2017,050,Diabetes mellitus with complications,222,BLOOD TRANSFUSION,420,Diabetes,10,"Endocrine, Nutritional and Metabolic Diseases and Disorders",2,Moderate,Major,Medical,Medicare,Medicare,,,N,Y,65451.53,12924.82
Long Island,Nassau,2908000,000511,NYU Winthrop Hospital,70 or Older,115,F,White,Not Span/Hispanic,3,Emergency,Home w/ Home Health Services,2017,050,Diabetes mellitus with complications,168,"INCIS/DRAIN, SKIN/SUBCU",420,Diabetes,10,"Endocrine, Nutritional and Metabolic Diseases and Disorders",3,Major,Moderate,Medical,Medicare,Medicare,Blue Cross/Blue Shield,,N,Y,44459.43,11301.08
Long Island,Nassau,2908000,000511,NYU Winthrop Hospital,50 to 69,117,F,Black/African American,Not Span/Hispanic,2,Emergency,Home or Self Care,2017,050,Diabetes mellitus with complications,000,NO PROC,420,Diabetes,10,"Endocrine, Nutritional and Metabolic Diseases and Disorders",1,Minor,Minor,Medical,Blue Cross/Blue Shield,Medicare,Medicare,,N,Y,40359.92,8781.76
Long Island,Nassau,2908000,000511,NYU Winthrop Hospital,50 to 69,110,F,White,Not Span/Hispanic,4,Emergency,Home or Self Care,2017,050,Diabetes mellitus with complications,000,NO PROC,420,Diabetes,10,"Endocrine, Nutritional and Metabolic Diseases and Disorders",3,Major,Moderate,Medical,Medicare,Private Health Insurance,,,N,Y,69040.79,12586.23
Long Island,Nassau,2908000,000511,NYU Winthrop Hospital,50 to 69,114,M,Black/African American,Not Span/Hispanic,2,Emergency,Home or Self Care,2017,050,Diabetes mellitus with complications,058,HEMODIALYSIS,420,Diabetes,10,"Endocrine, Nutritional and Metabolic Diseases and Disorders",3,Major,Moderate,Medical,Private Health Insurance,,,,N,Y,32525.94,5863.77
Long Island,Nassau,2908000,000511,NYU Winthrop Hospital,0 to 17,117,F,White,Not Span/Hispanic,1,Emergency,Home or Self Care,2017,049,Diabetes mellitus without complication,000,NO PROC,420,Diabetes,10,"Endocrine, Nutritional and Metabolic Diseases and Disorders",1,Minor,Minor,Medical,Private Health Insurance,,,,N,Y,17133.29,3013.42
Long Island,Nassau,2908000,000511,NYU Winthrop Hospital,50 to 69,110,F,White,Not Span/Hispanic,4,Emergency,Home or Self Care,2017,050,Diabetes mellitus with complications,203,ELECTROGR CARDIAC MONIT,420,Diabetes,10,"Endocrine, Nutritional and Metabolic Diseases and Disorders",1,Minor,Minor,Medical,Medicare,Medicare,Private Health Insurance,,N,Y,65606.86,15931.48
Long Island,Nassau,2908000,000511,NYU Winthrop Hospital,50 to 69,110,M,White,Not Span/Hispanic,3,Emergency,Home or Self Care,2017,050,Diabetes mellitus with complications,000,NO PROC,420,Diabetes,10,"Endocrine, Nutritional and Metabolic Diseases and Disorders",3,Major,Major,Medical,Medicare,Medicare,Private Health Insurance,,N,Y,68657.58,12006.00
Long Island,Nassau,2908000,000511,NYU Winthrop Hospital,30 to 49,113,M,White,Spanish/Hispanic,1,Emergency,Home or Self Care,2017,050,Diabetes mellitus with complications,201,CARDIAC STRESS TESTS,420,Diabetes,10,"Endocrine, Nutritional and Metabolic Diseases and Disorders",1,Minor,Minor,Medical,Blue Cross/Blue Shield,,,,N,Y,30863.51,5674.62
Long Island,Nassau,2908000,000511,NYU Winthrop Hospital,18 to 29,115,M,Black/African American,Not Span/Hispanic,2,Emergency,Home or Self Care,2017,050,Diabetes mellitus with complications,000,NO PROC,420,Diabetes,10,"Endocrine, Nutritional and Metabolic Diseases and Disorders",2,Moderate,Minor,Medical,Blue Cross/Blue Shield,,,,N,Y,49599.22,8377.12
Long Island,Nassau,2908000,000511,NYU Winthrop Hospital,70 or Older,110,F,White,Not Span/Hispanic,5,Emergency,Skilled Nursing Home,2017,050,Diabetes mellitus with complications,000,NO PROC,420,Diabetes,10,"Endocrine, Nutritional and Metabolic Diseases and Disorders",3,Major,Major,Medical,Medicare,Medicare,Blue Cross/Blue Shield,,N,Y,51007.70,9559.31
Long Island,Nassau,2908000,000511,NYU Winthrop Hospital,50 to 69,117,F,White,Spanish/Hispanic,1,Emergency,Home or Self Care,2017,049,Diabetes mellitus without complication,000,NO PROC,420,Diabetes,10,"Endocrine, Nutritional and Metabolic Diseases and Disorders",1,Minor,Minor,Medical,Private Health Insurance,,,,N,N,3338.00,1015.24
Long Island,Nassau,2908000,000511,NYU Winthrop Hospital,30 to 49,117,M,Other Race,Not Span/Hispanic,3,Emergency,Home or Self Care,2017,050,Diabetes mellitus with complications,000,NO PROC,420,Diabetes,10,"Endocrine, Nutritional and Metabolic Diseases and Disorders",3,Major,Moderate,Medical,Blue Cross/Blue Shield,,,,N,Y,47174.93,7611.89
Long Island,Nassau,2908000,000511,NYU Winthrop Hospital,70 or Older,115,M,White,Not Span/Hispanic,1,Urgent,Home w/ Home Health Services,2017,050,Diabetes mellitus with complications,000,NO PROC,420,Diabetes,10,"Endocrine, Nutritional and Metabolic Diseases and Disorders",2,Moderate,Moderate,Medical,Medicare,Medicare,Private Health Insurance,,N,Y,58368.04,11638.74
Long Island,Nassau,2908000,000511,NYU Winthrop Hospital,30 to 49,115,F,Black/African American,Not Span/Hispanic,2,Emergency,Home w/ Home Health Services,2017,050,Diabetes mellitus with complications,000,NO PROC,420,Diabetes,10,"Endocrine, Nutritional and Metabolic Diseases and Disorders",1,Minor,Minor,Medical,Medicare,Medicare,Medicaid,,N,Y,29057.43,6118.99
Long Island,Nassau,2908000,000511,NYU Winthrop Hospital,70 or Older,115,F,White,Not Span/Hispanic,1,Emergency,Home w/ Home Health Services,2017,050,Diabetes mellitus with complications,000,NO PROC,420,Diabetes,10,"Endocrine, Nutritional and Metabolic Diseases and Disorders",2,Moderate,Minor,Medical,Medicare,Medicare,Private Health Insurance,,N,Y,28698.74,6492.79
Long Island,Nassau,2908000,000511,NYU Winthrop Hospital,18 to 29,115,M,White,Not Span/Hispanic,3,Emergency,Home or Self Care,2017,050,Diabetes mellitus with complications,000,NO PROC,420,Diabetes,10,"Endocrine, Nutritional and Metabolic Diseases and Disorders",2,Moderate,Minor,Medical,Blue Cross/Blue Shield,,,,N,Y,54927.09,9537.67
Long Island,Nassau,2908000,000511,NYU Winthrop Hospital,18 to 29,115,M,White,Spanish/Hispanic,3,Emergency,Home or Self Care,2017,050,Diabetes mellitus with complications,000,NO PROC,420,Diabetes,10,"Endocrine, Nutritional and Metabolic Diseases and Disorders",2,Moderate,Minor,Medical,Medicaid,Medicaid,,,N,Y,109663.72,22155.57
Long Island,Nassau,2908000,000511,NYU Winthrop Hospital,50 to 69,OOS,F,White,Spanish/Hispanic,10,Emergency,Home w/ Home Health Services,2017,050,Diabetes mellitus with complications,092,OTHER BOWEL DX PRCS,420,Diabetes,10,"Endocrine, Nutritional and Metabolic Diseases and Disorders",3,Major,Major,Medical,Medicaid,,,,N,Y,111154.32,23352.25
Long Island,Nassau,2908000,000511,NYU Winthrop Hospital,30 to 49,115,F,Other Race,Spanish/Hispanic,3,Emergency,Home or Self Care,2017,050,Diabetes mellitus with complications,000,NO PROC,420,Diabetes,10,"Endocrine, Nutritional and Metabolic Diseases and Disorders",1,Minor,Minor,Medical,Medicaid,,,,N,Y,49349.70,6625.86
Long Island,Nassau,2908000,000511,NYU Winthrop Hospital,50 to 69,110,F,White,Not Span/Hispanic,1,Emergency,Home or Self Care,2017,050,Diabetes mellitus with complications,000,NO PROC,420,Diabetes,10,"Endocrine, Nutritional and Metabolic Diseases and Disorders",2,Moderate,Minor,Medical,Blue Cross/Blue Shield,,,,N,Y,32939.90,5622.26