Hospital Service Area,Hospital County,Operating Certificate Number,Permanent Facility Id,Facility Name,Age Group,Zip Code - 3 digits,Gender,Race,Ethnicity,Length of Stay,Type of Admission,Patient Disposition,Discharge Year,CCS Diagnosis Code,CCS Diagnosis Description,CCS Procedure Code,CCS Procedure Description,APR DRG Code,APR DRG Description,APR MDC Code,APR MDC Description,APR Severity of Illness Code,APR Severity of Illness Description,APR Risk of Mortality,APR Medical Surgical Description,Payment Typology 1,Payment Typology 2,Payment Typology 3,Birth Weight,Abortion Edit Indicator,Emergency Department Indicator,Total Charges,Total Costs
New York City,Kings,7002053,001304,NYU Langone Hospital-Brooklyn,18 to 29,112,M,Black/African American,Unknown,4,Emergency,Home or Self Care,2019,END003,DIABETES MELLITUS WITH COMPLICATION,,,420,DIABETES,10,"ENDOCRINE, NUTRITIONAL AND METABOLIC DISEASES AND DISORDERS",3,Major,Minor,Medical,Medicaid,,,,,true,63318.67,19179.07
New York City,Kings,7002053,001304,NYU Langone Hospital-Brooklyn,50 to 69,112,F,Other Race,Spanish/Hispanic,3,Emergency,Home or Self Care,2019,END003,DIABETES MELLITUS WITH COMPLICATION,,,420,DIABETES,10,"ENDOCRINE, NUTRITIONAL AND METABOLIC DISEASES AND DISORDERS",3,Major,Moderate,Medical,Private Health Insurance,,,,,true,40863.64,11674.31
New York City,Kings,7002053,001304,NYU Langone Hospital-Brooklyn,18 to 29,104,F,Other Race,Not Span/Hispanic,3,Emergency,Home or Self Care,2019,END003,DIABETES MELLITUS WITH COMPLICATION,,,420,DIABETES,10,"ENDOCRINE, NUTRITIONAL AND METABOLIC DISEASES AND DISORDERS",3,Major,Major,Medical,Medicaid,,,,,true,60058.15,20455.56
New York City,Kings,7002053,001304,NYU Langone Hospital-Brooklyn,30 to 49,112,M,Other Race,Spanish/Hispanic,2,Emergency,Home or Self Care,2019,END003,DIABETES MELLITUS WITH COMPLICATION,ADM015,ADMINISTRATION OF ANTIBIOTICS,420,DIABETES,10,"ENDOCRINE, NUTRITIONAL AND METABOLIC DISEASES AND DISORDERS",2,Moderate,Moderate,Medical,Medicaid,,,,,true,51870.02,11643.98
New York City,Kings,7002053,001304,NYU Langone Hospital-Brooklyn,50 to 69,112,F,Other Race,Spanish/Hispanic,1,Emergency,Home or Self Care,2019,END003,DIABETES MELLITUS WITH COMPLICATION,,,420,DIABETES,10,"ENDOCRINE, NUTRITIONAL AND METABOLIC DISEASES AND DISORDERS",2,Moderate,Moderate,Medical,Medicare,Medicaid,,,,true,28466.19,5357.39
New York City,Kings,7002053,001304,NYU Langone Hospital-Brooklyn,70 or Older,112,M,White,Not Span/Hispanic,1,Emergency,Home or Self Care,2019,END003,DIABETES MELLITUS WITH COMPLICATION,ADM007,INTRAVENOUS INDUCTION OF LABOR,420,DIABETES,10,"ENDOCRINE, NUTRITIONAL AND METABOLIC DISEASES AND DISORDERS",3,Major,Major,Medical,Medicare,Medicare,,,,true,36881.67,7002.02
New York City,Kings,7002053,001304,NYU Langone Hospital-Brooklyn,70 or Older,112,M,White,Not Span/Hispanic,3,Emergency,Home or Self Care,2019,END003,DIABETES MELLITUS WITH COMPLICATION,,,420,DIABETES,10,"ENDOCRINE, NUTRITIONAL AND METABOLIC DISEASES AND DISORDERS",3,Major,Major,Medical,Medicaid,,,,,true,48762.4,14763.65
New York City,Kings,7002053,001304,NYU Langone Hospital-Brooklyn,50 to 69,112,M,Other Race,Not Span/Hispanic,2,Emergency,Home w/ Home Health Services,2019,END003,DIABETES MELLITUS WITH COMPLICATION,,,420,DIABETES,10,"ENDOCRINE, NUTRITIONAL AND METABOLIC DISEASES AND DISORDERS",3,Major,Major,Medical,Medicare,,,,,true,44019.71,9421.94
New York City,Kings,7002053,001304,NYU Langone Hospital-Brooklyn,70 or Older,112,M,Other Race,Not Span/Hispanic,2,Emergency,Home w/ Home Health Services,2019,END003,DIABETES MELLITUS WITH COMPLICATION,,,420,DIABETES,10,"ENDOCRINE, NUTRITIONAL AND METABOLIC DISEASES AND DISORDERS",2,Moderate,Major,Medical,Medicare,,,,,true,46665.83,8757.8
New York City,Kings,7002053,001304,NYU Langone Hospital-Brooklyn,50 to 69,112,F,Other Race,Unknown,2,Emergency,Home or Self Care,2019,END003,DIABETES MELLITUS WITH COMPLICATION,ADM021,"ADMINISTRATION OF THERAPEUTIC SUBSTANCES, NEC",420,DIABETES,10,"ENDOCRINE, NUTRITIONAL AND METABOLIC DISEASES AND DISORDERS",3,Major,Major,Medical,Private Health Insurance,,,,,true,51158.1,13661.83
New York City,Kings,7002053,001304,NYU Langone Hospital-Brooklyn,70 or Older,112,F,Other Race,Spanish/Hispanic,1,Emergency,Home or Self Care,2019,END003,DIABETES MELLITUS WITH COMPLICATION,,,420,DIABETES,10,"ENDOCRINE, NUTRITIONAL AND METABOLIC DISEASES AND DISORDERS",3,Major,Major,Medical,Blue Cross/Blue Shield,Medicaid,,,,true,27695.13,9418.92
New York City,Kings,7002053,001304,NYU Langone Hospital-Brooklyn,50 to 69,112,M,Black/African American,Not Span/Hispanic,1,Emergency,Left Against Medical Advice,2019,END003,DIABETES MELLITUS WITH COMPLICATION,,,420,DIABETES,10,"ENDOCRINE, NUTRITIONAL AND METABOLIC DISEASES AND DISORDERS",3,Major,Moderate,Medical,Private Health Insurance,,,,,true,29705.75,9177.19
New York City,Kings,7002053,001304,NYU Langone Hospital-Brooklyn,70 or Older,112,F,Other Race,Not Span/Hispanic,2,Emergency,Home w/ Home Health Services,2019,END003,DIABETES MELLITUS WITH COMPLICATION,,,420,DIABETES,10,"ENDOCRINE, NUTRITIONAL AND METABOLIC DISEASES AND DISORDERS",2,Moderate,Major,Medical,Medicare,Medicaid,,,,true,39296.13,8982.48
New York City,Kings,7002053,001304,NYU Langone Hospital-Brooklyn,70 or Older,112,F,Other Race,Not Span/Hispanic,1,Emergency,Home w/ Home Health Services,2019,END003,DIABETES MELLITUS WITH COMPLICATION,ADM015,ADMINISTRATION OF ANTIBIOTICS,420,DIABETES,10,"ENDOCRINE, NUTRITIONAL AND METABOLIC DISEASES AND DISORDERS",3,Major,Major,Medical,Medicare,Medicaid,,,,true,21632.88,5210.87
New York City,Kings,7002053,001304,NYU Langone Hospital-Brooklyn,30 to 49,112,M,Black/African American,Not Span/Hispanic,1,Emergency,Home or Self Care,2019,END003,DIABETES MELLITUS WITH COMPLICATION,,,420,DIABETES,10,"ENDOCRINE, NUTRITIONAL AND METABOLIC DISEASES AND DISORDERS",3,Major,Moderate,Medical,Medicare,,,,,true,29845.68,6351.5
New York City,Kings,7002053,001304,NYU Langone Hospital-Brooklyn,50 to 69,112,M,Black/African American,Not Span/Hispanic,1,Emergency,Home w/ Home Health Services,2019,END003,DIABETES MELLITUS WITH COMPLICATION,ESA001,HEMODIALYSIS,420,DIABETES,10,"ENDOCRINE, NUTRITIONAL AND METABOLIC DISEASES AND DISORDERS",3,Major,Major,Medical,Medicare,Medicaid,,,,true,37837.21,11391.7
New York City,Kings,7002053,001304,NYU Langone Hospital-Brooklyn,50 to 69,112,F,White,Not Span/Hispanic,1,Emergency,Home or Self Care,2019,END003,DIABETES MELLITUS WITH COMPLICATION,,,420,DIABETES,10,"ENDOCRINE, NUTRITIONAL AND METABOLIC DISEASES AND DISORDERS",3,Major,Moderate,Medical,Private Health Insurance,,,,,true,25196.15,5723.38
New York City,Kings,7002053,001304,NYU Langone Hospital-Brooklyn,50 to 69,112,M,Black/African American,Not Span/Hispanic,1,Emergency,Home or Self Care,2019,END003,DIABETES MELLITUS WITH COMPLICATION,,,420,DIABETES,10,"ENDOCRINE, NUTRITIONAL AND METABOLIC DISEASES AND DISORDERS",3,Major,Major,Medical,Medicaid,,,,,true,16054.83,4603.34
New York City,Kings,7002053,001304,NYU Langone Hospital-Brooklyn,30 to 49,112,F,Other Race,Not Span/Hispanic,3,Emergency,Home w/ Home Health Services,2019,END003,DIABETES MELLITUS WITH COMPLICATION,,,420,DIABETES,10,"ENDOCRINE, NUTRITIONAL AND METABOLIC DISEASES AND DISORDERS",3,Major,Moderate,Medical,Medicaid,,,,,true,72863.9,18236.41
New York City,Kings,7002053,001304,NYU Langone Hospital-Brooklyn,70 or Older,112,F,White,Spanish/Hispanic,1,Emergency,Home w/ Home Health Services,2019,END003,DIABETES MELLITUS WITH COMPLICATION,,,420,DIABETES,10,"ENDOCRINE, NUTRITIONAL AND METABOLIC DISEASES AND DISORDERS",2,Moderate,Major,Medical,Medicare,,,,,true,22718.7,5196.25
New York City,Kings,7002053,001304,NYU Langone Hospital-Brooklyn,50 to 69,112,M,Other Race,Spanish/Hispanic,3,Emergency,Home w/ Home Health Services,2019,END003,DIABETES MELLITUS WITH COMPLICATION,,,420,DIABETES,10,"ENDOCRINE, NUTRITIONAL AND METABOLIC DISEASES AND DISORDERS",3,Major,Major,Medical,Private Health Insurance,,,,,true,62457.08,17226.54
New York City,Kings,7002053,001304,NYU Langone Hospital-Brooklyn,50 to 69,112,F,White,Spanish/Hispanic,3,Emergency,Home or Self Care,2019,END003,DIABETES MELLITUS WITH COMPLICATION,,,420,DIABETES,10,"ENDOCRINE, NUTRITIONAL AND METABOLIC DISEASES AND DISORDERS",2,Moderate,Major,Medical,Private Health Insurance,Medicare,,,,true,83643.21,19606.77
New York City,Kings,7002053,001304,NYU Langone Hospital-Brooklyn,70 or Older,112,F,White,Spanish/Hispanic,5,Emergency,Home w/ Home Health Services,2019,END003,DIABETES MELLITUS WITH COMPLICATION,,,420,DIABETES,10,"ENDOCRINE, NUTRITIONAL AND METABOLIC DISEASES AND DISORDERS",3,Major,Major,Medical,Medicaid,,,,,true,66978.11,22615.46
New York City,Kings,7002053,001304,NYU Langone Hospital-Brooklyn,50 to 69,112,F,White,Not Span/Hispanic,5,Emergency,Home or Self Care,2019,END003,DIABETES MELLITUS WITH COMPLICATION,CAR024,VENOUS AND ARTERIAL CATHETER PLACEMENT,420,DIABETES,10,"ENDOCRINE, NUTRITIONAL AND METABOLIC DISEASES AND DISORDERS",3,Major,Major,Medical,Medicaid,,,,,true,123258.92,31558.06
New York City,Kings,7002053,001304,NYU Langone Hospital-Brooklyn,70 or Older,112,F,Other Race,Spanish/Hispanic,3,Emergency,Home or Self Care,2019,END003,DIABETES MELLITUS WITH COMPLICATION,MAM011,ELECTROENCEPHALOGRAM (EEG),420,DIABETES,10,"ENDOCRINE, NUTRITIONAL AND METABOLIC DISEASES AND DISORDERS",4,Extreme,Extreme,Medical,Medicaid,,,,,true,67247.37,19156.96
New York City,Kings,7002053,001304,NYU Langone Hospital-Brooklyn,70 or Older,112,F,Black/African American,Not Span/Hispanic,6,Emergency,Home w/ Home Health Services,2019,END003,DIABETES MELLITUS WITH COMPLICATION,,,420,DIABETES,10,"ENDOCRINE, NUTRITIONAL AND METABOLIC DISEASES AND DISORDERS",3,Major,Major,Medical,Private Health Insurance,Medicaid,Medicare,,,true,126483.89,27971.48
New York City,Kings,7002053,001304,NYU Langone Hospital-Brooklyn,70 or Older,112,M,White,Not Span/Hispanic,1,Emergency,Skilled Nursing Home,2019,END003,DIABETES MELLITUS WITH COMPLICATION,,,420,DIABETES,10,"ENDOCRINE, NUTRITIONAL AND METABOLIC DISEASES AND DISORDERS",3,Major,Major,Medical,Medicare,Medicaid,,,,true,47379.81,16977.26
New York City,Kings,7002053,001304,NYU Langone Hospital-Brooklyn,70 or Older,112,F,Black/African American,Unknown,2,Emergency,Home or Self Care,2019,END003,DIABETES MELLITUS WITH COMPLICATION,,,420,DIABETES,10,"ENDOCRINE, NUTRITIONAL AND METABOLIC DISEASES AND DISORDERS",2,Moderate,Major,Medical,Medicare,Blue Cross/Blue Shield,,,,true,34629.1,9054.63
New York City,Kings,7002053,001304,NYU Langone Hospital-Brooklyn,70 or Older,112,F,Other Race,Spanish/Hispanic,3,Emergency,Home w/ Home Health Services,2019,END003,DIABETES MELLITUS WITH COMPLICATION,ADM007,INTRAVENOUS INDUCTION OF LABOR,420,DIABETES,10,"ENDOCRINE, NUTRITIONAL AND METABOLIC DISEASES AND DISORDERS",3,Major,Moderate,Medical,Medicare,Medicaid,,,,true,43672.97,12389.96
New York City,Kings,7002053,001304,NYU Langone Hospital-Brooklyn,70 or Older,112,F,White,Not Span/Hispanic,5,Emergency,Home w/ Home Health Services,2019,END003,DIABETES MELLITUS WITH COMPLICATION,,,420,DIABETES,10,"ENDOCRINE, NUTRITIONAL AND METABOLIC DISEASES AND DISORDERS",3,Major,Major,Medical,Medicare,Medicare,,,,true,61489.85,18679.33
New York City,Kings,7002053,001304,NYU Langone Hospital-Brooklyn,50 to 69,112,F,Other Race,Spanish/Hispanic,1,Emergency,Home or Self Care,2019,END003,DIABETES MELLITUS WITH COMPLICATION,,,420,DIABETES,10,"ENDOCRINE, NUTRITIONAL AND METABOLIC DISEASES AND DISORDERS",2,Moderate,Moderate,Medical,Medicaid,,,,,true,20588.73,5133.91
New York City,Kings,7002053,001304,NYU Langone Hospital-Brooklyn,18 to 29,104,M,Other Race,Unknown,2,Emergency,Home or Self Care,2019,END003,DIABETES MELLITUS WITH COMPLICATION,ADM021,"ADMINISTRATION OF THERAPEUTIC SUBSTANCES, NEC",420,DIABETES,10,"ENDOCRINE, NUTRITIONAL AND METABOLIC DISEASES AND DISORDERS",2,Moderate,Minor,Medical,Private Health Insurance,,,,,true,25118.25,7699.23
New York City,Kings,7002053,001304,NYU Langone Hospital-Brooklyn,70 or Older,112,M,White,Not Span/Hispanic,2,Emergency,Hospice - Medical Facility,2019,END003,DIABETES MELLITUS WITH COMPLICATION,CAR024,VENOUS AND ARTERIAL CATHETER PLACEMENT,420,DIABETES,10,"ENDOCRINE, NUTRITIONAL AND METABOLIC DISEASES AND DISORDERS",3,Major,Major,Medical,Medicare,,,,,true,51677.37,17536.26
New York City,Kings,7002053,001304,NYU Langone Hospital-Brooklyn,50 to 69,112,F,Black/African American,Not Span/Hispanic,1,Emergency,Home or Self Care,2019,END003,DIABETES MELLITUS WITH COMPLICATION,,,420,DIABETES,10,"ENDOCRINE, NUTRITIONAL AND METABOLIC DISEASES AND DISORDERS",3,Major,Major,Medical,Medicare,Medicaid,,,,true,29607.28,11029.05
New York City,Kings,7002053,001304,NYU Langone Hospital-Brooklyn,50 to 69,112,M,Other Race,Not Span/Hispanic,1,Emergency,Home or Self Care,2019,END003,DIABETES MELLITUS WITH COMPLICATION,,,420,DIABETES,10,"ENDOCRINE, NUTRITIONAL AND METABOLIC DISEASES AND DISORDERS",1,Minor,Minor,Medical,Medicare,Medicare,,,,true,66797.91,13869.73
New York City,Kings,7002053,001304,NYU Langone Hospital-Brooklyn,30 to 49,112,F,Other Race,Spanish/Hispanic,1,Emergency,Home or Self Care,2019,END003,DIABETES MELLITUS WITH COMPLICATION,,,420,DIABETES,10,"ENDOCRINE, NUTRITIONAL AND METABOLIC DISEASES AND DISORDERS",1,Minor,Moderate,Medical,Medicaid,,,,,true,55907.23,13908.58
New York City,Kings,7002053,001304,NYU Langone Hospital-Brooklyn,50 to 69,112,M,White,Not Span/Hispanic,4,Emergency,Home w/ Home Health Services,2019,END003,DIABETES MELLITUS WITH COMPLICATION,CNS002,LUMBAR PUNCTURE,420,DIABETES,10,"ENDOCRINE, NUTRITIONAL AND METABOLIC DISEASES AND DISORDERS",3,Major,Major,Medical,Medicaid,,,,,true,124995.41,33789.28
New York City,Kings,7002053,001304,NYU Langone Hospital-Brooklyn,30 to 49,112,M,Other Race,Spanish/Hispanic,2,Emergency,Home or Self Care,2019,END003,DIABETES MELLITUS WITH COMPLICATION,ADM007,INTRAVENOUS INDUCTION OF LABOR,420,DIABETES,10,"ENDOCRINE, NUTRITIONAL AND METABOLIC DISEASES AND DISORDERS",2,Moderate,Minor,Medical,Medicaid,,,,,true,28482.79,8286.87
New York City,Kings,7002053,001304,NYU Langone Hospital-Brooklyn,50 to 69,114,F,Other Race,Not Span/Hispanic,2,Emergency,Home w/ Home Health Services,2019,END003,DIABETES MELLITUS WITH COMPLICATION,,,420,DIABETES,10,"ENDOCRINE, NUTRITIONAL AND METABOLIC DISEASES AND DISORDERS",3,Major,Minor,Medical,Medicaid,,,,,true,62225.06,9445.5
New York City,Kings,7002053,001304,NYU Langone Hospital-Brooklyn,50 to 69,113,M,Multi-racial,Spanish/Hispanic,1,Emergency,Home or Self Care,2019,END003,DIABETES MELLITUS WITH COMPLICATION,,,420,DIABETES,10,"ENDOCRINE, NUTRITIONAL AND METABOLIC DISEASES AND DISORDERS",2,Moderate,Moderate,Medical,Medicaid,,,,,true,20165.25,4913.71
New York City,Kings,7002053,001304,NYU Langone Hospital-Brooklyn,18 to 29,112,F,Other Race,Spanish/Hispanic,2,Emergency,Home or Self Care,2019,END003,DIABETES MELLITUS WITH COMPLICATION,ADM021,"ADMINISTRATION OF THERAPEUTIC SUBSTANCES, NEC",420,DIABETES,10,"ENDOCRINE, NUTRITIONAL AND METABOLIC DISEASES AND DISORDERS",3,Major,Moderate,Medical,Medicaid,,,,,true,50099.66,12991.92
New York City,Kings,7002053,001304,NYU Langone Hospital-Brooklyn,50 to 69,112,M,White,Spanish/Hispanic,5,Emergency,Home or Self Care,2019,END003,DIABETES MELLITUS WITH COMPLICATION,,,420,DIABETES,10,"ENDOCRINE, NUTRITIONAL AND METABOLIC DISEASES AND DISORDERS",3,Major,Moderate,Medical,Medicaid,,,,,true,100171.06,31815.81
New York City,Kings,7002053,001304,NYU Langone Hospital-Brooklyn,50 to 69,112,M,Other Race,Spanish/Hispanic,2,Emergency,Home or Self Care,2019,END003,DIABETES MELLITUS WITH COMPLICATION,ESA001,HEMODIALYSIS,420,DIABETES,10,"ENDOCRINE, NUTRITIONAL AND METABOLIC DISEASES AND DISORDERS",3,Major,Major,Medical,Medicaid,,,,,true,57539.87,13953.13
New York City,Kings,7002053,001304,NYU Langone Hospital-Brooklyn,50 to 69,112,M,White,Not Span/Hispanic,5,Emergency,Home or Self Care,2019,END003,DIABETES MELLITUS WITH COMPLICATION,ENT015,DENTAL PROCEDURES,420,DIABETES,10,"ENDOCRINE, NUTRITIONAL AND METABOLIC DISEASES AND DISORDERS",3,Major,Minor,Medical,Medicaid,,,,,true,80301.3,23523.24
New York City,Kings,7002053,001304,NYU Langone Hospital-Brooklyn,70 or Older,112,F,White,Unknown,2,Emergency,Home or Self Care,2019,END003,DIABETES MELLITUS WITH COMPLICATION,ADM001,TRANSFUSION OF BLOOD AND BLOOD PRODUCTS,420,DIABETES,10,"ENDOCRINE, NUTRITIONAL AND METABOLIC DISEASES AND DISORDERS",3,Major,Moderate,Medical,Blue Cross/Blue Shield,Medicare,,,,true,52455.11,10969.52
New York City,Kings,7002053,001304,NYU Langone Hospital-Brooklyn,30 to 49,112,M,White,Spanish/Hispanic,4,Emergency,Home or Self Care,2019,END003,DIABETES MELLITUS WITH COMPLICATION,,,420,DIABETES,10,"ENDOCRINE, NUTRITIONAL AND METABOLIC DISEASES AND DISORDERS",3,Major,Moderate,Medical,Medicaid,,,,,true,69110.19,23138.74
New York City,Kings,7002053,001304,NYU Langone Hospital-Brooklyn,70 or Older,112,F,White,Spanish/Hispanic,2,Emergency,Home w/ Home Health Services,2019,END003,DIABETES MELLITUS WITH COMPLICATION,,,420,DIABETES,10,"ENDOCRINE, NUTRITIONAL AND METABOLIC DISEASES AND DISORDERS",3,Major,Major,Medical,Medicaid,,,,,true,48479.54,13947.46
New York City,Kings,7002053,001304,NYU Langone Hospital-Brooklyn,30 to 49,112,M,Other Race,Spanish/Hispanic,2,Emergency,Home or Self Care,2019,END003,DIABETES MELLITUS WITH COMPLICATION,,,420,DIABETES,10,"ENDOCRINE, NUTRITIONAL AND METABOLIC DISEASES AND DISORDERS",2,Moderate,Minor,Medical,Medicaid,,,,,true,36487.35,8529.46
New York City,Kings,7002053,001304,NYU Langone Hospital-Brooklyn,50 to 69,112,M,Other Race,Not Span/Hispanic,1,Emergency,Home w/ Home Health Services,2019,END003,DIABETES MELLITUS WITH COMPLICATION,,,420,DIABETES,10,"ENDOCRINE, NUTRITIONAL AND METABOLIC DISEASES AND DISORDERS",3,Major,Major,Medical,Medicare,,,,,true,28120.25,6219.88
New York City,Kings,7002053,001304,NYU Langone Hospital-Brooklyn,50 to 69,112,M,Other Race,Unknown,3,Emergency,Home w/ Home Health Services,2019,END003,DIABETES MELLITUS WITH COMPLICATION,,,420,DIABETES,10,"ENDOCRINE, NUTRITIONAL AND METABOLIC DISEASES AND DISORDERS",3,Major,Major,Medical,Medicaid,,,,,true,56858.27,19787.18
New York City,Kings,7002053,001304,NYU Langone Hospital-Brooklyn,30 to 49,112,M,White,Unknown,1,Emergency,Home or Self Care,2019,END003,DIABETES MELLITUS WITH COMPLICATION,,,420,DIABETES,10,"ENDOCRINE, NUTRITIONAL AND METABOLIC DISEASES AND DISORDERS",1,Minor,Minor,Medical,Medicaid,,,,,true,20035.63,5213.66
New York City,Kings,7002053,001304,NYU Langone Hospital-Brooklyn,70 or Older,112,F,Other Race,Not Span/Hispanic,3,Emergency,Home w/ Home Health Services,2019,END003,DIABETES MELLITUS WITH COMPLICATION,,,420,DIABETES,10,"ENDOCRINE, NUTRITIONAL AND METABOLIC DISEASES AND DISORDERS",3,Major,Major,Medical,Medicare,Medicaid,,,,true,53909.08,12644.74
New York City,Kings,7002053,001304,NYU Langone Hospital-Brooklyn,70 or Older,112,F,Other Race,Spanish/Hispanic,1,Emergency,Home or Self Care,2019,END003,DIABETES MELLITUS WITH COMPLICATION,,,420,DIABETES,10,"ENDOCRINE, NUTRITIONAL AND METABOLIC DISEASES AND DISORDERS",1,Minor,Minor,Medical,Medicare,,,,,true,13609.99,4294.1
New York City,Kings,7002053,001304,NYU Langone Hospital-Brooklyn,50 to 69,112,M,Other Race,Spanish/Hispanic,3,Emergency,Home w/ Home Health Services,2019,END003,DIABETES MELLITUS WITH COMPLICATION,,,420,DIABETES,10,"ENDOCRINE, NUTRITIONAL AND METABOLIC DISEASES AND DISORDERS",3,Major,Major,Medical,Private Health Insurance,Medicaid,,,,true,55302.32,12824.85
New York City,Kings,7002053,001304,NYU Langone Hospital-Brooklyn,30 to 49,112,M,White,Not Span/Hispanic,2,Emergency,Home or Self Care,2019,END003,DIABETES MELLITUS WITH COMPLICATION,OTR004,ISOLATION PROCEDURES,420,DIABETES,10,"ENDOCRINE, NUTRITIONAL AND METABOLIC DISEASES AND DISORDERS",3,Major,Moderate,Medical,Private Health Insurance,,,,,true,38395.31,9073.45
New York City,Kings,7002053,001304,NYU Langone Hospital-Brooklyn,70 or Older,112,M,White,Not Span/Hispanic,1,Emergency,Home or Self Care,2019,END003,DIABETES MELLITUS WITH COMPLICATION,,,420,DIABETES,10,"ENDOCRINE, NUTRITIONAL AND METABOLIC DISEASES AND DISORDERS",3,Major,Moderate,Medical,Medicare,,,,,true,22431.46,5058.11
New York City,Kings,7002053,001304,NYU Langone Hospital-Brooklyn,30 to 49,100,F,Other Race,Spanish/Hispanic,2,Emergency,Left Against Medical Advice,2019,END003,DIABETES MELLITUS WITH COMPLICATION,,,420,DIABETES,10,"ENDOCRINE, NUTRITIONAL AND METABOLIC DISEASES AND DISORDERS",1,Minor,Minor,Medical,Medicaid,,,,,true,30983.81,7955.58
New York City,Kings,7002053,001304,NYU Langone Hospital-Brooklyn,50 to 69,112,M,Other Race,Spanish/Hispanic,1,Emergency,Home or Self Care,2019,END003,DIABETES MELLITUS WITH COMPLICATION,,,420,DIABETES,10,"ENDOCRINE, NUTRITIONAL AND METABOLIC DISEASES AND DISORDERS",1,Minor,Minor,Medical,Medicaid,,,,,true,27880.18,8874
New York City,Kings,7002053,001304,NYU Langone Hospital-Brooklyn,18 to 29,112,M,Black/African American,Not Span/Hispanic,2,Emergency,Home or Self Care,2019,END003,DIABETES MELLITUS WITH COMPLICATION,,,420,DIABETES,10,"ENDOCRINE, NUTRITIONAL AND METABOLIC DISEASES AND DISORDERS",3,Major,Minor,Medical,Private Health Insurance,,,,,true,48165.84,16785.87
New York City,Kings,7002053,001304,NYU Langone Hospital-Brooklyn,30 to 49,112,M,Black/African American,Not Span/Hispanic,4,Emergency,Home or Self Care,2019,END003,DIABETES MELLITUS WITH COMPLICATION,,,420,DIABETES,10,"ENDOCRINE, NUTRITIONAL AND METABOLIC DISEASES AND DISORDERS",3,Major,Major,Medical,Medicaid,,,,,true,76082.61,19837.06
New York City,Kings,7002053,001304,NYU Langone Hospital-Brooklyn,70 or Older,112,M,Other Race,Not Span/Hispanic,1,Emergency,Home or Self Care,2019,END003,DIABETES MELLITUS WITH COMPLICATION,,,420,DIABETES,10,"ENDOCRINE, NUTRITIONAL AND METABOLIC DISEASES AND DISORDERS",1,Minor,Moderate,Medical,Medicare,Medicaid,,,,true,14950.2,4510.21
New York City,Kings,7002053,001304,NYU Langone Hospital-Brooklyn,50 to 69,112,F,Other Race,Spanish/Hispanic,4,Emergency,Home w/ Home Health Services,2019,END003,DIABETES MELLITUS WITH COMPLICATION,OTR004,ISOLATION PROCEDURES,420,DIABETES,10,"ENDOCRINE, NUTRITIONAL AND METABOLIC DISEASES AND DISORDERS",3,Major,Major,Medical,Medicare,Medicaid,,,,true,68254.88,17272.74
New York City,Kings,7002053,001304,NYU Langone Hospital-Brooklyn,30 to 49,112,F,White,Not Span/Hispanic,1,Emergency,Home or Self Care,2019,END003,DIABETES MELLITUS WITH COMPLICATION,,,420,DIABETES,10,"ENDOCRINE, NUTRITIONAL AND METABOLIC DISEASES AND DISORDERS",2,Moderate,Minor,Medical,Private Health Insurance,,,,,true,30498.1,6534.62
New York City,Kings,7002053,001304,NYU Langone Hospital-Brooklyn,30 to 49,112,F,Black/African American,Unknown,2,Emergency,Home or Self Care,2019,END003,DIABETES MELLITUS WITH COMPLICATION,,,420,DIABETES,10,"ENDOCRINE, NUTRITIONAL AND METABOLIC DISEASES AND DISORDERS",1,Minor,Minor,Medical,Medicaid,,,,,true,27492.3,8050.7
New York City,Kings,7002053,001304,NYU Langone Hospital-Brooklyn,50 to 69,112,M,Other Race,Spanish/Hispanic,2,Emergency,Home w/ Home Health Services,2019,END003,DIABETES MELLITUS WITH COMPLICATION,,,420,DIABETES,10,"ENDOCRINE, NUTRITIONAL AND METABOLIC DISEASES AND DISORDERS",3,Major,Moderate,Medical,Medicaid,,,,,true,32576.75,9199.55
New York City,Kings,7002053,001304,NYU Langone Hospital-Brooklyn,50 to 69,112,M,Other Race,Spanish/Hispanic,1,Emergency,Home or Self Care,2019,END003,DIABETES MELLITUS WITH COMPLICATION,,,420,DIABETES,10,"ENDOCRINE, NUTRITIONAL AND METABOLIC DISEASES AND DISORDERS",3,Major,Major,Medical,Medicaid,,,,,true,25493.95,5717.96
New York City,Kings,7002053,001304,NYU Langone Hospital-Brooklyn,30 to 49,112,M,Other Race,Spanish/Hispanic,3,Emergency,Home or Self Care,2019,END003,DIABETES MELLITUS WITH COMPLICATION,,,420,DIABETES,10,"ENDOCRINE, NUTRITIONAL AND METABOLIC DISEASES AND DISORDERS",3,Major,Minor,Medical,Medicaid,,,,,true,45209.44,12277.71