Hospital Service Area,Hospital County,Operating Certificate Number,Permanent Facility Id,Facility Name,Age Group,Zip Code - 3 digits,Gender,Race,Ethnicity,Length of Stay,Type of Admission,Patient Disposition,Discharge Year,CCS Diagnosis Code,CCS Diagnosis Description,CCS Procedure Code,CCS Procedure Description,APR DRG Code,APR DRG Description,APR MDC Code,APR MDC Description,APR Severity of Illness Code,APR Severity of Illness Description,APR Risk of Mortality,APR Medical Surgical Description,Payment Typology 1,Payment Typology 2,Payment Typology 3,Birth Weight,Abortion Edit Indicator,Emergency Department Indicator,Total Charges,Total Costs
New York City,Bronx,7000006,001168,Montefiore Medical Center-Wakefield Hospital,50 to 69,104,M,Black/African American,Not Span/Hispanic,3,Emergency,Home or Self Care,2020,END003,DIABETES MELLITUS WITH COMPLICATION,,,420,DIABETES,10,"ENDOCRINE, NUTRITIONAL AND METABOLIC DISEASES AND DISORDERS",2,Moderate,Minor,Medical,Self-Pay,,,,,Y,44538.34,6371.2
New York City,Bronx,7000006,001169,Montefiore Medical Center - Henry & Lucy Moses Div,50 to 69,104,F,Other Race,Spanish/Hispanic,2,Emergency,Home or Self Care,2020,END003,DIABETES MELLITUS WITH COMPLICATION,ADM021,"ADMINISTRATION OF THERAPEUTIC SUBSTANCES, NEC",420,DIABETES,10,"ENDOCRINE, NUTRITIONAL AND METABOLIC DISEASES AND DISORDERS",3,Major,Minor,Medical,Medicare,Medicaid,,,,Y,39588.55,5530.03
New York City,Bronx,7000006,001168,Montefiore Medical Center-Wakefield Hospital,70 or Older,104,F,Other Race,Spanish/Hispanic,2,Emergency,Home or Self Care,2020,END003,DIABETES MELLITUS WITH COMPLICATION,ADM021,"ADMINISTRATION OF THERAPEUTIC SUBSTANCES, NEC",420,DIABETES,10,"ENDOCRINE, NUTRITIONAL AND METABOLIC DISEASES AND DISORDERS",2,Moderate,Moderate,Medical,Medicare,,,,,Y,26608.98,4790.57
New York City,Bronx,7000006,001169,Montefiore Medical Center - Henry & Lucy Moses Div,70 or Older,104,M,Other Race,Spanish/Hispanic,4,Emergency,Home w/ Home Health Services,2020,END003,DIABETES MELLITUS WITH COMPLICATION,,,420,DIABETES,10,"ENDOCRINE, NUTRITIONAL AND METABOLIC DISEASES AND DISORDERS",1,Minor,Moderate,Medical,Medicare,Medicaid,,,,Y,37542.04,7153.85
New York City,Bronx,7000006,001169,Montefiore Medical Center - Henry & Lucy Moses Div,70 or Older,104,F,Black/African American,Not Span/Hispanic,8,Emergency,Home w/ Home Health Services,2020,END003,DIABETES MELLITUS WITH COMPLICATION,CAR024,VENOUS AND ARTERIAL CATHETER PLACEMENT,420,DIABETES,10,"ENDOCRINE, NUTRITIONAL AND METABOLIC DISEASES AND DISORDERS",3,Major,Major,Medical,Medicare,Private Health Insurance,,,,Y,103368.54,17314.81
New York City,Bronx,7000006,001169,Montefiore Medical Center - Henry & Lucy Moses Div,0 to 17,104,M,Other Race,Spanish/Hispanic,1,Emergency,Home or Self Care,2020,END003,DIABETES MELLITUS WITH COMPLICATION,,,420,DIABETES,10,"ENDOCRINE, NUTRITIONAL AND METABOLIC DISEASES AND DISORDERS",2,Moderate,Minor,Medical,Medicaid,,,,,Y,25392.74,4207.64
New York City,Bronx,7000006,003058,Montefiore Med Center - Jack D Weiler Hosp of A Einstein College Div,70 or Older,104,M,Other Race,Spanish/Hispanic,2,Emergency,Home w/ Home Health Services,2020,END003,DIABETES MELLITUS WITH COMPLICATION,ADM007,INTRAVENOUS INDUCTION OF LABOR,420,DIABETES,10,"ENDOCRINE, NUTRITIONAL AND METABOLIC DISEASES AND DISORDERS",1,Minor,Major,Medical,Medicare,,,,,Y,20767.41,3119.89
New York City,Bronx,7000006,003058,Montefiore Med Center - Jack D Weiler Hosp of A Einstein College Div,50 to 69,104,F,Other Race,Spanish/Hispanic,10,Emergency,Inpatient Rehabilitation Facility,2020,END003,DIABETES MELLITUS WITH COMPLICATION,ADM007,INTRAVENOUS INDUCTION OF LABOR,420,DIABETES,10,"ENDOCRINE, NUTRITIONAL AND METABOLIC DISEASES AND DISORDERS",2,Moderate,Major,Medical,Medicare,Medicaid,,,,Y,112441.88,20328.54
New York City,Bronx,7000006,001169,Montefiore Medical Center - Henry & Lucy Moses Div,18 to 29,104,F,White,Spanish/Hispanic,2,Emergency,Home or Self Care,2020,END003,DIABETES MELLITUS WITH COMPLICATION,ADM021,"ADMINISTRATION OF THERAPEUTIC SUBSTANCES, NEC",420,DIABETES,10,"ENDOCRINE, NUTRITIONAL AND METABOLIC DISEASES AND DISORDERS",2,Moderate,Minor,Medical,Medicaid,,,,,Y,42705.69,6366.87
New York City,Bronx,7000006,001169,Montefiore Medical Center - Henry & Lucy Moses Div,70 or Older,107,M,Other Race,Unknown,2,Emergency,Home w/ Home Health Services,2020,END003,DIABETES MELLITUS WITH COMPLICATION,ADM007,INTRAVENOUS INDUCTION OF LABOR,420,DIABETES,10,"ENDOCRINE, NUTRITIONAL AND METABOLIC DISEASES AND DISORDERS",1,Minor,Moderate,Medical,Medicare,,,,,Y,21751.01,3495.92
New York City,Bronx,7000006,001168,Montefiore Medical Center-Wakefield Hospital,50 to 69,104,M,Black/African American,Not Span/Hispanic,3,Emergency,Home or Self Care,2020,END003,DIABETES MELLITUS WITH COMPLICATION,,,420,DIABETES,10,"ENDOCRINE, NUTRITIONAL AND METABOLIC DISEASES AND DISORDERS",2,Moderate,Major,Medical,Private Health Insurance,,,,,Y,39853.67,6186.49
New York City,Bronx,7000006,001169,Montefiore Medical Center - Henry & Lucy Moses Div,30 to 49,104,M,Black/African American,Not Span/Hispanic,2,Emergency,Left Against Medical Advice,2020,END003,DIABETES MELLITUS WITH COMPLICATION,NCM001,PLANAR NUCLEAR MEDICINE IMAGING,420,DIABETES,10,"ENDOCRINE, NUTRITIONAL AND METABOLIC DISEASES AND DISORDERS",2,Moderate,Minor,Medical,Private Health Insurance,,,,,Y,66471.38,10730.17
New York City,Bronx,7000006,001169,Montefiore Medical Center - Henry & Lucy Moses Div,70 or Older,104,F,Other Race,Spanish/Hispanic,11,Emergency,Expired,2020,END003,DIABETES MELLITUS WITH COMPLICATION,ADM015,ADMINISTRATION OF ANTIBIOTICS,420,DIABETES,10,"ENDOCRINE, NUTRITIONAL AND METABOLIC DISEASES AND DISORDERS",4,Extreme,Extreme,Medical,Medicare,,,,,Y,212987.69,37679.91
New York City,Bronx,7000006,001169,Montefiore Medical Center - Henry & Lucy Moses Div,50 to 69,104,M,Other Race,Spanish/Hispanic,4,Emergency,Home w/ Home Health Services,2020,END003,DIABETES MELLITUS WITH COMPLICATION,ADM007,INTRAVENOUS INDUCTION OF LABOR,420,DIABETES,10,"ENDOCRINE, NUTRITIONAL AND METABOLIC DISEASES AND DISORDERS",1,Minor,Moderate,Medical,Medicare,Medicaid,,,,Y,58171.53,9451.42
New York City,Bronx,7000006,001169,Montefiore Medical Center - Henry & Lucy Moses Div,70 or Older,104,F,Other Race,Unknown,3,Emergency,Home w/ Home Health Services,2020,END003,DIABETES MELLITUS WITH COMPLICATION,ADM007,INTRAVENOUS INDUCTION OF LABOR,420,DIABETES,10,"ENDOCRINE, NUTRITIONAL AND METABOLIC DISEASES AND DISORDERS",2,Moderate,Minor,Medical,Medicare,Medicaid,,,,Y,36753.35,7178.61
New York City,Bronx,7000006,003058,Montefiore Med Center - Jack D Weiler Hosp of A Einstein College Div,50 to 69,104,M,Other Race,Spanish/Hispanic,4,Emergency,Home or Self Care,2020,END003,DIABETES MELLITUS WITH COMPLICATION,IMG008,ULTRASONOGRAPHY,420,DIABETES,10,"ENDOCRINE, NUTRITIONAL AND METABOLIC DISEASES AND DISORDERS",2,Moderate,Minor,Medical,Private Health Insurance,,,,,Y,85280.6,10652.58
New York City,Manhattan,7002024,001456,Mount Sinai Hospital,70 or Older,100,M,Other Race,Not Span/Hispanic,6,Emergency,Home or Self Care,2020,END003,DIABETES MELLITUS WITH COMPLICATION,MAM015,"MEASUREMENT AND MONITORING, NEC",420,DIABETES,10,"ENDOCRINE, NUTRITIONAL AND METABOLIC DISEASES AND DISORDERS",3,Major,Major,Medical,Medicare,Medicaid,Self-Pay,,,Y,90290.95,22135.4
New York City,Bronx,7000006,001168,Montefiore Medical Center-Wakefield Hospital,50 to 69,104,M,Black/African American,Not Span/Hispanic,5,Emergency,Home or Self Care,2020,END003,DIABETES MELLITUS WITH COMPLICATION,ADM007,INTRAVENOUS INDUCTION OF LABOR,420,DIABETES,10,"ENDOCRINE, NUTRITIONAL AND METABOLIC DISEASES AND DISORDERS",3,Major,Major,Medical,Medicare,Medicaid,,,,Y,87607.53,14662.37
New York City,Bronx,7000006,003058,Montefiore Med Center - Jack D Weiler Hosp of A Einstein College Div,30 to 49,104,M,Black/African American,Not Span/Hispanic,4,Emergency,Home w/ Home Health Services,2020,END003,DIABETES MELLITUS WITH COMPLICATION,,,420,DIABETES,10,"ENDOCRINE, NUTRITIONAL AND METABOLIC DISEASES AND DISORDERS",1,Minor,Minor,Medical,Private Health Insurance,,,,,Y,38775.23,6056.28
New York City,Bronx,7000006,001169,Montefiore Medical Center - Henry & Lucy Moses Div,30 to 49,104,M,Other Race,Spanish/Hispanic,5,Emergency,Home or Self Care,2020,END003,DIABETES MELLITUS WITH COMPLICATION,ADM007,INTRAVENOUS INDUCTION OF LABOR,420,DIABETES,10,"ENDOCRINE, NUTRITIONAL AND METABOLIC DISEASES AND DISORDERS",3,Major,Major,Medical,Private Health Insurance,,,,,Y,69587.19,11317.3
New York City,Bronx,7000006,003058,Montefiore Med Center - Jack D Weiler Hosp of A Einstein College Div,50 to 69,104,F,White,Not Span/Hispanic,2,Emergency,Home or Self Care,2020,END003,DIABETES MELLITUS WITH COMPLICATION,ADM007,INTRAVENOUS INDUCTION OF LABOR,420,DIABETES,10,"ENDOCRINE, NUTRITIONAL AND METABOLIC DISEASES AND DISORDERS",2,Moderate,Moderate,Medical,Private Health Insurance,Private Health Insurance,,,,Y,44182.73,5852.83
New York City,Bronx,7000006,001169,Montefiore Medical Center - Henry & Lucy Moses Div,30 to 49,104,M,Other Race,Spanish/Hispanic,2,Emergency,Home or Self Care,2020,END003,DIABETES MELLITUS WITH COMPLICATION,,,420,DIABETES,10,"ENDOCRINE, NUTRITIONAL AND METABOLIC DISEASES AND DISORDERS",1,Minor,Minor,Medical,Medicaid,,,,,Y,33528.93,5259.67
New York City,Bronx,7000006,001168,Montefiore Medical Center-Wakefield Hospital,70 or Older,104,F,Other Race,Spanish/Hispanic,5,Emergency,Home w/ Home Health Services,2020,END003,DIABETES MELLITUS WITH COMPLICATION,ADM017,ADMINISTRATION OF NUTRITIONAL AND ELECTROLYTIC SUBSTANCES,420,DIABETES,10,"ENDOCRINE, NUTRITIONAL AND METABOLIC DISEASES AND DISORDERS",2,Moderate,Moderate,Medical,Medicare,,,,,Y,66184.22,11974.24
New York City,Bronx,7000006,003058,Montefiore Med Center - Jack D Weiler Hosp of A Einstein College Div,50 to 69,104,F,Other Race,Not Span/Hispanic,2,Emergency,Home w/ Home Health Services,2020,END003,DIABETES MELLITUS WITH COMPLICATION,MAM007,ELECTROCARDIOGRAM (ECG),420,DIABETES,10,"ENDOCRINE, NUTRITIONAL AND METABOLIC DISEASES AND DISORDERS",4,Extreme,Major,Medical,Medicaid,,,,,Y,36813.58,5800.44
New York City,Bronx,7000006,003058,Montefiore Med Center - Jack D Weiler Hosp of A Einstein College Div,70 or Older,104,F,Black/African American,Unknown,6,Emergency,Home w/ Home Health Services,2020,END003,DIABETES MELLITUS WITH COMPLICATION,ADM007,INTRAVENOUS INDUCTION OF LABOR,420,DIABETES,10,"ENDOCRINE, NUTRITIONAL AND METABOLIC DISEASES AND DISORDERS",2,Moderate,Major,Medical,Medicare,,,,,Y,61800.49,10931.4
New York City,Bronx,7000006,001169,Montefiore Medical Center - Henry & Lucy Moses Div,70 or Older,104,F,Other Race,Spanish/Hispanic,1,Emergency,Home or Self Care,2020,END003,DIABETES MELLITUS WITH COMPLICATION,ADM015,ADMINISTRATION OF ANTIBIOTICS,420,DIABETES,10,"ENDOCRINE, NUTRITIONAL AND METABOLIC DISEASES AND DISORDERS",1,Minor,Minor,Medical,Medicare,Medicaid,,,,Y,23370.73,3848.53
Capital/Adirond,Otsego,3801000,000739,A.O. Fox Memorial Hospital,30 to 49,138,M,White,Not Span/Hispanic,6,Emergency,Home or Self Care,2020,END003,DIABETES MELLITUS WITH COMPLICATION,SUD001,SUBSTANCE USE DETOXIFICATION,420,DIABETES,10,"ENDOCRINE, NUTRITIONAL AND METABOLIC DISEASES AND DISORDERS",2,Moderate,Moderate,Medical,Medicaid,,,,,Y,11480.43,8547.39
New York City,Bronx,7000006,001168,Montefiore Medical Center-Wakefield Hospital,30 to 49,104,M,Black/African American,Not Span/Hispanic,1,Emergency,Home or Self Care,2020,END003,DIABETES MELLITUS WITH COMPLICATION,,,420,DIABETES,10,"ENDOCRINE, NUTRITIONAL AND METABOLIC DISEASES AND DISORDERS",1,Minor,Minor,Medical,Medicaid,,,,,Y,33736.89,4996.03
New York City,Bronx,7000006,001169,Montefiore Medical Center - Henry & Lucy Moses Div,50 to 69,104,M,Other Race,Spanish/Hispanic,1,Emergency,Home or Self Care,2020,END003,DIABETES MELLITUS WITH COMPLICATION,ADM007,INTRAVENOUS INDUCTION OF LABOR,420,DIABETES,10,"ENDOCRINE, NUTRITIONAL AND METABOLIC DISEASES AND DISORDERS",1,Minor,Minor,Medical,Private Health Insurance,,,,,Y,20675.14,3127.27
New York City,Bronx,7000006,001169,Montefiore Medical Center - Henry & Lucy Moses Div,30 to 49,104,F,Other Race,Spanish/Hispanic,5,Emergency,Home w/ Home Health Services,2020,END003,DIABETES MELLITUS WITH COMPLICATION,,,420,DIABETES,10,"ENDOCRINE, NUTRITIONAL AND METABOLIC DISEASES AND DISORDERS",2,Moderate,Minor,Medical,Medicare,Medicaid,,,,Y,57620.07,10275.92
New York City,Bronx,7000006,003058,Montefiore Med Center - Jack D Weiler Hosp of A Einstein College Div,50 to 69,104,M,White,Not Span/Hispanic,2,Emergency,Home w/ Home Health Services,2020,END003,DIABETES MELLITUS WITH COMPLICATION,ADM007,INTRAVENOUS INDUCTION OF LABOR,420,DIABETES,10,"ENDOCRINE, NUTRITIONAL AND METABOLIC DISEASES AND DISORDERS",2,Moderate,Minor,Medical,Blue Cross/Blue Shield,,,,,Y,31136.44,4386.31
New York City,Bronx,7000006,001169,Montefiore Medical Center - Henry & Lucy Moses Div,0 to 17,104,M,Black/African American,Not Span/Hispanic,4,Emergency,Home or Self Care,2020,END003,DIABETES MELLITUS WITH COMPLICATION,,,420,DIABETES,10,"ENDOCRINE, NUTRITIONAL AND METABOLIC DISEASES AND DISORDERS",1,Minor,Minor,Medical,Medicaid,,,,,Y,50477.99,12652.05
New York City,Bronx,7000006,001169,Montefiore Medical Center - Henry & Lucy Moses Div,0 to 17,104,F,Black/African American,Not Span/Hispanic,9,Emergency,Home or Self Care,2020,END003,DIABETES MELLITUS WITH COMPLICATION,,,420,DIABETES,10,"ENDOCRINE, NUTRITIONAL AND METABOLIC DISEASES AND DISORDERS",1,Minor,Minor,Medical,Medicaid,,,,,Y,97318.62,27023.98
New York City,Manhattan,7002024,001456,Mount Sinai Hospital,30 to 49,117,M,Black/African American,Not Span/Hispanic,2,Urgent,Home or Self Care,2020,END003,DIABETES MELLITUS WITH COMPLICATION,ESA004,NON-INVASIVE VENTILATION,420,DIABETES,10,"ENDOCRINE, NUTRITIONAL AND METABOLIC DISEASES AND DISORDERS",1,Minor,Minor,Medical,Private Health Insurance,Self-Pay,,,,N,22877.16,5928.87
New York City,Manhattan,7002024,001456,Mount Sinai Hospital,70 or Older,100,F,Black/African American,Not Span/Hispanic,3,Emergency,Home or Self Care,2020,END003,DIABETES MELLITUS WITH COMPLICATION,ESA001,HEMODIALYSIS,420,DIABETES,10,"ENDOCRINE, NUTRITIONAL AND METABOLIC DISEASES AND DISORDERS",3,Major,Major,Medical,Medicare,Private Health Insurance,Self-Pay,,,Y,41330.34,10226.72
New York City,Bronx,7000006,001169,Montefiore Medical Center - Henry & Lucy Moses Div,50 to 69,107,M,Other Race,Spanish/Hispanic,2,Emergency,Home or Self Care,2020,END003,DIABETES MELLITUS WITH COMPLICATION,,,420,DIABETES,10,"ENDOCRINE, NUTRITIONAL AND METABOLIC DISEASES AND DISORDERS",2,Moderate,Minor,Medical,Medicare,Medicaid,,,,Y,30716.43,4179.1
New York City,Bronx,7000006,001169,Montefiore Medical Center - Henry & Lucy Moses Div,50 to 69,104,M,Black/African American,Not Span/Hispanic,4,Emergency,Home or Self Care,2020,END003,DIABETES MELLITUS WITH COMPLICATION,,,420,DIABETES,10,"ENDOCRINE, NUTRITIONAL AND METABOLIC DISEASES AND DISORDERS",3,Major,Moderate,Medical,Private Health Insurance,,,,,Y,48628.16,9473.36
New York City,Bronx,7000006,001169,Montefiore Medical Center - Henry & Lucy Moses Div,30 to 49,104,M,Other Race,Spanish/Hispanic,4,Emergency,Home w/ Home Health Services,2020,END003,DIABETES MELLITUS WITH COMPLICATION,ADM021,"ADMINISTRATION OF THERAPEUTIC SUBSTANCES, NEC",420,DIABETES,10,"ENDOCRINE, NUTRITIONAL AND METABOLIC DISEASES AND DISORDERS",1,Minor,Minor,Medical,Medicaid,,,,,Y,68640.62,11477.56
New York City,Bronx,7000006,001169,Montefiore Medical Center - Henry & Lucy Moses Div,18 to 29,104,F,Other Race,Not Span/Hispanic,2,Emergency,Home or Self Care,2020,END003,DIABETES MELLITUS WITH COMPLICATION,,,420,DIABETES,10,"ENDOCRINE, NUTRITIONAL AND METABOLIC DISEASES AND DISORDERS",1,Minor,Minor,Medical,Blue Cross/Blue Shield,,,,,Y,33370,7026.15
New York City,Manhattan,7002024,001456,Mount Sinai Hospital,18 to 29,100,M,Other Race,Spanish/Hispanic,3,Emergency,Home or Self Care,2020,END003,DIABETES MELLITUS WITH COMPLICATION,GIS004,GI SYSTEM ENDOSCOPY WITHOUT BIOPSY (DIAGNOSTIC),420,DIABETES,10,"ENDOCRINE, NUTRITIONAL AND METABOLIC DISEASES AND DISORDERS",2,Moderate,Major,Medical,Medicaid,Medicaid,Self-Pay,,,Y,51557.24,13459.05
New York City,Manhattan,7002024,001456,Mount Sinai Hospital,30 to 49,100,F,Black/African American,Not Span/Hispanic,2,Emergency,Home or Self Care,2020,END003,DIABETES MELLITUS WITH COMPLICATION,,,420,DIABETES,10,"ENDOCRINE, NUTRITIONAL AND METABOLIC DISEASES AND DISORDERS",3,Major,Minor,Medical,Blue Cross/Blue Shield,Self-Pay,,,,Y,28847.34,8032.95
New York City,Bronx,7000006,001169,Montefiore Medical Center - Henry & Lucy Moses Div,18 to 29,104,F,Black/African American,Not Span/Hispanic,1,Emergency,Home or Self Care,2020,END003,DIABETES MELLITUS WITH COMPLICATION,ADM007,INTRAVENOUS INDUCTION OF LABOR,420,DIABETES,10,"ENDOCRINE, NUTRITIONAL AND METABOLIC DISEASES AND DISORDERS",1,Minor,Minor,Medical,Medicaid,,,,,Y,18855.05,3967.18
New York City,Bronx,7000006,003058,Montefiore Med Center - Jack D Weiler Hosp of A Einstein College Div,70 or Older,104,M,Other Race,Unknown,2,Emergency,Home or Self Care,2020,END003,DIABETES MELLITUS WITH COMPLICATION,ADM007,INTRAVENOUS INDUCTION OF LABOR,420,DIABETES,10,"ENDOCRINE, NUTRITIONAL AND METABOLIC DISEASES AND DISORDERS",1,Minor,Moderate,Medical,Medicare,,,,,Y,21956.46,3575.13
New York City,Bronx,7000006,001169,Montefiore Medical Center - Henry & Lucy Moses Div,30 to 49,104,F,Other Race,Spanish/Hispanic,3,Emergency,Home or Self Care,2020,END003,DIABETES MELLITUS WITH COMPLICATION,IMG006,COMPUTERIZED TOMOGRAPHY (CT) WITH CONTRAST,420,DIABETES,10,"ENDOCRINE, NUTRITIONAL AND METABOLIC DISEASES AND DISORDERS",3,Major,Major,Medical,Medicaid,,,,,Y,72679.46,9246.56
New York City,Bronx,7000006,001169,Montefiore Medical Center - Henry & Lucy Moses Div,18 to 29,104,M,Black/African American,Not Span/Hispanic,7,Emergency,Home or Self Care,2020,END003,DIABETES MELLITUS WITH COMPLICATION,ADM021,"ADMINISTRATION OF THERAPEUTIC SUBSTANCES, NEC",420,DIABETES,10,"ENDOCRINE, NUTRITIONAL AND METABOLIC DISEASES AND DISORDERS",3,Major,Major,Medical,Private Health Insurance,,,,,Y,85946.51,14759.18
New York City,Bronx,7000006,001168,Montefiore Medical Center-Wakefield Hospital,50 to 69,104,M,Other Race,Not Span/Hispanic,1,Emergency,Home or Self Care,2020,END003,DIABETES MELLITUS WITH COMPLICATION,ADM007,INTRAVENOUS INDUCTION OF LABOR,420,DIABETES,10,"ENDOCRINE, NUTRITIONAL AND METABOLIC DISEASES AND DISORDERS",1,Minor,Minor,Medical,Medicare,Medicaid,,,,Y,19220.83,3010.35
New York City,Bronx,7000006,003058,Montefiore Med Center - Jack D Weiler Hosp of A Einstein College Div,70 or Older,104,M,White,Not Span/Hispanic,5,Emergency,Skilled Nursing Home,2020,END003,DIABETES MELLITUS WITH COMPLICATION,,,420,DIABETES,10,"ENDOCRINE, NUTRITIONAL AND METABOLIC DISEASES AND DISORDERS",1,Minor,Moderate,Medical,Medicare,Blue Cross/Blue Shield,,,,Y,60423.65,11727.97
New York City,Bronx,7000006,003058,Montefiore Med Center - Jack D Weiler Hosp of A Einstein College Div,50 to 69,104,M,Other Race,Not Span/Hispanic,2,Emergency,Home or Self Care,2020,END003,DIABETES MELLITUS WITH COMPLICATION,ADM021,"ADMINISTRATION OF THERAPEUTIC SUBSTANCES, NEC",420,DIABETES,10,"ENDOCRINE, NUTRITIONAL AND METABOLIC DISEASES AND DISORDERS",2,Moderate,Moderate,Medical,Medicaid,,,,,Y,29922,5046.94
New York City,Bronx,7000006,003058,Montefiore Med Center - Jack D Weiler Hosp of A Einstein College Div,70 or Older,104,F,Other Race,Spanish/Hispanic,10,Emergency,Skilled Nursing Home,2020,END003,DIABETES MELLITUS WITH COMPLICATION,ADM021,"ADMINISTRATION OF THERAPEUTIC SUBSTANCES, NEC",420,DIABETES,10,"ENDOCRINE, NUTRITIONAL AND METABOLIC DISEASES AND DISORDERS",3,Major,Major,Medical,Medicare,Medicaid,,,,Y,120854.47,21827.31
New York City,Bronx,7000006,001168,Montefiore Medical Center-Wakefield Hospital,70 or Older,104,F,Black/African American,Not Span/Hispanic,12,Emergency,Skilled Nursing Home,2020,END003,DIABETES MELLITUS WITH COMPLICATION,ADM007,INTRAVENOUS INDUCTION OF LABOR,420,DIABETES,10,"ENDOCRINE, NUTRITIONAL AND METABOLIC DISEASES AND DISORDERS",3,Major,Major,Medical,Medicare,,,,,Y,168812.61,31313.88
New York City,Manhattan,7002032,001469,Mount Sinai Morningside,50 to 69,100,M,White,Spanish/Hispanic,3,Emergency,Home or Self Care,2020,END003,DIABETES MELLITUS WITH COMPLICATION,ADM007,INTRAVENOUS INDUCTION OF LABOR,420,DIABETES,10,"ENDOCRINE, NUTRITIONAL AND METABOLIC DISEASES AND DISORDERS",1,Minor,Minor,Medical,Medicaid,Medicaid,Self-Pay,,,Y,38290.3,8885.32
New York City,Kings,7002002,001324,Mount Sinai Brooklyn,50 to 69,112,M,Black/African American,Spanish/Hispanic,5,Emergency,Home or Self Care,2020,END003,DIABETES MELLITUS WITH COMPLICATION,IMG008,ULTRASONOGRAPHY,420,DIABETES,10,"ENDOCRINE, NUTRITIONAL AND METABOLIC DISEASES AND DISORDERS",3,Major,Moderate,Medical,Medicaid,Self-Pay,,,,Y,59130.22,8798.99
New York City,Manhattan,7002032,001469,Mount Sinai Morningside,70 or Older,100,F,Black/African American,Not Span/Hispanic,3,Emergency,Home or Self Care,2020,END003,DIABETES MELLITUS WITH COMPLICATION,ADM001,TRANSFUSION OF BLOOD AND BLOOD PRODUCTS,420,DIABETES,10,"ENDOCRINE, NUTRITIONAL AND METABOLIC DISEASES AND DISORDERS",3,Major,Major,Medical,Medicare,Medicare,Self-Pay,,,Y,39285.82,8482.05
New York City,Kings,7002002,001324,Mount Sinai Brooklyn,50 to 69,112,F,Black/African American,Not Span/Hispanic,3,Emergency,Home or Self Care,2020,END003,DIABETES MELLITUS WITH COMPLICATION,,,420,DIABETES,10,"ENDOCRINE, NUTRITIONAL AND METABOLIC DISEASES AND DISORDERS",2,Moderate,Moderate,Medical,Medicare,Miscellaneous/Other,Medicaid,,,Y,34245.54,5095.15
New York City,Kings,7002002,001324,Mount Sinai Brooklyn,50 to 69,112,F,Black/African American,Not Span/Hispanic,3,Emergency,Home or Self Care,2020,END003,DIABETES MELLITUS WITH COMPLICATION,,,420,DIABETES,10,"ENDOCRINE, NUTRITIONAL AND METABOLIC DISEASES AND DISORDERS",2,Moderate,Minor,Medical,Medicaid,Self-Pay,,,,Y,40290.92,9151.82
New York City,Manhattan,7002032,001469,Mount Sinai Morningside,70 or Older,100,F,Black/African American,Not Span/Hispanic,5,Emergency,Home w/ Home Health Services,2020,END003,DIABETES MELLITUS WITH COMPLICATION,ADM007,INTRAVENOUS INDUCTION OF LABOR,420,DIABETES,10,"ENDOCRINE, NUTRITIONAL AND METABOLIC DISEASES AND DISORDERS",3,Major,Major,Medical,Medicare,Medicaid,Self-Pay,,,Y,64806.33,15223.02
New York City,Kings,7002002,001324,Mount Sinai Brooklyn,50 to 69,112,F,Black/African American,Not Span/Hispanic,7,Emergency,Home or Self Care,2020,END003,DIABETES MELLITUS WITH COMPLICATION,MAM007,ELECTROCARDIOGRAM (ECG),420,DIABETES,10,"ENDOCRINE, NUTRITIONAL AND METABOLIC DISEASES AND DISORDERS",1,Minor,Minor,Medical,Medicare,Self-Pay,,,,Y,75308.14,10936.31
New York City,Manhattan,7002032,001469,Mount Sinai Morningside,70 or Older,100,M,Multi-racial,Not Span/Hispanic,2,Emergency,Home or Self Care,2020,END003,DIABETES MELLITUS WITH COMPLICATION,ADM021,"ADMINISTRATION OF THERAPEUTIC SUBSTANCES, NEC",420,DIABETES,10,"ENDOCRINE, NUTRITIONAL AND METABOLIC DISEASES AND DISORDERS",3,Major,Major,Medical,Medicare,Medicare,Self-Pay,,,Y,26857.97,5690.48
New York City,Kings,7002002,001324,Mount Sinai Brooklyn,30 to 49,112,F,Black/African American,Not Span/Hispanic,2,Emergency,Home or Self Care,2020,END003,DIABETES MELLITUS WITH COMPLICATION,ADM007,INTRAVENOUS INDUCTION OF LABOR,420,DIABETES,10,"ENDOCRINE, NUTRITIONAL AND METABOLIC DISEASES AND DISORDERS",2,Moderate,Minor,Medical,Private Health Insurance,Self-Pay,,,,Y,27935.32,7291.7
New York City,Manhattan,7002032,001469,Mount Sinai Morningside,50 to 69,100,M,Other Race,Spanish/Hispanic,4,Emergency,Home w/ Home Health Services,2020,END003,DIABETES MELLITUS WITH COMPLICATION,IMG008,ULTRASONOGRAPHY,420,DIABETES,10,"ENDOCRINE, NUTRITIONAL AND METABOLIC DISEASES AND DISORDERS",4,Extreme,Extreme,Medical,Medicaid,Medicaid,Self-Pay,,,Y,63210.98,15276.68