Hospital Service Area,Hospital County,Operating Certificate Number,Permanent Facility Id,Facility Name,Age Group,Zip Code - 3 digits,Gender,Race,Ethnicity,Length of Stay,Type of Admission,Patient Disposition,Discharge Year,CCS Diagnosis Code,CCS Diagnosis Description,CCS Procedure Code,CCS Procedure Description,APR DRG Code,APR DRG Description,APR MDC Code,APR MDC Description,APR Severity of Illness Code,APR Severity of Illness Description,APR Risk of Mortality,APR Medical Surgical Description,Payment Typology 1,Payment Typology 2,Payment Typology 3,Birth Weight,Abortion Edit Indicator,Emergency Department Indicator,Total Charges,Total Costs
Long Island,Nassau,2908000,000511,NYU Winthrop Hospital,70 or Older,117,F,White,Not Span/Hispanic,4,Emergency,Hospice - Home,2017,058,Other nutritional; endocrine; and metabolic disorders,000,NO PROC,421,"Malnutrition, failure to thrive & other nutritional disorders",10,"Endocrine, Nutritional and Metabolic Diseases and Disorders",3,Major,Major,Medical,Medicare,Medicare,,,N,Y,33657.66,6908.41
Long Island,Nassau,2908000,000511,NYU Winthrop Hospital,70 or Older,115,F,White,Not Span/Hispanic,9,Emergency,Home w/ Home Health Services,2017,058,Other nutritional; endocrine; and metabolic disorders,000,NO PROC,421,"Malnutrition, failure to thrive & other nutritional disorders",10,"Endocrine, Nutritional and Metabolic Diseases and Disorders",3,Major,Major,Medical,Medicare,Medicare,Medicaid,,N,Y,80977.98,14850.46
Long Island,Nassau,2908000,000511,NYU Winthrop Hospital,70 or Older,115,F,Black/African American,Not Span/Hispanic,9,Emergency,Skilled Nursing Home,2017,058,Other nutritional; endocrine; and metabolic disorders,193,DX ULTRASOUND HEART,421,"Malnutrition, failure to thrive & other nutritional disorders",10,"Endocrine, Nutritional and Metabolic Diseases and Disorders",3,Major,Major,Medical,Medicare,Medicare,Private Health Insurance,,N,Y,90750.08,16940.87
Long Island,Nassau,2908000,000511,NYU Winthrop Hospital,70 or Older,115,F,Other Race,Not Span/Hispanic,3,Emergency,Home w/ Home Health Services,2017,058,Other nutritional; endocrine; and metabolic disorders,000,NO PROC,421,"Malnutrition, failure to thrive & other nutritional disorders",10,"Endocrine, Nutritional and Metabolic Diseases and Disorders",2,Moderate,Minor,Medical,Medicare,Medicare,Private Health Insurance,,N,Y,30114.45,5147.18
Long Island,Nassau,2908000,000511,NYU Winthrop Hospital,0 to 17,115,M,Black/African American,Not Span/Hispanic,38,Emergency,Skilled Nursing Home,2017,058,Other nutritional; endocrine; and metabolic disorders,073,ILEO- & OT ENTER-OSTOMY,421,"Malnutrition, failure to thrive & other nutritional disorders",10,"Endocrine, Nutritional and Metabolic Diseases and Disorders",3,Major,Moderate,Medical,Blue Cross/Blue Shield,,,,N,Y,244039.95,60528.61
Long Island,Nassau,2908000,000511,NYU Winthrop Hospital,70 or Older,115,F,Black/African American,Not Span/Hispanic,3,Emergency,Hospice - Home,2017,058,Other nutritional; endocrine; and metabolic disorders,000,NO PROC,421,"Malnutrition, failure to thrive & other nutritional disorders",10,"Endocrine, Nutritional and Metabolic Diseases and Disorders",3,Major,Major,Medical,Medicare,Medicare,Private Health Insurance,,N,Y,33348.75,7069.04
Long Island,Nassau,2908000,000511,NYU Winthrop Hospital,70 or Older,OOS,F,White,Not Span/Hispanic,2,Emergency,Skilled Nursing Home,2017,058,Other nutritional; endocrine; and metabolic disorders,071,GASTROSTOMY; TEMP/PERM,421,"Malnutrition, failure to thrive & other nutritional disorders",10,"Endocrine, Nutritional and Metabolic Diseases and Disorders",3,Major,Major,Medical,Medicare,Medicare,,,N,Y,23606.36,5034.97
Long Island,Nassau,2908000,000511,NYU Winthrop Hospital,70 or Older,115,F,Black/African American,Not Span/Hispanic,3,Emergency,Home w/ Home Health Services,2017,058,Other nutritional; endocrine; and metabolic disorders,000,NO PROC,421,"Malnutrition, failure to thrive & other nutritional disorders",10,"Endocrine, Nutritional and Metabolic Diseases and Disorders",3,Major,Major,Medical,Medicare,Medicare,,,N,Y,22364.35,5353.00
Long Island,Nassau,2908000,000511,NYU Winthrop Hospital,70 or Older,110,M,White,Unknown,13,Emergency,Home or Self Care,2017,052,Nutritional deficiencies,193,DX ULTRASOUND HEART,421,"Malnutrition, failure to thrive & other nutritional disorders",10,"Endocrine, Nutritional and Metabolic Diseases and Disorders",3,Major,Major,Medical,Medicare,Medicare,Blue Cross/Blue Shield,,N,Y,166155.96,27777.61
Long Island,Nassau,2908000,000511,NYU Winthrop Hospital,70 or Older,115,M,White,Not Span/Hispanic,2,Emergency,Skilled Nursing Home,2017,058,Other nutritional; endocrine; and metabolic disorders,000,NO PROC,421,"Malnutrition, failure to thrive & other nutritional disorders",10,"Endocrine, Nutritional and Metabolic Diseases and Disorders",2,Moderate,Moderate,Medical,Medicare,Medicare,,,N,Y,29158.75,5482.27
Long Island,Nassau,2908000,000511,NYU Winthrop Hospital,70 or Older,115,M,Black/African American,Not Span/Hispanic,6,Emergency,Home w/ Home Health Services,2017,058,Other nutritional; endocrine; and metabolic disorders,222,BLOOD TRANSFUSION,421,"Malnutrition, failure to thrive & other nutritional disorders",10,"Endocrine, Nutritional and Metabolic Diseases and Disorders",4,Extreme,Major,Medical,Medicare,Medicare,,,N,Y,49026.16,11914.09
Long Island,Nassau,2908000,000511,NYU Winthrop Hospital,0 to 17,115,M,Black/African American,Not Span/Hispanic,6,Elective,Home w/ Home Health Services,2017,058,Other nutritional; endocrine; and metabolic disorders,000,NO PROC,421,"Malnutrition, failure to thrive & other nutritional disorders",10,"Endocrine, Nutritional and Metabolic Diseases and Disorders",1,Minor,Minor,Medical,Medicaid,Medicaid,,,N,N,24149.08,6518.27
Long Island,Nassau,2908000,000511,NYU Winthrop Hospital,70 or Older,115,F,Black/African American,Not Span/Hispanic,5,Emergency,Hospice - Home,2017,058,Other nutritional; endocrine; and metabolic disorders,000,NO PROC,421,"Malnutrition, failure to thrive & other nutritional disorders",10,"Endocrine, Nutritional and Metabolic Diseases and Disorders",3,Major,Major,Medical,Medicare,Medicare,Blue Cross/Blue Shield,,N,Y,45311.54,9883.29
Long Island,Nassau,2908000,000511,NYU Winthrop Hospital,70 or Older,115,M,White,Not Span/Hispanic,13,Emergency,Skilled Nursing Home,2017,058,Other nutritional; endocrine; and metabolic disorders,000,NO PROC,421,"Malnutrition, failure to thrive & other nutritional disorders",10,"Endocrine, Nutritional and Metabolic Diseases and Disorders",4,Extreme,Major,Medical,Medicare,Medicare,Private Health Insurance,,N,Y,78399.97,18362.83
Long Island,Nassau,2908000,000511,NYU Winthrop Hospital,70 or Older,115,M,White,Not Span/Hispanic,4,Emergency,Home w/ Home Health Services,2017,058,Other nutritional; endocrine; and metabolic disorders,000,NO PROC,421,"Malnutrition, failure to thrive & other nutritional disorders",10,"Endocrine, Nutritional and Metabolic Diseases and Disorders",3,Major,Major,Medical,Medicare,Medicare,,,N,Y,81426.68,11698.78
Long Island,Nassau,2908000,000511,NYU Winthrop Hospital,70 or Older,115,F,White,Not Span/Hispanic,17,Emergency,Hospice - Medical Facility,2017,058,Other nutritional; endocrine; and metabolic disorders,071,GASTROSTOMY; TEMP/PERM,421,"Malnutrition, failure to thrive & other nutritional disorders",10,"Endocrine, Nutritional and Metabolic Diseases and Disorders",4,Extreme,Extreme,Medical,Medicare,Medicare,,,N,Y,154707.32,30954.24
Long Island,Nassau,2908000,000511,NYU Winthrop Hospital,70 or Older,115,F,White,Not Span/Hispanic,13,Emergency,Home w/ Home Health Services,2017,058,Other nutritional; endocrine; and metabolic disorders,000,NO PROC,421,"Malnutrition, failure to thrive & other nutritional disorders",10,"Endocrine, Nutritional and Metabolic Diseases and Disorders",3,Major,Major,Medical,Medicare,Medicare,Medicaid,,N,Y,154802.57,41763.15
Long Island,Nassau,2908000,000511,NYU Winthrop Hospital,70 or Older,110,F,White,Not Span/Hispanic,8,Emergency,Home w/ Home Health Services,2017,058,Other nutritional; endocrine; and metabolic disorders,000,NO PROC,421,"Malnutrition, failure to thrive & other nutritional disorders",10,"Endocrine, Nutritional and Metabolic Diseases and Disorders",4,Extreme,Major,Medical,Medicare,Medicare,Blue Cross/Blue Shield,,N,Y,53611.17,12229.17
Long Island,Nassau,2908000,000511,NYU Winthrop Hospital,50 to 69,OOS,M,White,Not Span/Hispanic,5,Emergency,Inpatient Rehabilitation Facility,2017,058,Other nutritional; endocrine; and metabolic disorders,222,BLOOD TRANSFUSION,421,"Malnutrition, failure to thrive & other nutritional disorders",10,"Endocrine, Nutritional and Metabolic Diseases and Disorders",3,Major,Moderate,Medical,Private Health Insurance,,,,N,Y,47430.14,9960.04
Long Island,Nassau,2908000,000511,NYU Winthrop Hospital,50 to 69,117,F,White,Not Span/Hispanic,9,Elective,Home w/ Home Health Services,2017,058,Other nutritional; endocrine; and metabolic disorders,000,NO PROC,421,"Malnutrition, failure to thrive & other nutritional disorders",10,"Endocrine, Nutritional and Metabolic Diseases and Disorders",3,Major,Major,Medical,Medicare,Medicare,Blue Cross/Blue Shield,,N,N,87008.14,13408.55
Long Island,Nassau,2908000,000511,NYU Winthrop Hospital,0 to 17,115,M,White,Spanish/Hispanic,14,Emergency,Home or Self Care,2017,224,Other perinatal conditions,004,DIAGNOSTIC SPINAL TAP,421,"Malnutrition, failure to thrive & other nutritional disorders",10,"Endocrine, Nutritional and Metabolic Diseases and Disorders",2,Moderate,Minor,Medical,Medicaid,Medicaid,,02900,N,Y,108925.89,22870.34
Long Island,Nassau,2908000,000511,NYU Winthrop Hospital,70 or Older,115,M,Black/African American,Not Span/Hispanic,4,Emergency,Home or Self Care,2017,058,Other nutritional; endocrine; and metabolic disorders,070,UP GASTRO ENDOSC/BIOPSY,421,"Malnutrition, failure to thrive & other nutritional disorders",10,"Endocrine, Nutritional and Metabolic Diseases and Disorders",3,Major,Moderate,Medical,Medicare,Medicare,Blue Cross/Blue Shield,,N,Y,83880.78,17793.09
Long Island,Nassau,2908000,000511,NYU Winthrop Hospital,70 or Older,113,F,White,Not Span/Hispanic,7,Emergency,Home w/ Home Health Services,2017,058,Other nutritional; endocrine; and metabolic disorders,070,UP GASTRO ENDOSC/BIOPSY,421,"Malnutrition, failure to thrive & other nutritional disorders",10,"Endocrine, Nutritional and Metabolic Diseases and Disorders",3,Major,Major,Medical,Medicare,Medicare,,,N,Y,71018.23,14553.31
Long Island,Nassau,2908000,000511,NYU Winthrop Hospital,0 to 17,115,F,Other Race,Not Span/Hispanic,4,Emergency,Home or Self Care,2017,224,Other perinatal conditions,000,NO PROC,421,"Malnutrition, failure to thrive & other nutritional disorders",10,"Endocrine, Nutritional and Metabolic Diseases and Disorders",2,Moderate,Minor,Medical,Blue Cross/Blue Shield,,,03500,N,Y,26472.00,6336.60
Long Island,Nassau,2908000,000511,NYU Winthrop Hospital,70 or Older,117,M,White,Not Span/Hispanic,7,Emergency,Skilled Nursing Home,2017,058,Other nutritional; endocrine; and metabolic disorders,199,ELECTROENCEPHALOGRAM,421,"Malnutrition, failure to thrive & other nutritional disorders",10,"Endocrine, Nutritional and Metabolic Diseases and Disorders",3,Major,Major,Medical,Medicare,Medicare,Private Health Insurance,,N,Y,63226.50,12571.45
Long Island,Nassau,2908000,000511,NYU Winthrop Hospital,70 or Older,115,F,Black/African American,Not Span/Hispanic,6,Emergency,Hospice - Home,2017,058,Other nutritional; endocrine; and metabolic disorders,000,NO PROC,421,"Malnutrition, failure to thrive & other nutritional disorders",10,"Endocrine, Nutritional and Metabolic Diseases and Disorders",2,Moderate,Moderate,Medical,Medicaid,Medicaid,,,N,Y,33880.77,8706.94
Long Island,Nassau,2908000,000511,NYU Winthrop Hospital,70 or Older,115,M,White,Not Span/Hispanic,5,Emergency,Skilled Nursing Home,2017,058,Other nutritional; endocrine; and metabolic disorders,000,NO PROC,421,"Malnutrition, failure to thrive & other nutritional disorders",10,"Endocrine, Nutritional and Metabolic Diseases and Disorders",3,Major,Major,Medical,Medicare,Medicare,Private Health Insurance,,N,Y,43070.27,8629.81
Long Island,Nassau,2908000,000511,NYU Winthrop Hospital,0 to 17,115,F,Other Race,Spanish/Hispanic,94,Urgent,Skilled Nursing Home,2017,058,Other nutritional; endocrine; and metabolic disorders,223,ENTERAL/PARENTERAL NUTR,421,"Malnutrition, failure to thrive & other nutritional disorders",10,"Endocrine, Nutritional and Metabolic Diseases and Disorders",4,Extreme,Major,Medical,Medicaid,,,,N,N,527434.08,122418.13
Long Island,Nassau,2908000,000511,NYU Winthrop Hospital,70 or Older,117,F,White,Not Span/Hispanic,14,Emergency,Hospice - Home,2017,058,Other nutritional; endocrine; and metabolic disorders,000,NO PROC,421,"Malnutrition, failure to thrive & other nutritional disorders",10,"Endocrine, Nutritional and Metabolic Diseases and Disorders",3,Major,Major,Medical,Medicare,Medicare,Private Health Insurance,,N,Y,71265.32,18054.88
Long Island,Nassau,2908000,000511,NYU Winthrop Hospital,50 to 69,110,F,White,Not Span/Hispanic,4,Emergency,Skilled Nursing Home,2017,058,Other nutritional; endocrine; and metabolic disorders,000,NO PROC,421,"Malnutrition, failure to thrive & other nutritional disorders",10,"Endocrine, Nutritional and Metabolic Diseases and Disorders",3,Major,Extreme,Medical,Medicare,Medicare,Blue Cross/Blue Shield,,N,Y,60534.43,9282.83
Long Island,Nassau,2908000,000511,NYU Winthrop Hospital,0 to 17,115,F,Black/African American,Not Span/Hispanic,5,Emergency,Home or Self Care,2017,058,Other nutritional; endocrine; and metabolic disorders,000,NO PROC,421,"Malnutrition, failure to thrive & other nutritional disorders",10,"Endocrine, Nutritional and Metabolic Diseases and Disorders",2,Moderate,Minor,Medical,Blue Cross/Blue Shield,Self-Pay,,,N,Y,51897.64,10789.67
Long Island,Nassau,2908000,000511,NYU Winthrop Hospital,70 or Older,OOS,F,White,Not Span/Hispanic,2,Emergency,Skilled Nursing Home,2017,058,Other nutritional; endocrine; and metabolic disorders,071,GASTROSTOMY; TEMP/PERM,421,"Malnutrition, failure to thrive & other nutritional disorders",10,"Endocrine, Nutritional and Metabolic Diseases and Disorders",3,Major,Major,Medical,Medicare,Medicare,,,N,Y,34749.25,6586.42
Long Island,Nassau,2908000,000511,NYU Winthrop Hospital,0 to 17,115,F,Other Race,Spanish/Hispanic,20,Emergency,Short-term Hospital,2017,058,Other nutritional; endocrine; and metabolic disorders,216,RESP INTUB/MECH VENTIL,421,"Malnutrition, failure to thrive & other nutritional disorders",10,"Endocrine, Nutritional and Metabolic Diseases and Disorders",3,Major,Moderate,Medical,Medicaid,Medicaid,,,N,Y,182390.86,42620.70
